FailedOk

th/SRPMS[OK]
th/x32[OK]
th/i686[OK]
th/x86_64[OK]

ac/SRPMS[OK]
ac/i386[OK]
ac/i586[OK]
ac/i686[OK]
ac/alpha[OK]
ac/amd64[OK]
ac/athlon[OK]
ac/ppc[OK]
ac/sparc[OK]
ac/sparc64[OK]

Advanced Search
main()
Powered by PLD Linux
(c) 2002-2019 PLD Team
$Revision: 1.37 $
Powered by BOFH.
Your IP: 54.145.38.157

kernel 5047cb00-e31c-43db-8b04-fef31bba7fee

Status:Failed
Source URL:ftp://buildlogs.pld-linux.org/th/x86_64/FAIL/kernel,5047cb00-e31c-43db-8b04-fef31bba7fee.bz2
text/plain URL:View!
full text:View!
rpm -qa of builder:View!
Date:2018/12/27 01:18:59
Runtime:0:00:47.905649

Toc:

  • error 1
  • make[5]: *** [/tmp/B.7kAiAw/BUILD/kernel-4.19.12/linux-4.19/scripts/Makefile.build:516: arch/x86/crypto/sha512-mb/sha512-mb.o] Error 1
  • error 2
  • make[4]: *** [/tmp/B.7kAiAw/BUILD/kernel-4.19.12/linux-4.19/scripts/Makefile.build:544: arch/x86/crypto/sha512-mb] Error 2
  • error 3
  • make[3]: *** [/tmp/B.7kAiAw/BUILD/kernel-4.19.12/linux-4.19/scripts/Makefile.build:544: arch/x86/crypto] Error 2
  • error 4
  • make[2]: *** [/tmp/B.7kAiAw/BUILD/kernel-4.19.12/linux-4.19/Makefile:1052: arch/x86] Error 2
  • error 5
  • make[1]: *** [Makefile:146: sub-make] Error 2
  • error 6
  • error: Bad exit status from /tmp/B.7kAiAw/BUILD/tmp/rpm-tmp.28171 (%build)
  • error 7
  • RPM build errors:
  • error 8
  • error: No files produced.

Content:

  LD       /tmp/B.7kAiAw/BUILD/kernel-4.19.12/x86_64-gcc-8.2.0/tools/objtool/objtool-in.o
  LINK     /tmp/B.7kAiAw/BUILD/kernel-4.19.12/x86_64-gcc-8.2.0/tools/objtool/objtool
  HOSTCC  scripts/genksyms/genksyms.o
  YACC    scripts/genksyms/parse.tab.c
  HOSTCC  scripts/genksyms/parse.tab.o
  LEX     scripts/genksyms/lex.lex.c
  YACC    scripts/genksyms/parse.tab.h
  HOSTCC  scripts/genksyms/lex.lex.o
  HOSTLD  scripts/genksyms/genksyms
  CC      scripts/mod/empty.o
  HOSTCC  scripts/mod/mk_elfconfig
  MKELF   scripts/mod/elfconfig.h
  HOSTCC  scripts/mod/modpost.o
  CC      scripts/mod/devicetable-offsets.s
  UPD     scripts/mod/devicetable-offsets.h
  HOSTCC  scripts/mod/file2alias.o
  HOSTCC  scripts/mod/sumversion.o
  HOSTLD  scripts/mod/modpost
  HOSTCC  scripts/selinux/genheaders/genheaders
  HOSTCC  scripts/selinux/mdp/mdp
  HOSTCC  scripts/bin2c
  HOSTCC  scripts/kallsyms
  HOSTCC  scripts/conmakehash
  HOSTCC  scripts/recordmcount
  HOSTCC  scripts/sortextable
  HOSTCC  scripts/asn1_compiler
  HOSTCC  scripts/extract-cert
  HOSTCC  scripts/insert-sys-cert
  CHK     include/generated/compile.h
  UPD     include/generated/compile.h
  CC      init/main.o
objdump: init/.tmp_main.o: unable to initialize decompress status for section .debug_addr
objdump: init/.tmp_main.o: unable to initialize decompress status for section .debug_addr
objdump: init/.tmp_main.o: file format not recognized
  CC      init/version.o
  CC      init/do_mounts.o
objdump: init/.tmp_do_mounts.o: unable to initialize decompress status for section .debug_addr
objdump: init/.tmp_do_mounts.o: unable to initialize decompress status for section .debug_addr
objdump: init/.tmp_do_mounts.o: file format not recognized
  CC      init/do_mounts_rd.o
objdump: init/.tmp_do_mounts_rd.o: unable to initialize decompress status for section .debug_addr
objdump: init/.tmp_do_mounts_rd.o: unable to initialize decompress status for section .debug_addr
objdump: init/.tmp_do_mounts_rd.o: file format not recognized
  CC      init/do_mounts_initrd.o
objdump: init/.tmp_do_mounts_initrd.o: unable to initialize decompress status for section .debug_addr
objdump: init/.tmp_do_mounts_initrd.o: unable to initialize decompress status for section .debug_addr
objdump: init/.tmp_do_mounts_initrd.o: file format not recognized
  CC      init/initramfs.o
objdump: init/.tmp_initramfs.o: unable to initialize decompress status for section .debug_addr
objdump: init/.tmp_initramfs.o: unable to initialize decompress status for section .debug_addr
objdump: init/.tmp_initramfs.o: file format not recognized
  CC      init/calibrate.o
objdump: init/.tmp_calibrate.o: unable to initialize decompress status for section .debug_addr
objdump: init/.tmp_calibrate.o: unable to initialize decompress status for section .debug_addr
objdump: init/.tmp_calibrate.o: file format not recognized
  CC      init/init_task.o
  AR      init/built-in.a
  HOSTCC  usr/gen_init_cpio
  GEN     usr/initramfs_data.cpio
  AS      usr/initramfs_data.o
  AR      usr/built-in.a
  CC [M]  arch/x86/crypto/sha1-mb/sha1_mb.o
  AS [M]  arch/x86/crypto/sha1-mb/sha1_mb_mgr_flush_avx2.o
  CC [M]  arch/x86/crypto/sha1-mb/sha1_mb_mgr_init_avx2.o
  AS [M]  arch/x86/crypto/sha1-mb/sha1_mb_mgr_submit_avx2.o
  AS [M]  arch/x86/crypto/sha1-mb/sha1_x8_avx2.o
  LD [M]  arch/x86/crypto/sha1-mb/sha1-mb.o
  CC [M]  arch/x86/crypto/sha256-mb/sha256_mb.o
  AS [M]  arch/x86/crypto/sha256-mb/sha256_mb_mgr_flush_avx2.o
  CC [M]  arch/x86/crypto/sha256-mb/sha256_mb_mgr_init_avx2.o
  AS [M]  arch/x86/crypto/sha256-mb/sha256_mb_mgr_submit_avx2.o
  AS [M]  arch/x86/crypto/sha256-mb/sha256_x8_avx2.o
  LD [M]  arch/x86/crypto/sha256-mb/sha256-mb.o
  CC [M]  arch/x86/crypto/sha512-mb/sha512_mb.o
objdump: arch/x86/crypto/sha512-mb/.tmp_sha512_mb.o: unable to initialize decompress status for section .debug_addr
objdump: arch/x86/crypto/sha512-mb/.tmp_sha512_mb.o: unable to initialize decompress status for section .debug_addr
objdump: arch/x86/crypto/sha512-mb/.tmp_sha512_mb.o: file format not recognized
  AS [M]  arch/x86/crypto/sha512-mb/sha512_mb_mgr_flush_avx2.o
objdump: arch/x86/crypto/sha512-mb/.tmp_sha512_mb_mgr_flush_avx2.o: unable to initialize decompress status for section .debug_line
objdump: arch/x86/crypto/sha512-mb/.tmp_sha512_mb_mgr_flush_avx2.o: unable to initialize decompress status for section .debug_line
objdump: arch/x86/crypto/sha512-mb/.tmp_sha512_mb_mgr_flush_avx2.o: file format not recognized
  CC [M]  arch/x86/crypto/sha512-mb/sha512_mb_mgr_init_avx2.o
objdump: arch/x86/crypto/sha512-mb/.tmp_sha512_mb_mgr_init_avx2.o: unable to initialize decompress status for section .debug_gnu_pubtypes
objdump: arch/x86/crypto/sha512-mb/.tmp_sha512_mb_mgr_init_avx2.o: unable to initialize decompress status for section .debug_gnu_pubtypes
objdump: arch/x86/crypto/sha512-mb/.tmp_sha512_mb_mgr_init_avx2.o: file format not recognized
  AS [M]  arch/x86/crypto/sha512-mb/sha512_mb_mgr_submit_avx2.o
objdump: arch/x86/crypto/sha512-mb/.tmp_sha512_mb_mgr_submit_avx2.o: unable to initialize decompress status for section .debug_str
objdump: arch/x86/crypto/sha512-mb/.tmp_sha512_mb_mgr_submit_avx2.o: unable to initialize decompress status for section .debug_str
objdump: arch/x86/crypto/sha512-mb/.tmp_sha512_mb_mgr_submit_avx2.o: file format not recognized
  AS [M]  arch/x86/crypto/sha512-mb/sha512_x4_avx2.o
objdump: arch/x86/crypto/sha512-mb/.tmp_sha512_x4_avx2.o: unable to initialize decompress status for section .debug_line
objdump: arch/x86/crypto/sha512-mb/.tmp_sha512_x4_avx2.o: unable to initialize decompress status for section .debug_line
objdump: arch/x86/crypto/sha512-mb/.tmp_sha512_x4_avx2.o: file format not recognized
  LD [M]  arch/x86/crypto/sha512-mb/sha512-mb.o
ld: arch/x86/crypto/sha512-mb/sha512_mb.o: unable to initialize decompress status for section .debug_addr
ld: arch/x86/crypto/sha512-mb/sha512_mb.o: unable to initialize decompress status for section .debug_addr
ld: arch/x86/crypto/sha512-mb/sha512_mb.o: unable to initialize decompress status for section .debug_addr
ld: arch/x86/crypto/sha512-mb/sha512_mb.o: unable to initialize decompress status for section .debug_addr
arch/x86/crypto/sha512-mb/sha512_mb.o: file not recognized: file format not recognized
make[5]: *** [/tmp/B.7kAiAw/BUILD/kernel-4.19.12/linux-4.19/scripts/Makefile.build:516: arch/x86/crypto/sha512-mb/sha512-mb.o] Error 1
make[4]: *** [/tmp/B.7kAiAw/BUILD/kernel-4.19.12/linux-4.19/scripts/Makefile.build:544: arch/x86/crypto/sha512-mb] Error 2
make[3]: *** [/tmp/B.7kAiAw/BUILD/kernel-4.19.12/linux-4.19/scripts/Makefile.build:544: arch/x86/crypto] Error 2
make[2]: *** [/tmp/B.7kAiAw/BUILD/kernel-4.19.12/linux-4.19/Makefile:1052: arch/x86] Error 2
make[2]: Leaving directory '/tmp/B.7kAiAw/BUILD/kernel-4.19.12/x86_64-gcc-8.2.0'
make[1]: *** [Makefile:146: sub-make] Error 2
make[1]: Leaving directory '/tmp/B.7kAiAw/BUILD/kernel-4.19.12/linux-4.19'
make: *** [Makefile:9: all] Error 2
error: Bad exit status from /tmp/B.7kAiAw/BUILD/tmp/rpm-tmp.28171 (%build)


RPM build errors:
    Bad exit status from /tmp/B.7kAiAw/BUILD/tmp/rpm-tmp.28171 (%build)
ended at: Thu Dec 27 01:18:55 2018, done in 0:00:47.905649
error: No files produced.
+ chmod -R u+rwX /tmp/B.7kAiAw/BUILD
+ rm -rf /tmp/B.7kAiAw/tmp /tmp/B.7kAiAw/BUILD
+ rm -rf /tmp/B.7kAiAw
Begin-PLD-Builder-Info
Build-Time: user:34.33s sys:11.97s real:72.58s (faults io:0 non-io:1591840)

End-PLD-Builder-Info
[Back to list of logs] [View rpm -qa of builder]