FailedOk

th/SRPMS[OK]
th/x32[OK]
th/i686[OK]
th/x86_64[OK]

ac/SRPMS[OK]
ac/i386[OK]
ac/i586[OK]
ac/i686[OK]
ac/alpha[OK]
ac/amd64[OK]
ac/athlon[OK]
ac/ppc[OK]
ac/sparc[OK]
ac/sparc64[OK]

Advanced Search
main()
Powered by PLD Linux
(c) 2002-2019 PLD Team
$Revision: 1.37 $
Powered by Joe.
Your IP: 3.84.243.246

kernel 70db34df-a574-4dcf-bd5a-003109049893

Status:Failed
Source URL:ftp://buildlogs.pld-linux.org/th/x86_64/FAIL/kernel,70db34df-a574-4dcf-bd5a-003109049893.bz2
text/plain URL:View!
rpm -qa of builder:View!
Date:2019/02/09 18:05:59
Runtime:0:00:25.318484

Toc:

  • prep
  • Executing(%prep): /bin/sh -e /tmp/B.3VOfkn/BUILD/tmp/rpm-tmp.40541
  • build
  • Executing(%build): /bin/sh -e /tmp/B.3VOfkn/BUILD/tmp/rpm-tmp.12718
  • error 1
  • /tmp/B.3VOfkn/BUILD/kernel-4.14-4.14.98/linux-4.14/security/selinux/include/classmap.h:245:2: error: #error New address family defined, please update secclass_map.
  • error 2
  • make[5]: *** [scripts/Makefile.host:102: scripts/selinux/genheaders/genheaders] Error 1
  • error 3
  • make[4]: *** [/tmp/B.3VOfkn/BUILD/kernel-4.14-4.14.98/linux-4.14/scripts/Makefile.build:585: scripts/selinux/genheaders] Error 2
  • error 4
  • make[3]: *** [/tmp/B.3VOfkn/BUILD/kernel-4.14-4.14.98/linux-4.14/scripts/Makefile.build:585: scripts/selinux] Error 2
  • error 5
  • make[2]: *** [/tmp/B.3VOfkn/BUILD/kernel-4.14-4.14.98/linux-4.14/Makefile:572: scripts] Error 2
  • error 6
  • make[1]: *** [Makefile:146: sub-make] Error 2
  • error 7
  • error: Bad exit status from /tmp/B.3VOfkn/BUILD/tmp/rpm-tmp.12718 (%build)
  • error 8
  • RPM build errors:
  • error 9
  • error: No files produced.

Content:

request from: baggins
checking if we should skip the build
started at: Sat Feb  9 18:04:56 2019
killing old processes on a builder
sending signal 9 to pid -1
Killed
cleaning up /tmp
fetching https://srcbuilder.pld-linux.org/th//srpms/70db34df-a574-4dcf-bd5a-003109049893/kernel-4.14-4.14.98-1.src.rpm
fetched 104000504 bytes, 3199.6 K/s
installing srpm: kernel-4.14-4.14.98-1.src.rpm
+ install -d /tmp/B.3VOfkn/BUILD /tmp/B.3VOfkn/RPMS
+ LC_ALL=en_US.UTF-8
+ rpm -qp --changelog kernel-4.14-4.14.98-1.src.rpm
* Sat Feb 09 2019 PLD Linux Team <feedback@pld-linux.org>
- For complete changelog see: http://git.pld-linux.org/?p=packages/kernel-4.14.git;a=log;h=LINUX_4_14
* Sat Feb 09 2019 Jan Rękorajski <baggins@pld-linux.org> c8676501 - 4.14.98 * Mon Jan 28 2019 Jan Rękorajski <baggins@pld-linux.org> e22b18fe - 4.14.96 * Sun Jan 20 2019 Jan Rękorajski <baggins@pld-linux.org> f55793f0 - 4.14.94 * Mon Jan 14 2019 Jan Rękorajski <baggins@pld-linux.org> 4f9d8bd2 - 4.14.93 * Sat Jan 12 2019 Jan Rękorajski <baggins@pld-linux.org> 5e444419 - 4.14.92 * Sat Dec 29 2018 Arkadiusz Miśkiewicz <arekm@maven.pl> 51728af0 - up to 4.14.91 * Sat Dec 29 2018 Arkadiusz Miśkiewicz <arekm@maven.pl> fa952528 - rel 2; fix raid10 lockup on resync/raid check * Wed Dec 26 2018 Jan Rękorajski <baggins@pld-linux.org> 2f387722 - 4.14.90 * Thu Dec 13 2018 Jan Rękorajski <baggins@pld-linux.org> 00774a26 - 4.14.88 * Sat Dec 08 2018 Jan Rękorajski <baggins@pld-linux.org> a367b4d3 - 4.14.87 * Sat Dec 08 2018 Jan Rękorajski <baggins@pld-linux.org> 1c0941d0 - 4.14.86 * Mon Dec 03 2018 Arkadiusz Miśkiewicz <arekm@maven.pl> 2f196652 - up to 4.14.85 * Wed Nov 28 2018 Jan Rękorajski <baggins@pld-linux.org> 689e0fc0 - 4.14.84 * Fri Nov 23 2018 Jan Rękorajski <baggins@pld-linux.org> d065e1cd - 4.14.83 * Wed Nov 21 2018 Jan Rękorajski <baggins@pld-linux.org> c73dab19 - 4.14.82 * Wed Nov 14 2018 Jacek Konieczny <jajcus@jajcus.net> e1e8d8cb - i915_crash.patch added * Wed Nov 14 2018 Jacek Konieczny <jajcus@jajcus.net> 5dd41b01 - rt patch updated to 4.14.78-rt47 * Tue Nov 13 2018 Jan Rękorajski <baggins@pld-linux.org> 86daa41e - 4.14.81 * Sun Nov 11 2018 Jan Rękorajski <baggins@pld-linux.org> 8593988c - 4.14.80 * Sun Nov 04 2018 Jan Rękorajski <baggins@pld-linux.org> 539dfaec - 4.14.79 + rpm -Uhv --nodeps --define '_topdir /tmp/B.3VOfkn' --define '_specdir %{_topdir}' --define '_sourcedir %{_specdir}' --define '_rpmdir %{_topdir}/RPMS' --define '_builddir %{_topdir}/BUILD' kernel-4.14-4.14.98-1.src.rpm Preparing... ################################################## kernel-4.14 ################################################## + rm -f kernel-4.14-4.14.98-1.src.rpm + install -m 700 -d /tmp/B.3VOfkn/BUILD/tmp + TMPDIR=/tmp/B.3VOfkn/BUILD/tmp + exec nice -n 0 rpmbuild -bp --short-circuit --nodeps --define '_topdir /tmp/B.3VOfkn' --define '_specdir %{_topdir}' --define '_sourcedir %{_specdir}' --define '_rpmdir %{_topdir}/RPMS' --define '_builddir %{_topdir}/BUILD' --target x86_64-pld-linux --define 'prep exit 0' /tmp/B.3VOfkn/kernel.spec Building target platforms: x86_64-pld-linux checking BuildConflict-ing packages no BuildConflicts found checking BR rpm: Building target platforms: x86_64-pld-linux no BR needed building RPM using: set -ex; : build-id: 70db34df-a574-4dcf-bd5a-003109049893; TMPDIR=/tmp/B.3VOfkn/BUILD/tmp exec nice -n 0 rpmbuild -bb --define '_smp_mflags -j9' --define '_make_opts -Otarget' --define '_pld_builder 1' --define '_topdir /tmp/B.3VOfkn' --define '_specdir %{_topdir}' --define '_sourcedir %{_specdir}' --define '_rpmdir %{_topdir}/RPMS' --define '_builddir %{_topdir}/BUILD' --target x86_64-pld-linux /tmp/B.3VOfkn/kernel.spec + : build-id: 70db34df-a574-4dcf-bd5a-003109049893 + TMPDIR=/tmp/B.3VOfkn/BUILD/tmp + exec nice -n 0 rpmbuild -bb --define '_smp_mflags -j9' --define '_make_opts -Otarget' --define '_pld_builder 1' --define '_topdir /tmp/B.3VOfkn' --define '_specdir %{_topdir}' --define '_sourcedir %{_specdir}' --define '_rpmdir %{_topdir}/RPMS' --define '_builddir %{_topdir}/BUILD' --target x86_64-pld-linux /tmp/B.3VOfkn/kernel.spec Building target platforms: x86_64-pld-linux Executing(%prep): /bin/sh -e /tmp/B.3VOfkn/BUILD/tmp/rpm-tmp.40541 + umask 022 + cd /tmp/B.3VOfkn/BUILD + cd /tmp/B.3VOfkn/BUILD + rm -rf kernel-4.14-4.14.98 + /bin/mkdir -p kernel-4.14-4.14.98 + cd kernel-4.14-4.14.98 + /usr/bin/xz -dc /tmp/B.3VOfkn/linux-4.14.tar.xz + /bin/tar -xf - + STATUS=0 + '[' 0 -ne 0 ']' + /bin/id -u + '[' 1000 '=' 0 ']' + /bin/id -u + '[' 1000 '=' 0 ']' + /bin/chmod -Rf a+rX,u+w,g-w,o-w . + ln -s /tmp/B.3VOfkn/kernel-module-build.pl kernel-module-build.pl + ln -s /tmp/B.3VOfkn/kernel.make Makefile + cd linux-4.14 + echo 'Patch #0 (patch-4.14.98.xz):' Patch #0 (patch-4.14.98.xz): + '[' -f /tmp/B.3VOfkn/patch-4.14.98.xz ']' + /usr/bin/xz -dc /tmp/B.3VOfkn/patch-4.14.98.xz + /usr/bin/patch -s -p1 + echo 'Patch #2 (i915_crash.patch):' Patch #2 (i915_crash.patch): + '[' -f /tmp/B.3VOfkn/i915_crash.patch ']' + /bin/cat /tmp/B.3VOfkn/i915_crash.patch + /usr/bin/patch -s -p1 + echo 'Patch #6 (linux-wistron-nx.patch):' Patch #6 (linux-wistron-nx.patch): + '[' -f /tmp/B.3VOfkn/linux-wistron-nx.patch ']' + /bin/cat /tmp/B.3VOfkn/linux-wistron-nx.patch + /usr/bin/patch -s -p1 + echo 'Patch #10 (kernel-pom-ng-IPV4OPTSSTRIP.patch):' Patch #10 (kernel-pom-ng-IPV4OPTSSTRIP.patch): + '[' -f /tmp/B.3VOfkn/kernel-pom-ng-IPV4OPTSSTRIP.patch ']' + /bin/cat /tmp/B.3VOfkn/kernel-pom-ng-IPV4OPTSSTRIP.patch + /usr/bin/patch -s -p1 + echo 'Patch #40 (kernel-layer7.patch):' Patch #40 (kernel-layer7.patch): + '[' -f /tmp/B.3VOfkn/kernel-layer7.patch ']' + /bin/cat /tmp/B.3VOfkn/kernel-layer7.patch + /usr/bin/patch -s -p1 + echo 'Patch #55 (kernel-atm-vbr.patch):' Patch #55 (kernel-atm-vbr.patch): + '[' -f /tmp/B.3VOfkn/kernel-atm-vbr.patch ']' + /bin/cat /tmp/B.3VOfkn/kernel-atm-vbr.patch + /usr/bin/patch -s -p1 + echo 'Patch #56 (kernel-atmdd.patch):' Patch #56 (kernel-atmdd.patch): + '[' -f /tmp/B.3VOfkn/kernel-atmdd.patch ']' + /bin/cat /tmp/B.3VOfkn/kernel-atmdd.patch + /usr/bin/patch -s -p1 + echo 'Patch #59 (kernel-rndis_host-wm5.patch):' Patch #59 (kernel-rndis_host-wm5.patch): + '[' -f /tmp/B.3VOfkn/kernel-rndis_host-wm5.patch ']' + /bin/cat /tmp/B.3VOfkn/kernel-rndis_host-wm5.patch + /usr/bin/patch -s -p1 + echo 'Patch #85 (kernel-hostap.patch):' Patch #85 (kernel-hostap.patch): + '[' -f /tmp/B.3VOfkn/kernel-hostap.patch ']' + /bin/cat /tmp/B.3VOfkn/kernel-hostap.patch + /usr/bin/patch -s -p1 + echo 'Patch #145 (kernel-aufs4.patch):' Patch #145 (kernel-aufs4.patch): + '[' -f /tmp/B.3VOfkn/kernel-aufs4.patch ']' + /bin/cat /tmp/B.3VOfkn/kernel-aufs4.patch + /usr/bin/patch -s -p1 + echo 'Patch #5001 (0012-apparmor-add-base-infastructure-for-socket-mediation.patch):' Patch #5001 (0012-apparmor-add-base-infastructure-for-socket-mediation.patch): + '[' -f /tmp/B.3VOfkn/0012-apparmor-add-base-infastructure-for-socket-mediation.patch ']' + /bin/cat /tmp/B.3VOfkn/0012-apparmor-add-base-infastructure-for-socket-mediation.patch + /usr/bin/patch -s -p1 + echo 'Patch #5002 (0001-UBUNTU-SAUCE-apparmor-af_unix-mediation.patch):' Patch #5002 (0001-UBUNTU-SAUCE-apparmor-af_unix-mediation.patch): + '[' -f /tmp/B.3VOfkn/0001-UBUNTU-SAUCE-apparmor-af_unix-mediation.patch ']' + /bin/cat /tmp/B.3VOfkn/0001-UBUNTU-SAUCE-apparmor-af_unix-mediation.patch + /usr/bin/patch -s -p1 + echo 'Patch #250 (kernel-fix_256colors_menuconfig.patch):' Patch #250 (kernel-fix_256colors_menuconfig.patch): + '[' -f /tmp/B.3VOfkn/kernel-fix_256colors_menuconfig.patch ']' + /bin/cat /tmp/B.3VOfkn/kernel-fix_256colors_menuconfig.patch + /usr/bin/patch -s -p1 + echo 'Patch #2000 (kernel-small_fixes.patch):' Patch #2000 (kernel-small_fixes.patch): + '[' -f /tmp/B.3VOfkn/kernel-small_fixes.patch ']' + /bin/cat /tmp/B.3VOfkn/kernel-small_fixes.patch + /usr/bin/patch -s -p1 + echo 'Patch #2001 (kernel-pwc-uncompress.patch):' Patch #2001 (kernel-pwc-uncompress.patch): + '[' -f /tmp/B.3VOfkn/kernel-pwc-uncompress.patch ']' + /bin/cat /tmp/B.3VOfkn/kernel-pwc-uncompress.patch + /usr/bin/patch -s -p1 + chmod 755 tools/objtool/sync-check.sh + sed -i 's#EXTRAVERSION =.*#EXTRAVERSION = #g' Makefile + find '(' -name '*~' -o -name '*.orig' -o -name .gitignore ')' -print0 + xargs -0 -r -l512 rm -f + exit 0 Executing(%build): /bin/sh -e /tmp/B.3VOfkn/BUILD/tmp/rpm-tmp.12718 TMP=/home/users/builder/tmp HOME=/home/users/builder PATH=/home/users/builder/GNUstep/Tools:/usr/local/bin:/usr/bin:/bin:/home/users/builder/bin TMPDIR=/tmp/B.3VOfkn/BUILD/tmp + umask 022 + cd /tmp/B.3VOfkn/BUILD + cd kernel-4.14-4.14.98 + install -d /tmp/B.3VOfkn/BUILD/kernel-4.14-4.14.98/x86_64-gcc-8.2.0 + >x86_64-gcc-8.2.0.mk + <<"EOF" + cat + cd /tmp/B.3VOfkn/BUILD/kernel-4.14-4.14.98/x86_64-gcc-8.2.0 + install -d arch/x86 + >arch/x86/defconfig + BuildConfig + set -e + Config=kernel-x86.config + >&2 + echo 'Building config file for x86_64 using kernel-x86.config et al.' Building config file for x86_64 using kernel-x86.config et al. + <<-EOCONFIG + >important.config + cat + mawk -v 'arch=all x86 x86_64 x86_64' -f /tmp/B.3VOfkn/kernel-config.awk important.config /tmp/B.3VOfkn/kernel-imq.config /tmp/B.3VOfkn/kernel-patches.config /tmp/B.3VOfkn/kernel-multiarch.config /tmp/B.3VOfkn/kernel-x86.config kernel-x86.config (287): Warning: CONFIG_VIDEO_IVTV_DEPRECATED_IOCTLS already defined in: kernel-multiarch.config (3473) kernel-x86.config (317): Warning: CONFIG_PCIEASPM_DEFAULT already defined in: kernel-multiarch.config (6401) kernel-x86.config (318): Warning: CONFIG_PCIEASPM_POWERSAVE already defined in: kernel-multiarch.config (6402) kernel-x86.config (319): Warning: CONFIG_PCIEASPM_POWER_SUPERSAVE already defined in: kernel-multiarch.config (6403) kernel-x86.config (320): Warning: CONFIG_PCIEASPM_PERFORMANCE already defined in: kernel-multiarch.config (6404) kernel-x86.config (325): Warning: CONFIG_INTEL_TURBO_MAX_3 already defined in: kernel-multiarch.config (6643) kernel-x86.config (344): Warning: CONFIG_PC104 already defined in: kernel-multiarch.config (9957) kernel-x86.config (369): Warning: CONFIG_KCOV already defined in: kernel-multiarch.config (10196) kernel-x86.config (370): Warning: CONFIG_WW_MUTEX_SELFTEST already defined in: kernel-multiarch.config (10224) kernel-x86.config (402): Warning: CONFIG_SND_X86 already defined in: kernel-multiarch.config (12160) kernel-x86.config (403): Warning: CONFIG_HDMI_LPE_AUDIO already defined in: kernel-multiarch.config (12161) + ln -sf arch/x86/defconfig .config + cd - /tmp/B.3VOfkn/BUILD/kernel-4.14-4.14.98 + /usr/bin/make -Otarget -j9 'TARGETOBJ=x86_64-gcc-8.2.0' oldconfig /usr/bin/make -C /tmp/B.3VOfkn/BUILD/kernel-4.14-4.14.98/linux-4.14 O=/tmp/B.3VOfkn/BUILD/kernel-4.14-4.14.98/x86_64-gcc-8.2.0 ARCH=x86_64 CC="x86_64-pld-linux-gcc" HOSTCC="x86_64-pld-linux-gcc -D_FILE_OFFSET_BITS=64" oldconfig make[2]: Entering directory '/tmp/B.3VOfkn/BUILD/kernel-4.14-4.14.98/x86_64-gcc-8.2.0' GEN ./Makefile make[2]: Leaving directory '/tmp/B.3VOfkn/BUILD/kernel-4.14-4.14.98/x86_64-gcc-8.2.0' HOSTCC scripts/basic/fixdep SHIPPED scripts/kconfig/zconf.tab.c SHIPPED scripts/kconfig/zconf.lex.c HOSTCC scripts/kconfig/conf.o HOSTCC scripts/kconfig/zconf.tab.o HOSTLD scripts/kconfig/conf scripts/kconfig/conf --oldconfig Kconfig # # configuration written to .config # + mawk -v 'infile=/tmp/B.3VOfkn/BUILD/kernel-4.14-4.14.98/x86_64-gcc-8.2.0/arch/x86/defconfig' -f /tmp/B.3VOfkn/kernel-track-config-change.awk /tmp/B.3VOfkn/BUILD/kernel-4.14-4.14.98/x86_64-gcc-8.2.0/.config ERROR (kernel-multiarch.config): CONFIG_MODVERSIONS redefined from `n' to `y' ERROR (kernel-multiarch.config): CONFIG_CRYPTO_AEAD redefined from `m' to `y' ERROR (kernel-multiarch.config): CONFIG_CRYPTO_GF128MUL redefined from `m' to `y' ERROR (kernel-multiarch.config): CONFIG_CRYPTO_NULL redefined from `m' to `y' ERROR (kernel-multiarch.config): CONFIG_CRYPTO_GCM redefined from `m' to `y' ERROR (kernel-multiarch.config): CONFIG_CRYPTO_SEQIV redefined from `m' to `y' ERROR (kernel-multiarch.config): CONFIG_CRYPTO_CTR redefined from `m' to `y' ERROR (kernel-multiarch.config): CONFIG_CRYPTO_GHASH redefined from `m' to `y' ERROR (kernel-multiarch.config): CONFIG_CRYPTO_DRBG_MENU redefined from `m' to `y' ERROR (kernel-multiarch.config): CONFIG_CRYPTO_JITTERENTROPY redefined from `m' to `y' There were 10 errors + /usr/bin/make -Otarget -j9 'TARGETOBJ=x86_64-gcc-8.2.0' all /usr/bin/make -C /tmp/B.3VOfkn/BUILD/kernel-4.14-4.14.98/linux-4.14 O=/tmp/B.3VOfkn/BUILD/kernel-4.14-4.14.98/x86_64-gcc-8.2.0 ARCH=x86_64 CC="x86_64-pld-linux-gcc" HOSTCC="x86_64-pld-linux-gcc -D_FILE_OFFSET_BITS=64" GEN ./Makefile scripts/kconfig/conf --silentoldconfig Kconfig make[2]: Entering directory '/tmp/B.3VOfkn/BUILD/kernel-4.14-4.14.98/x86_64-gcc-8.2.0' GEN ./Makefile make[2]: Leaving directory '/tmp/B.3VOfkn/BUILD/kernel-4.14-4.14.98/x86_64-gcc-8.2.0' make[2]: Entering directory '/tmp/B.3VOfkn/BUILD/kernel-4.14-4.14.98/x86_64-gcc-8.2.0' CHK include/generated/uapi/linux/version.h UPD include/generated/uapi/linux/version.h make[2]: Leaving directory '/tmp/B.3VOfkn/BUILD/kernel-4.14-4.14.98/x86_64-gcc-8.2.0' SYSHDR arch/x86/include/generated/asm/unistd_64_x32.h SYSHDR arch/x86/include/generated/asm/unistd_32_ia32.h DESCEND objtool make[2]: Entering directory '/tmp/B.3VOfkn/BUILD/kernel-4.14-4.14.98/x86_64-gcc-8.2.0' CHK include/config/kernel.release UPD include/config/kernel.release make[2]: Leaving directory '/tmp/B.3VOfkn/BUILD/kernel-4.14-4.14.98/x86_64-gcc-8.2.0' SYSHDR arch/x86/include/generated/uapi/asm/unistd_32.h SYSHDR arch/x86/include/generated/uapi/asm/unistd_64.h HOSTCC scripts/basic/bin2c HYPERCALLS arch/x86/include/generated/asm/xen-hypercalls.h SYSHDR arch/x86/include/generated/uapi/asm/unistd_x32.h HOSTCC /tmp/B.3VOfkn/BUILD/kernel-4.14-4.14.98/x86_64-gcc-8.2.0/tools/objtool/fixdep.o HOSTLD /tmp/B.3VOfkn/BUILD/kernel-4.14-4.14.98/x86_64-gcc-8.2.0/tools/objtool/fixdep-in.o LINK /tmp/B.3VOfkn/BUILD/kernel-4.14-4.14.98/x86_64-gcc-8.2.0/tools/objtool/fixdep MKDIR /tmp/B.3VOfkn/BUILD/kernel-4.14-4.14.98/x86_64-gcc-8.2.0/tools/objtool/arch/x86/lib/ GEN /tmp/B.3VOfkn/BUILD/kernel-4.14-4.14.98/x86_64-gcc-8.2.0/tools/objtool/arch/x86/lib/inat-tables.c CC /tmp/B.3VOfkn/BUILD/kernel-4.14-4.14.98/x86_64-gcc-8.2.0/tools/objtool/arch/x86/decode.o CC /tmp/B.3VOfkn/BUILD/kernel-4.14-4.14.98/x86_64-gcc-8.2.0/tools/objtool/exec-cmd.o CC /tmp/B.3VOfkn/BUILD/kernel-4.14-4.14.98/x86_64-gcc-8.2.0/tools/objtool/builtin-check.o CC /tmp/B.3VOfkn/BUILD/kernel-4.14-4.14.98/x86_64-gcc-8.2.0/tools/objtool/help.o CC /tmp/B.3VOfkn/BUILD/kernel-4.14-4.14.98/x86_64-gcc-8.2.0/tools/objtool/pager.o CC /tmp/B.3VOfkn/BUILD/kernel-4.14-4.14.98/x86_64-gcc-8.2.0/tools/objtool/parse-options.o CC /tmp/B.3VOfkn/BUILD/kernel-4.14-4.14.98/x86_64-gcc-8.2.0/tools/objtool/run-command.o CC /tmp/B.3VOfkn/BUILD/kernel-4.14-4.14.98/x86_64-gcc-8.2.0/tools/objtool/sigchain.o CC /tmp/B.3VOfkn/BUILD/kernel-4.14-4.14.98/x86_64-gcc-8.2.0/tools/objtool/builtin-orc.o LD /tmp/B.3VOfkn/BUILD/kernel-4.14-4.14.98/x86_64-gcc-8.2.0/tools/objtool/arch/x86/objtool-in.o CC /tmp/B.3VOfkn/BUILD/kernel-4.14-4.14.98/x86_64-gcc-8.2.0/tools/objtool/check.o CC /tmp/B.3VOfkn/BUILD/kernel-4.14-4.14.98/x86_64-gcc-8.2.0/tools/objtool/orc_gen.o CC /tmp/B.3VOfkn/BUILD/kernel-4.14-4.14.98/x86_64-gcc-8.2.0/tools/objtool/orc_dump.o CC /tmp/B.3VOfkn/BUILD/kernel-4.14-4.14.98/x86_64-gcc-8.2.0/tools/objtool/subcmd-config.o CC /tmp/B.3VOfkn/BUILD/kernel-4.14-4.14.98/x86_64-gcc-8.2.0/tools/objtool/elf.o CC /tmp/B.3VOfkn/BUILD/kernel-4.14-4.14.98/x86_64-gcc-8.2.0/tools/objtool/special.o CC /tmp/B.3VOfkn/BUILD/kernel-4.14-4.14.98/x86_64-gcc-8.2.0/tools/objtool/objtool.o CC /tmp/B.3VOfkn/BUILD/kernel-4.14-4.14.98/x86_64-gcc-8.2.0/tools/objtool/libstring.o LD /tmp/B.3VOfkn/BUILD/kernel-4.14-4.14.98/x86_64-gcc-8.2.0/tools/objtool/libsubcmd-in.o AR /tmp/B.3VOfkn/BUILD/kernel-4.14-4.14.98/x86_64-gcc-8.2.0/tools/objtool/libsubcmd.a CC /tmp/B.3VOfkn/BUILD/kernel-4.14-4.14.98/x86_64-gcc-8.2.0/tools/objtool/str_error_r.o SYSTBL arch/x86/include/generated/asm/syscalls_64.h make[2]: Entering directory '/tmp/B.3VOfkn/BUILD/kernel-4.14-4.14.98/x86_64-gcc-8.2.0' Using /tmp/B.3VOfkn/BUILD/kernel-4.14-4.14.98/linux-4.14 as source for kernel make[2]: Leaving directory '/tmp/B.3VOfkn/BUILD/kernel-4.14-4.14.98/x86_64-gcc-8.2.0' SYSTBL arch/x86/include/generated/asm/syscalls_32.h WRAP arch/x86/include/generated/asm/clkdev.h WRAP arch/x86/include/generated/asm/dma-contiguous.h WRAP arch/x86/include/generated/asm/early_ioremap.h WRAP arch/x86/include/generated/asm/mcs_spinlock.h WRAP arch/x86/include/generated/asm/mm-arch-hooks.h make[2]: Entering directory '/tmp/B.3VOfkn/BUILD/kernel-4.14-4.14.98/x86_64-gcc-8.2.0' CHK include/generated/utsrelease.h UPD include/generated/utsrelease.h make[2]: Leaving directory '/tmp/B.3VOfkn/BUILD/kernel-4.14-4.14.98/x86_64-gcc-8.2.0' GENSEED scripts/gcc-plugins/randomize_layout_seed.h HOSTCC arch/x86/tools/relocs_32.o HOSTCC arch/x86/tools/relocs_common.o HOSTCC arch/x86/tools/relocs_64.o HOSTLD arch/x86/tools/relocs LD /tmp/B.3VOfkn/BUILD/kernel-4.14-4.14.98/x86_64-gcc-8.2.0/tools/objtool/objtool-in.o LINK /tmp/B.3VOfkn/BUILD/kernel-4.14-4.14.98/x86_64-gcc-8.2.0/tools/objtool/objtool CC arch/x86/purgatory/purgatory.o AS arch/x86/purgatory/stack.o AS arch/x86/purgatory/setup-x86_64.o AS arch/x86/purgatory/entry64.o CC arch/x86/purgatory/string.o CC arch/x86/purgatory/sha256.o LD arch/x86/purgatory/purgatory.ro BIN2C arch/x86/purgatory/kexec-purgatory.c HOSTCXX -fPIC scripts/gcc-plugins/structleak_plugin.o HOSTLLD -shared scripts/gcc-plugins/structleak_plugin.so HOSTCXX -fPIC scripts/gcc-plugins/randomize_layout_plugin.o HOSTLLD -shared scripts/gcc-plugins/randomize_layout_plugin.so CHK include/generated/timeconst.h UPD include/generated/timeconst.h CC kernel/bounds.s CHK include/generated/bounds.h UPD include/generated/bounds.h HOSTCC scripts/selinux/genheaders/genheaders In file included from /tmp/B.3VOfkn/BUILD/kernel-4.14-4.14.98/linux-4.14/scripts/selinux/genheaders/genheaders.c:19: /tmp/B.3VOfkn/BUILD/kernel-4.14-4.14.98/linux-4.14/security/selinux/include/classmap.h:245:2: error: #error New address family defined, please update secclass_map. #error New address family defined, please update secclass_map. ^~~~~ make[5]: *** [scripts/Makefile.host:102: scripts/selinux/genheaders/genheaders] Error 1 make[4]: *** [/tmp/B.3VOfkn/BUILD/kernel-4.14-4.14.98/linux-4.14/scripts/Makefile.build:585: scripts/selinux/genheaders] Error 2 make[3]: *** [/tmp/B.3VOfkn/BUILD/kernel-4.14-4.14.98/linux-4.14/scripts/Makefile.build:585: scripts/selinux] Error 2 make[3]: *** Waiting for unfinished jobs.... HOSTCC scripts/conmakehash CC scripts/mod/empty.o GEN scripts/gdb/linux/constants.py SHIPPED scripts/genksyms/parse.tab.c SHIPPED scripts/genksyms/lex.lex.c SHIPPED scripts/genksyms/parse.tab.h CC scripts/mod/devicetable-offsets.s CHK scripts/mod/devicetable-offsets.h UPD scripts/mod/devicetable-offsets.h HOSTCC scripts/genksyms/genksyms.o HOSTCC scripts/sortextable HOSTCC scripts/mod/mk_elfconfig MKELF scripts/mod/elfconfig.h HOSTCC scripts/kallsyms HOSTCC scripts/genksyms/parse.tab.o HOSTCC scripts/asn1_compiler HOSTCC scripts/mod/sumversion.o HOSTCC scripts/recordmcount CC arch/x86/kernel/asm-offsets.s CHK include/generated/asm-offsets.h UPD include/generated/asm-offsets.h CALL /tmp/B.3VOfkn/BUILD/kernel-4.14-4.14.98/linux-4.14/scripts/checksyscalls.sh HOSTCC scripts/genksyms/lex.lex.o HOSTLD scripts/genksyms/genksyms HOSTCC scripts/mod/file2alias.o HOSTCC scripts/mod/modpost.o HOSTLD scripts/mod/modpost make[2]: *** [/tmp/B.3VOfkn/BUILD/kernel-4.14-4.14.98/linux-4.14/Makefile:572: scripts] Error 2 make[1]: *** [Makefile:146: sub-make] Error 2 make: *** [Makefile:9: all] Error 2 error: Bad exit status from /tmp/B.3VOfkn/BUILD/tmp/rpm-tmp.12718 (%build) RPM build errors: Bad exit status from /tmp/B.3VOfkn/BUILD/tmp/rpm-tmp.12718 (%build) ended at: Sat Feb 9 18:05:56 2019, done in 0:00:25.318484 error: No files produced. + chmod -R u+rwX /tmp/B.3VOfkn/BUILD + rm -rf /tmp/B.3VOfkn/tmp /tmp/B.3VOfkn/BUILD + rm -rf /tmp/B.3VOfkn Begin-PLD-Builder-Info Build-Time: user:35.92s sys:12.84s real:63.24s (faults io:0 non-io:1944850) End-PLD-Builder-Info
[Back to list of logs] [View rpm -qa of builder]