FailedOk

th/SRPMS[OK]
th/x32[OK]
th/i686[OK]
th/x86_64[OK]

ac/SRPMS[OK]
ac/i386[OK]
ac/i586[OK]
ac/i686[OK]
ac/alpha[OK]
ac/amd64[OK]
ac/athlon[OK]
ac/ppc[OK]
ac/sparc[OK]
ac/sparc64[OK]

Advanced Search
main()
Powered by PLD Linux
(c) 2002-2019 PLD Team
$Revision: 1.37 $
Powered by Ken.
Your IP: 3.80.38.5

kernel 70db34df-a574-4dcf-bd5a-003109049893

Status:Failed
Source URL:ftp://buildlogs.pld-linux.org/th/x86_64/FAIL/kernel,70db34df-a574-4dcf-bd5a-003109049893.bz2
text/plain URL:View!
full text:View!
rpm -qa of builder:View!
Date:2019/02/09 18:05:59
Runtime:0:00:25.318484

Toc:

  • error 1
  • /tmp/B.3VOfkn/BUILD/kernel-4.14-4.14.98/linux-4.14/security/selinux/include/classmap.h:245:2: error: #error New address family defined, please update secclass_map.
  • error 2
  • make[5]: *** [scripts/Makefile.host:102: scripts/selinux/genheaders/genheaders] Error 1
  • error 3
  • make[4]: *** [/tmp/B.3VOfkn/BUILD/kernel-4.14-4.14.98/linux-4.14/scripts/Makefile.build:585: scripts/selinux/genheaders] Error 2
  • error 4
  • make[3]: *** [/tmp/B.3VOfkn/BUILD/kernel-4.14-4.14.98/linux-4.14/scripts/Makefile.build:585: scripts/selinux] Error 2
  • error 5
  • make[2]: *** [/tmp/B.3VOfkn/BUILD/kernel-4.14-4.14.98/linux-4.14/Makefile:572: scripts] Error 2
  • error 6
  • make[1]: *** [Makefile:146: sub-make] Error 2
  • error 7
  • error: Bad exit status from /tmp/B.3VOfkn/BUILD/tmp/rpm-tmp.12718 (%build)
  • error 8
  • RPM build errors:
  • error 9
  • error: No files produced.

Content:

ERROR (kernel-multiarch.config): CONFIG_CRYPTO_AEAD redefined from `m' to `y'
ERROR (kernel-multiarch.config): CONFIG_CRYPTO_GF128MUL redefined from `m' to `y'
ERROR (kernel-multiarch.config): CONFIG_CRYPTO_NULL redefined from `m' to `y'
ERROR (kernel-multiarch.config): CONFIG_CRYPTO_GCM redefined from `m' to `y'
ERROR (kernel-multiarch.config): CONFIG_CRYPTO_SEQIV redefined from `m' to `y'
ERROR (kernel-multiarch.config): CONFIG_CRYPTO_CTR redefined from `m' to `y'
ERROR (kernel-multiarch.config): CONFIG_CRYPTO_GHASH redefined from `m' to `y'
ERROR (kernel-multiarch.config): CONFIG_CRYPTO_DRBG_MENU redefined from `m' to `y'
ERROR (kernel-multiarch.config): CONFIG_CRYPTO_JITTERENTROPY redefined from `m' to `y'
There were 10 errors
+ /usr/bin/make -Otarget -j9 'TARGETOBJ=x86_64-gcc-8.2.0' all
/usr/bin/make -C /tmp/B.3VOfkn/BUILD/kernel-4.14-4.14.98/linux-4.14 O=/tmp/B.3VOfkn/BUILD/kernel-4.14-4.14.98/x86_64-gcc-8.2.0 ARCH=x86_64 CC="x86_64-pld-linux-gcc" HOSTCC="x86_64-pld-linux-gcc -D_FILE_OFFSET_BITS=64" 
  GEN     ./Makefile
scripts/kconfig/conf  --silentoldconfig Kconfig
make[2]: Entering directory '/tmp/B.3VOfkn/BUILD/kernel-4.14-4.14.98/x86_64-gcc-8.2.0'
  GEN     ./Makefile
make[2]: Leaving directory '/tmp/B.3VOfkn/BUILD/kernel-4.14-4.14.98/x86_64-gcc-8.2.0'
make[2]: Entering directory '/tmp/B.3VOfkn/BUILD/kernel-4.14-4.14.98/x86_64-gcc-8.2.0'
  CHK     include/generated/uapi/linux/version.h
  UPD     include/generated/uapi/linux/version.h
make[2]: Leaving directory '/tmp/B.3VOfkn/BUILD/kernel-4.14-4.14.98/x86_64-gcc-8.2.0'
  SYSHDR  arch/x86/include/generated/asm/unistd_64_x32.h
  SYSHDR  arch/x86/include/generated/asm/unistd_32_ia32.h
  DESCEND  objtool
make[2]: Entering directory '/tmp/B.3VOfkn/BUILD/kernel-4.14-4.14.98/x86_64-gcc-8.2.0'
  CHK     include/config/kernel.release
  UPD     include/config/kernel.release
make[2]: Leaving directory '/tmp/B.3VOfkn/BUILD/kernel-4.14-4.14.98/x86_64-gcc-8.2.0'
  SYSHDR  arch/x86/include/generated/uapi/asm/unistd_32.h
  SYSHDR  arch/x86/include/generated/uapi/asm/unistd_64.h
  HOSTCC  scripts/basic/bin2c
  HYPERCALLS arch/x86/include/generated/asm/xen-hypercalls.h
  SYSHDR  arch/x86/include/generated/uapi/asm/unistd_x32.h
  HOSTCC   /tmp/B.3VOfkn/BUILD/kernel-4.14-4.14.98/x86_64-gcc-8.2.0/tools/objtool/fixdep.o
  HOSTLD   /tmp/B.3VOfkn/BUILD/kernel-4.14-4.14.98/x86_64-gcc-8.2.0/tools/objtool/fixdep-in.o
  LINK     /tmp/B.3VOfkn/BUILD/kernel-4.14-4.14.98/x86_64-gcc-8.2.0/tools/objtool/fixdep
  MKDIR    /tmp/B.3VOfkn/BUILD/kernel-4.14-4.14.98/x86_64-gcc-8.2.0/tools/objtool/arch/x86/lib/
  GEN      /tmp/B.3VOfkn/BUILD/kernel-4.14-4.14.98/x86_64-gcc-8.2.0/tools/objtool/arch/x86/lib/inat-tables.c
  CC       /tmp/B.3VOfkn/BUILD/kernel-4.14-4.14.98/x86_64-gcc-8.2.0/tools/objtool/arch/x86/decode.o
  CC       /tmp/B.3VOfkn/BUILD/kernel-4.14-4.14.98/x86_64-gcc-8.2.0/tools/objtool/exec-cmd.o
  CC       /tmp/B.3VOfkn/BUILD/kernel-4.14-4.14.98/x86_64-gcc-8.2.0/tools/objtool/builtin-check.o
  CC       /tmp/B.3VOfkn/BUILD/kernel-4.14-4.14.98/x86_64-gcc-8.2.0/tools/objtool/help.o
  CC       /tmp/B.3VOfkn/BUILD/kernel-4.14-4.14.98/x86_64-gcc-8.2.0/tools/objtool/pager.o
  CC       /tmp/B.3VOfkn/BUILD/kernel-4.14-4.14.98/x86_64-gcc-8.2.0/tools/objtool/parse-options.o
  CC       /tmp/B.3VOfkn/BUILD/kernel-4.14-4.14.98/x86_64-gcc-8.2.0/tools/objtool/run-command.o
  CC       /tmp/B.3VOfkn/BUILD/kernel-4.14-4.14.98/x86_64-gcc-8.2.0/tools/objtool/sigchain.o
  CC       /tmp/B.3VOfkn/BUILD/kernel-4.14-4.14.98/x86_64-gcc-8.2.0/tools/objtool/builtin-orc.o
  LD       /tmp/B.3VOfkn/BUILD/kernel-4.14-4.14.98/x86_64-gcc-8.2.0/tools/objtool/arch/x86/objtool-in.o
  CC       /tmp/B.3VOfkn/BUILD/kernel-4.14-4.14.98/x86_64-gcc-8.2.0/tools/objtool/check.o
  CC       /tmp/B.3VOfkn/BUILD/kernel-4.14-4.14.98/x86_64-gcc-8.2.0/tools/objtool/orc_gen.o
  CC       /tmp/B.3VOfkn/BUILD/kernel-4.14-4.14.98/x86_64-gcc-8.2.0/tools/objtool/orc_dump.o
  CC       /tmp/B.3VOfkn/BUILD/kernel-4.14-4.14.98/x86_64-gcc-8.2.0/tools/objtool/subcmd-config.o
  CC       /tmp/B.3VOfkn/BUILD/kernel-4.14-4.14.98/x86_64-gcc-8.2.0/tools/objtool/elf.o
  CC       /tmp/B.3VOfkn/BUILD/kernel-4.14-4.14.98/x86_64-gcc-8.2.0/tools/objtool/special.o
  CC       /tmp/B.3VOfkn/BUILD/kernel-4.14-4.14.98/x86_64-gcc-8.2.0/tools/objtool/objtool.o
  CC       /tmp/B.3VOfkn/BUILD/kernel-4.14-4.14.98/x86_64-gcc-8.2.0/tools/objtool/libstring.o
  LD       /tmp/B.3VOfkn/BUILD/kernel-4.14-4.14.98/x86_64-gcc-8.2.0/tools/objtool/libsubcmd-in.o
  AR       /tmp/B.3VOfkn/BUILD/kernel-4.14-4.14.98/x86_64-gcc-8.2.0/tools/objtool/libsubcmd.a
  CC       /tmp/B.3VOfkn/BUILD/kernel-4.14-4.14.98/x86_64-gcc-8.2.0/tools/objtool/str_error_r.o
  SYSTBL  arch/x86/include/generated/asm/syscalls_64.h
make[2]: Entering directory '/tmp/B.3VOfkn/BUILD/kernel-4.14-4.14.98/x86_64-gcc-8.2.0'
  Using /tmp/B.3VOfkn/BUILD/kernel-4.14-4.14.98/linux-4.14 as source for kernel
make[2]: Leaving directory '/tmp/B.3VOfkn/BUILD/kernel-4.14-4.14.98/x86_64-gcc-8.2.0'
  SYSTBL  arch/x86/include/generated/asm/syscalls_32.h
  WRAP    arch/x86/include/generated/asm/clkdev.h
  WRAP    arch/x86/include/generated/asm/dma-contiguous.h
  WRAP    arch/x86/include/generated/asm/early_ioremap.h
  WRAP    arch/x86/include/generated/asm/mcs_spinlock.h
  WRAP    arch/x86/include/generated/asm/mm-arch-hooks.h
make[2]: Entering directory '/tmp/B.3VOfkn/BUILD/kernel-4.14-4.14.98/x86_64-gcc-8.2.0'
  CHK     include/generated/utsrelease.h
  UPD     include/generated/utsrelease.h
make[2]: Leaving directory '/tmp/B.3VOfkn/BUILD/kernel-4.14-4.14.98/x86_64-gcc-8.2.0'
  GENSEED scripts/gcc-plugins/randomize_layout_seed.h
  HOSTCC  arch/x86/tools/relocs_32.o
  HOSTCC  arch/x86/tools/relocs_common.o
  HOSTCC  arch/x86/tools/relocs_64.o
  HOSTLD  arch/x86/tools/relocs
  LD       /tmp/B.3VOfkn/BUILD/kernel-4.14-4.14.98/x86_64-gcc-8.2.0/tools/objtool/objtool-in.o
  LINK     /tmp/B.3VOfkn/BUILD/kernel-4.14-4.14.98/x86_64-gcc-8.2.0/tools/objtool/objtool
  CC      arch/x86/purgatory/purgatory.o
  AS      arch/x86/purgatory/stack.o
  AS      arch/x86/purgatory/setup-x86_64.o
  AS      arch/x86/purgatory/entry64.o
  CC      arch/x86/purgatory/string.o
  CC      arch/x86/purgatory/sha256.o
  LD      arch/x86/purgatory/purgatory.ro
  BIN2C   arch/x86/purgatory/kexec-purgatory.c
  HOSTCXX -fPIC scripts/gcc-plugins/structleak_plugin.o
  HOSTLLD -shared scripts/gcc-plugins/structleak_plugin.so
  HOSTCXX -fPIC scripts/gcc-plugins/randomize_layout_plugin.o
  HOSTLLD -shared scripts/gcc-plugins/randomize_layout_plugin.so
  CHK     include/generated/timeconst.h
  UPD     include/generated/timeconst.h
  CC      kernel/bounds.s
  CHK     include/generated/bounds.h
  UPD     include/generated/bounds.h
  HOSTCC  scripts/selinux/genheaders/genheaders
In file included from /tmp/B.3VOfkn/BUILD/kernel-4.14-4.14.98/linux-4.14/scripts/selinux/genheaders/genheaders.c:19:
/tmp/B.3VOfkn/BUILD/kernel-4.14-4.14.98/linux-4.14/security/selinux/include/classmap.h:245:2: error: #error New address family defined, please update secclass_map.
 #error New address family defined, please update secclass_map.
  ^~~~~
make[5]: *** [scripts/Makefile.host:102: scripts/selinux/genheaders/genheaders] Error 1
make[4]: *** [/tmp/B.3VOfkn/BUILD/kernel-4.14-4.14.98/linux-4.14/scripts/Makefile.build:585: scripts/selinux/genheaders] Error 2
make[3]: *** [/tmp/B.3VOfkn/BUILD/kernel-4.14-4.14.98/linux-4.14/scripts/Makefile.build:585: scripts/selinux] Error 2
make[3]: *** Waiting for unfinished jobs....
  HOSTCC  scripts/conmakehash
  CC      scripts/mod/empty.o
  GEN     scripts/gdb/linux/constants.py
  SHIPPED scripts/genksyms/parse.tab.c
  SHIPPED scripts/genksyms/lex.lex.c
  SHIPPED scripts/genksyms/parse.tab.h
  CC      scripts/mod/devicetable-offsets.s
  CHK     scripts/mod/devicetable-offsets.h
  UPD     scripts/mod/devicetable-offsets.h
  HOSTCC  scripts/genksyms/genksyms.o
  HOSTCC  scripts/sortextable
  HOSTCC  scripts/mod/mk_elfconfig
  MKELF   scripts/mod/elfconfig.h
  HOSTCC  scripts/kallsyms
  HOSTCC  scripts/genksyms/parse.tab.o
  HOSTCC  scripts/asn1_compiler
  HOSTCC  scripts/mod/sumversion.o
  HOSTCC  scripts/recordmcount
  CC      arch/x86/kernel/asm-offsets.s
  CHK     include/generated/asm-offsets.h
  UPD     include/generated/asm-offsets.h
  CALL    /tmp/B.3VOfkn/BUILD/kernel-4.14-4.14.98/linux-4.14/scripts/checksyscalls.sh
  HOSTCC  scripts/genksyms/lex.lex.o
  HOSTLD  scripts/genksyms/genksyms
  HOSTCC  scripts/mod/file2alias.o
  HOSTCC  scripts/mod/modpost.o
  HOSTLD  scripts/mod/modpost
make[2]: *** [/tmp/B.3VOfkn/BUILD/kernel-4.14-4.14.98/linux-4.14/Makefile:572: scripts] Error 2
make[1]: *** [Makefile:146: sub-make] Error 2
make: *** [Makefile:9: all] Error 2
error: Bad exit status from /tmp/B.3VOfkn/BUILD/tmp/rpm-tmp.12718 (%build)


RPM build errors:
    Bad exit status from /tmp/B.3VOfkn/BUILD/tmp/rpm-tmp.12718 (%build)
ended at: Sat Feb  9 18:05:56 2019, done in 0:00:25.318484
error: No files produced.
+ chmod -R u+rwX /tmp/B.3VOfkn/BUILD
+ rm -rf /tmp/B.3VOfkn/tmp /tmp/B.3VOfkn/BUILD
+ rm -rf /tmp/B.3VOfkn
Begin-PLD-Builder-Info
Build-Time: user:35.92s sys:12.84s real:63.24s (faults io:0 non-io:1944850)

End-PLD-Builder-Info
[Back to list of logs] [View rpm -qa of builder]