FailedOk

th/SRPMS[OK]
th/x32[OK]
th/i686[OK]
th/x86_64[OK]

ac/SRPMS[OK]
ac/i386[OK]
ac/i586[OK]
ac/i686[OK]
ac/alpha[OK]
ac/amd64[OK]
ac/athlon[OK]
ac/ppc[OK]
ac/sparc[OK]
ac/sparc64[OK]

Advanced Search
main()
Powered by PLD Linux
(c) 2002-2019 PLD Team
$Revision: 1.37 $
Powered by X.
Your IP: 3.226.251.205

kernel 7797fcf3-2e56-4b6a-8d6a-bd8998c4d090

Status:Failed
Source URL:ftp://buildlogs.pld-linux.org/th/x86_64/FAIL/kernel,7797fcf3-2e56-4b6a-8d6a-bd8998c4d090.bz2
text/plain URL:View!
rpm -qa of builder:View!
Date:2018/12/27 01:41:17
Runtime:0:00:35.911337

Toc:

  • prep
  • Executing(%prep): /bin/sh -e /tmp/B.DKxdsN/BUILD/tmp/rpm-tmp.58590
  • build
  • Executing(%build): /bin/sh -e /tmp/B.DKxdsN/BUILD/tmp/rpm-tmp.80934
  • error 1
  • error: No files produced.
  • error 2
  • /tmp/B.DKxdsN/BUILD/kernel-4.14-4.14.90/linux-4.14/arch/x86/include/asm/mpspec.h:8:10: fatal error: asm/apicdef.h: No such file or directory
  • error 3
  • compilation terminated.
  • error 4
  • make[3]: *** [/tmp/B.DKxdsN/BUILD/kernel-4.14-4.14.90/linux-4.14/scripts/Makefile.build:326: kernel/resource.o] Error 1
  • error 5
  • make[4]: *** No rule to make target 'arch/x86/crypto/sha256-avx2-asm.o', needed by 'arch/x86/crypto/sha256-ssse3.o'. Stop.
  • error 6
  • x86_64-pld-linux-gcc: error: /tmp/B.DKxdsN/BUILD/kernel-4.14-4.14.90/linux-4.14/arch/x86/crypto/sha256-avx-asm.S: No such file or directory
  • error 7
  • x86_64-pld-linux-gcc: fatal error: no input files
  • error 8
  • compilation terminated.
  • error 9
  • make[4]: *** [/tmp/B.DKxdsN/BUILD/kernel-4.14-4.14.90/linux-4.14/scripts/Makefile.build:427: arch/x86/crypto/sha256-avx-asm.o] Error 1
  • error 10
  • make[5]: *** No rule to make target 'arch/x86/events/intel/rapl.o', needed by 'arch/x86/events/intel/intel-rapl-perf.o'. Stop.
  • error 11
  • x86_64-pld-linux-gcc: error: /tmp/B.DKxdsN/BUILD/kernel-4.14-4.14.90/linux-4.14/arch/x86/events/intel/pt.c: No such file or directory
  • error 12
  • x86_64-pld-linux-gcc: fatal error: no input files
  • error 13
  • compilation terminated.
  • error 14
  • make[5]: *** [/tmp/B.DKxdsN/BUILD/kernel-4.14-4.14.90/linux-4.14/scripts/Makefile.build:327: arch/x86/events/intel/pt.o] Error 1
  • error 15
  • /tmp/B.DKxdsN/BUILD/kernel-4.14-4.14.90/linux-4.14/include/linux/highmem.h:12:10: fatal error: asm/cacheflush.h: No such file or directory
  • error 16
  • compilation terminated.
  • error 17
  • make[3]: *** [/tmp/B.DKxdsN/BUILD/kernel-4.14-4.14.90/linux-4.14/scripts/Makefile.build:327: crypto/cipher.o] Error 1
  • error 18
  • /tmp/B.DKxdsN/BUILD/kernel-4.14-4.14.90/linux-4.14/include/linux/device.h:30:10: fatal error: asm/device.h: No such file or directory
  • error 19
  • compilation terminated.
  • error 20
  • make[3]: *** [/tmp/B.DKxdsN/BUILD/kernel-4.14-4.14.90/linux-4.14/scripts/Makefile.build:326: kernel/softirq.o] Error 1
  • error 21
  • make[2]: *** [/tmp/B.DKxdsN/BUILD/kernel-4.14-4.14.90/linux-4.14/Makefile:1044: kernel] Error 2
  • error 22
  • /tmp/B.DKxdsN/BUILD/kernel-4.14-4.14.90/linux-4.14/include/uapi/linux/types.h:5:10: fatal error: asm/types.h: No such file or directory
  • error 23
  • compilation terminated.
  • error 24
  • make[3]: *** [/tmp/B.DKxdsN/BUILD/kernel-4.14-4.14.90/linux-4.14/scripts/Makefile.build:327: crypto/compress.o] Error 1
  • error 25
  • make[2]: *** [/tmp/B.DKxdsN/BUILD/kernel-4.14-4.14.90/linux-4.14/Makefile:1044: crypto] Error 2
  • error 26
  • /tmp/B.DKxdsN/BUILD/kernel-4.14-4.14.90/linux-4.14/include/linux/dma-mapping.h:198:10: fatal error: asm/dma-mapping.h: No such file or directory
  • error 27
  • compilation terminated.
  • error 28
  • make[4]: *** [/tmp/B.DKxdsN/BUILD/kernel-4.14-4.14.90/linux-4.14/scripts/Makefile.build:327: arch/x86/crypto/crc32-pclmul_glue.o] Error 1
  • error 29
  • make[3]: *** [/tmp/B.DKxdsN/BUILD/kernel-4.14-4.14.90/linux-4.14/scripts/Makefile.build:585: arch/x86/crypto] Error 2
  • error 30
  • make[4]: *** No rule to make target '/tmp/B.DKxdsN/BUILD/kernel-4.14-4.14.90/linux-4.14/arch/x86/ia32/Makefile'. Stop.
  • error 31
  • make[3]: *** [/tmp/B.DKxdsN/BUILD/kernel-4.14-4.14.90/linux-4.14/scripts/Makefile.build:585: arch/x86/ia32] Error 2
  • error 32
  • /tmp/B.DKxdsN/BUILD/kernel-4.14-4.14.90/linux-4.14/include/uapi/linux/errno.h:1:10: fatal error: asm/errno.h: No such file or directory
  • error 33
  • compilation terminated.
  • error 34
  • make[3]: *** [/tmp/B.DKxdsN/BUILD/kernel-4.14-4.14.90/linux-4.14/scripts/Makefile.build:326: mm/swap.o] Error 1
  • error 35
  • /tmp/B.DKxdsN/BUILD/kernel-4.14-4.14.90/linux-4.14/include/linux/linkage.h:8:10: fatal error: asm/linkage.h: No such file or directory
  • error 36
  • compilation terminated.
  • error 37
  • make[3]: *** [/tmp/B.DKxdsN/BUILD/kernel-4.14-4.14.90/linux-4.14/scripts/Makefile.build:327: fs/select.o] Error 1
  • error 38
  • /tmp/B.DKxdsN/BUILD/kernel-4.14-4.14.90/linux-4.14/include/uapi/linux/errno.h:1:10: fatal error: asm/errno.h: No such file or directory
  • error 39
  • compilation terminated.
  • error 40
  • make[4]: *** [/tmp/B.DKxdsN/BUILD/kernel-4.14-4.14.90/linux-4.14/scripts/Makefile.build:326: security/apparmor/lib.o] Error 1
  • error 41
  • /tmp/B.DKxdsN/BUILD/kernel-4.14-4.14.90/linux-4.14/include/linux/bug.h:5:10: fatal error: asm/bug.h: No such file or directory
  • error 42
  • compilation terminated.
  • error 43
  • make[4]: *** [/tmp/B.DKxdsN/BUILD/kernel-4.14-4.14.90/linux-4.14/scripts/Makefile.build:327: security/integrity/iint.o] Error 1
  • error 44
  • make[3]: *** [/tmp/B.DKxdsN/BUILD/kernel-4.14-4.14.90/linux-4.14/scripts/Makefile.build:585: security/integrity] Error 2
  • error 45
  • /tmp/B.DKxdsN/BUILD/kernel-4.14-4.14.90/linux-4.14/include/linux/bug.h:5:10: fatal error: asm/bug.h: No such file or directory
  • error 46
  • compilation terminated.
  • error 47
  • make[4]: *** [/tmp/B.DKxdsN/BUILD/kernel-4.14-4.14.90/linux-4.14/scripts/Makefile.build:327: security/smack/smack_lsm.o] Error 1
  • error 48
  • make[3]: *** [/tmp/B.DKxdsN/BUILD/kernel-4.14-4.14.90/linux-4.14/scripts/Makefile.build:585: security/smack] Error 2
  • error 49
  • /tmp/B.DKxdsN/BUILD/kernel-4.14-4.14.90/linux-4.14/include/uapi/linux/types.h:5:10: fatal error: asm/types.h: No such file or directory
  • error 50
  • compilation terminated.
  • error 51
  • make[4]: *** [/tmp/B.DKxdsN/BUILD/kernel-4.14-4.14.90/linux-4.14/scripts/Makefile.build:327: security/selinux/avc.o] Error 1
  • error 52
  • /tmp/B.DKxdsN/BUILD/kernel-4.14-4.14.90/linux-4.14/include/uapi/linux/types.h:5:10: fatal error: asm/types.h: No such file or directory
  • error 53
  • compilation terminated.
  • error 54
  • make[4]: *** [/tmp/B.DKxdsN/BUILD/kernel-4.14-4.14.90/linux-4.14/scripts/Makefile.build:327: security/keys/gc.o] Error 1
  • error 55
  • /tmp/B.DKxdsN/BUILD/kernel-4.14-4.14.90/linux-4.14/include/uapi/linux/types.h:5:10: fatal error: asm/types.h: No such file or directory
  • error 56
  • compilation terminated.
  • error 57
  • make[4]: *** [/tmp/B.DKxdsN/BUILD/kernel-4.14-4.14.90/linux-4.14/scripts/Makefile.build:327: security/keys/key.o] Error 1
  • error 58
  • make[3]: *** [/tmp/B.DKxdsN/BUILD/kernel-4.14-4.14.90/linux-4.14/scripts/Makefile.build:585: security/keys] Error 2
  • error 59
  • /tmp/B.DKxdsN/BUILD/kernel-4.14-4.14.90/linux-4.14/include/uapi/linux/types.h:5:10: fatal error: asm/types.h: No such file or directory
  • error 60
  • compilation terminated.
  • error 61
  • make[4]: *** [/tmp/B.DKxdsN/BUILD/kernel-4.14-4.14.90/linux-4.14/scripts/Makefile.build:327: security/selinux/hooks.o] Error 1
  • error 62
  • make[3]: *** [/tmp/B.DKxdsN/BUILD/kernel-4.14-4.14.90/linux-4.14/scripts/Makefile.build:585: security/selinux] Error 2
  • error 63
  • make[3]: *** [/tmp/B.DKxdsN/BUILD/kernel-4.14-4.14.90/linux-4.14/scripts/Makefile.build:585: security/apparmor] Error 2
  • error 64
  • make[2]: *** [/tmp/B.DKxdsN/BUILD/kernel-4.14-4.14.90/linux-4.14/Makefile:1044: security] Error 2
  • error 65
  • make[4]: *** [/tmp/B.DKxdsN/BUILD/kernel-4.14-4.14.90/linux-4.14/scripts/Makefile.build:585: arch/x86/events/intel] Error 2
  • error 66
  • make[3]: *** [/tmp/B.DKxdsN/BUILD/kernel-4.14-4.14.90/linux-4.14/scripts/Makefile.build:585: arch/x86/events] Error 2
  • error 67
  • make[2]: *** [/tmp/B.DKxdsN/BUILD/kernel-4.14-4.14.90/linux-4.14/Makefile:1044: arch/x86] Error 2
  • error 68
  • /tmp/B.DKxdsN/BUILD/kernel-4.14-4.14.90/linux-4.14/include/linux/linkage.h:8:10: fatal error: asm/linkage.h: No such file or directory
  • error 69
  • compilation terminated.
  • error 70
  • make[2]: *** [/tmp/B.DKxdsN/BUILD/kernel-4.14-4.14.90/linux-4.14/Makefile:1044: mm] Error 2
  • error 71
  • /tmp/B.DKxdsN/BUILD/kernel-4.14-4.14.90/linux-4.14/include/linux/linkage.h:8:10: fatal error: asm/linkage.h: No such file or directory
  • error 72
  • compilation terminated.
  • error 73
  • /tmp/B.DKxdsN/BUILD/kernel-4.14-4.14.90/linux-4.14/include/uapi/linux/types.h:5:10: fatal error: asm/types.h: No such file or directory
  • error 74
  • compilation terminated.
  • error 75
  • make[2]: *** [/tmp/B.DKxdsN/BUILD/kernel-4.14-4.14.90/linux-4.14/Makefile:1044: fs] Error 2
  • error 76
  • make[1]: *** [Makefile:146: sub-make] Error 2

Content:

request from: baggins
checking if we should skip the build
started at: Thu Dec 27 01:40:22 2018
killing old processes on a builder
sending signal 9 to pid -1
Killed
cleaning up /tmp
fetching https://srcbuilder.pld-linux.org/th//srpms/7797fcf3-2e56-4b6a-8d6a-bd8998c4d090/kernel-4.14-4.14.90-1.src.rpm
fetched 103895394 bytes, 11930.0 K/s
installing srpm: kernel-4.14-4.14.90-1.src.rpm
+ install -d /tmp/B.DKxdsN/BUILD /tmp/B.DKxdsN/RPMS
+ LC_ALL=en_US.UTF-8
+ rpm -qp --changelog kernel-4.14-4.14.90-1.src.rpm
* Thu Dec 27 2018 PLD Linux Team <feedback@pld-linux.org>
- For complete changelog see: http://git.pld-linux.org/?p=packages/kernel-4.14.git;a=log;h=auto/th/kernel-4.14-4.14.90-1
* Wed Dec 26 2018 Jan Rękorajski <baggins@pld-linux.org> 2f387722 - 4.14.90 * Thu Dec 13 2018 Jan Rękorajski <baggins@pld-linux.org> 00774a26 - 4.14.88 * Sat Dec 08 2018 Jan Rękorajski <baggins@pld-linux.org> a367b4d3 - 4.14.87 * Sat Dec 08 2018 Jan Rękorajski <baggins@pld-linux.org> 1c0941d0 - 4.14.86 * Mon Dec 03 2018 Arkadiusz Miśkiewicz <arekm@maven.pl> 2f196652 - up to 4.14.85 * Wed Nov 28 2018 Jan Rękorajski <baggins@pld-linux.org> 689e0fc0 - 4.14.84 * Fri Nov 23 2018 Jan Rękorajski <baggins@pld-linux.org> d065e1cd - 4.14.83 * Wed Nov 21 2018 Jan Rękorajski <baggins@pld-linux.org> c73dab19 - 4.14.82 * Wed Nov 14 2018 Jacek Konieczny <jajcus@jajcus.net> e1e8d8cb - i915_crash.patch added * Wed Nov 14 2018 Jacek Konieczny <jajcus@jajcus.net> 5dd41b01 - rt patch updated to 4.14.78-rt47 * Tue Nov 13 2018 Jan Rękorajski <baggins@pld-linux.org> 86daa41e - 4.14.81 * Sun Nov 11 2018 Jan Rękorajski <baggins@pld-linux.org> 8593988c - 4.14.80 * Sun Nov 04 2018 Jan Rękorajski <baggins@pld-linux.org> 539dfaec - 4.14.79 * Thu Oct 25 2018 Jan Rękorajski <baggins@pld-linux.org> f6365c68 - 4.14.78 * Sun Oct 14 2018 Arkadiusz Miśkiewicz <arekm@maven.pl> 29ec2ccc - up to 4.14.76 * Wed Oct 10 2018 Arkadiusz Miśkiewicz <arekm@maven.pl> 69426697 - up to 4.14.75 * Wed Oct 10 2018 Jacek Konieczny <j.konieczny@eggsoft.pl> b3a53f05 - RT patch update for 4.14.73 * Tue Oct 09 2018 Jacek Konieczny <jajcus@jajcus.net> b3bbd485 - RT patch update * Sun Sep 30 2018 Jan Rękorajski <baggins@pld-linux.org> a82bb663 - 4.14.73 * Fri Sep 28 2018 Jan Rękorajski <baggins@pld-linux.org> 11f58410 - 4.14.72 + rpm -Uhv --nodeps --define '_topdir /tmp/B.DKxdsN' --define '_specdir %{_topdir}' --define '_sourcedir %{_specdir}' --define '_rpmdir %{_topdir}/RPMS' --define '_builddir %{_topdir}/BUILD' kernel-4.14-4.14.90-1.src.rpm Preparing... ################################################## kernel-4.14 ################################################## + rm -f kernel-4.14-4.14.90-1.src.rpm + install -m 700 -d /tmp/B.DKxdsN/BUILD/tmp + TMPDIR=/tmp/B.DKxdsN/BUILD/tmp + exec nice -n 0 rpmbuild -bp --short-circuit --nodeps --define '_topdir /tmp/B.DKxdsN' --define '_specdir %{_topdir}' --define '_sourcedir %{_specdir}' --define '_rpmdir %{_topdir}/RPMS' --define '_builddir %{_topdir}/BUILD' --target x86_64-pld-linux --define 'prep exit 0' /tmp/B.DKxdsN/kernel.spec Building target platforms: x86_64-pld-linux checking BuildConflict-ing packages no BuildConflicts found checking BR rpm: Building target platforms: x86_64-pld-linux no BR needed building RPM using: set -ex; : build-id: 7797fcf3-2e56-4b6a-8d6a-bd8998c4d090; TMPDIR=/tmp/B.DKxdsN/BUILD/tmp exec nice -n 0 rpmbuild -bb --define '_smp_mflags -j9' --define '_make_opts -Otarget' --define '_pld_builder 1' --define '_topdir /tmp/B.DKxdsN' --define '_specdir %{_topdir}' --define '_sourcedir %{_specdir}' --define '_rpmdir %{_topdir}/RPMS' --define '_builddir %{_topdir}/BUILD' --target x86_64-pld-linux /tmp/B.DKxdsN/kernel.spec + : build-id: 7797fcf3-2e56-4b6a-8d6a-bd8998c4d090 + TMPDIR=/tmp/B.DKxdsN/BUILD/tmp + exec nice -n 0 rpmbuild -bb --define '_smp_mflags -j9' --define '_make_opts -Otarget' --define '_pld_builder 1' --define '_topdir /tmp/B.DKxdsN' --define '_specdir %{_topdir}' --define '_sourcedir %{_specdir}' --define '_rpmdir %{_topdir}/RPMS' --define '_builddir %{_topdir}/BUILD' --target x86_64-pld-linux /tmp/B.DKxdsN/kernel.spec Building target platforms: x86_64-pld-linux Executing(%prep): /bin/sh -e /tmp/B.DKxdsN/BUILD/tmp/rpm-tmp.58590 + umask 022 + cd /tmp/B.DKxdsN/BUILD + cd /tmp/B.DKxdsN/BUILD + rm -rf kernel-4.14-4.14.90 + /bin/mkdir -p kernel-4.14-4.14.90 + cd kernel-4.14-4.14.90 + /usr/bin/xz -dc /tmp/B.DKxdsN/linux-4.14.tar.xz + /bin/tar -xf - + STATUS=0 + '[' 0 -ne 0 ']' + /bin/id -u + '[' 1000 '=' 0 ']' + /bin/id -u + '[' 1000 '=' 0 ']' + /bin/chmod -Rf a+rX,u+w,g-w,o-w . + ln -s /tmp/B.DKxdsN/kernel-module-build.pl kernel-module-build.pl + ln -s /tmp/B.DKxdsN/kernel.make Makefile + cd linux-4.14 + echo 'Patch #0 (patch-4.14.90.xz):' Patch #0 (patch-4.14.90.xz): + '[' -f /tmp/B.DKxdsN/patch-4.14.90.xz ']' + /usr/bin/xz -dc /tmp/B.DKxdsN/patch-4.14.90.xz + /usr/bin/patch -s -p1 + echo 'Patch #2 (i915_crash.patch):' Patch #2 (i915_crash.patch): + '[' -f /tmp/B.DKxdsN/i915_crash.patch ']' + /bin/cat /tmp/B.DKxdsN/i915_crash.patch + /usr/bin/patch -s -p1 + echo 'Patch #6 (linux-wistron-nx.patch):' Patch #6 (linux-wistron-nx.patch): + '[' -f /tmp/B.DKxdsN/linux-wistron-nx.patch ']' + /bin/cat /tmp/B.DKxdsN/linux-wistron-nx.patch + /usr/bin/patch -s -p1 + echo 'Patch #10 (kernel-pom-ng-IPV4OPTSSTRIP.patch):' Patch #10 (kernel-pom-ng-IPV4OPTSSTRIP.patch): + '[' -f /tmp/B.DKxdsN/kernel-pom-ng-IPV4OPTSSTRIP.patch ']' + /bin/cat /tmp/B.DKxdsN/kernel-pom-ng-IPV4OPTSSTRIP.patch + /usr/bin/patch -s -p1 + echo 'Patch #40 (kernel-layer7.patch):' Patch #40 (kernel-layer7.patch): + '[' -f /tmp/B.DKxdsN/kernel-layer7.patch ']' + /bin/cat /tmp/B.DKxdsN/kernel-layer7.patch + /usr/bin/patch -s -p1 + echo 'Patch #55 (kernel-atm-vbr.patch):' Patch #55 (kernel-atm-vbr.patch): + '[' -f /tmp/B.DKxdsN/kernel-atm-vbr.patch ']' + /usr/bin/patch -s -p1 + /bin/cat /tmp/B.DKxdsN/kernel-atm-vbr.patch + echo 'Patch #56 (kernel-atmdd.patch):' Patch #56 (kernel-atmdd.patch): + '[' -f /tmp/B.DKxdsN/kernel-atmdd.patch ']' + /bin/cat /tmp/B.DKxdsN/kernel-atmdd.patch + /usr/bin/patch -s -p1 + echo 'Patch #59 (kernel-rndis_host-wm5.patch):' Patch #59 (kernel-rndis_host-wm5.patch): + '[' -f /tmp/B.DKxdsN/kernel-rndis_host-wm5.patch ']' + /usr/bin/patch -s -p1 + /bin/cat /tmp/B.DKxdsN/kernel-rndis_host-wm5.patch + echo 'Patch #85 (kernel-hostap.patch):' Patch #85 (kernel-hostap.patch): + '[' -f /tmp/B.DKxdsN/kernel-hostap.patch ']' + /bin/cat /tmp/B.DKxdsN/kernel-hostap.patch + /usr/bin/patch -s -p1 + echo 'Patch #145 (kernel-aufs4.patch):' Patch #145 (kernel-aufs4.patch): + '[' -f /tmp/B.DKxdsN/kernel-aufs4.patch ']' + /bin/cat /tmp/B.DKxdsN/kernel-aufs4.patch + /usr/bin/patch -s -p1 + echo 'Patch #5001 (0012-apparmor-add-base-infastructure-for-socket-mediation.patch):' Patch #5001 (0012-apparmor-add-base-infastructure-for-socket-mediation.patch): + '[' -f /tmp/B.DKxdsN/0012-apparmor-add-base-infastructure-for-socket-mediation.patch ']' + /bin/cat /tmp/B.DKxdsN/0012-apparmor-add-base-infastructure-for-socket-mediation.patch + /usr/bin/patch -s -p1 + echo 'Patch #5002 (0001-UBUNTU-SAUCE-apparmor-af_unix-mediation.patch):' Patch #5002 (0001-UBUNTU-SAUCE-apparmor-af_unix-mediation.patch): + '[' -f /tmp/B.DKxdsN/0001-UBUNTU-SAUCE-apparmor-af_unix-mediation.patch ']' + /bin/cat /tmp/B.DKxdsN/0001-UBUNTU-SAUCE-apparmor-af_unix-mediation.patch + /usr/bin/patch -s -p1 + echo 'Patch #250 (kernel-fix_256colors_menuconfig.patch):' Patch #250 (kernel-fix_256colors_menuconfig.patch): + '[' -f /tmp/B.DKxdsN/kernel-fix_256colors_menuconfig.patch ']' + /bin/cat /tmp/B.DKxdsN/kernel-fix_256colors_menuconfig.patch + /usr/bin/patch -s -p1 + echo 'Patch #2000 (kernel-small_fixes.patch):' Patch #2000 (kernel-small_fixes.patch): + '[' -f /tmp/B.DKxdsN/kernel-small_fixes.patch ']' + /bin/cat /tmp/B.DKxdsN/kernel-small_fixes.patch + /usr/bin/patch -s -p1 + echo 'Patch #2001 (kernel-pwc-uncompress.patch):' Patch #2001 (kernel-pwc-uncompress.patch): + '[' -f /tmp/B.DKxdsN/kernel-pwc-uncompress.patch ']' + /bin/cat /tmp/B.DKxdsN/kernel-pwc-uncompress.patch + /usr/bin/patch -s -p1 + chmod 755 tools/objtool/sync-check.sh + sed -i 's#EXTRAVERSION =.*#EXTRAVERSION = #g' Makefile + find '(' -name '*~' -o -name '*.orig' -o -name .gitignore ')' -print0 + xargs -0 -r -l512 rm -f + exit 0 Executing(%build): /bin/sh -e /tmp/B.DKxdsN/BUILD/tmp/rpm-tmp.80934 TMP=/home/users/builder/tmp HOME=/home/users/builder PATH=/home/users/builder/GNUstep/Tools:/usr/local/bin:/usr/bin:/bin:/home/users/builder/bin TMPDIR=/tmp/B.DKxdsN/BUILD/tmp + umask 022 + cd /tmp/B.DKxdsN/BUILD + cd kernel-4.14-4.14.90 + install -d /tmp/B.DKxdsN/BUILD/kernel-4.14-4.14.90/x86_64-gcc-8.2.0 + >x86_64-gcc-8.2.0.mk + <<"EOF" + cat + cd /tmp/B.DKxdsN/BUILD/kernel-4.14-4.14.90/x86_64-gcc-8.2.0 + install -d arch/x86 + >arch/x86/defconfig + BuildConfig + set -e + Config=kernel-x86.config + >&2 + echo 'Building config file for x86_64 using kernel-x86.config et al.' Building config file for x86_64 using kernel-x86.config et al. + <<-EOCONFIG + >important.config + cat + mawk -v 'arch=all x86 x86_64 x86_64' -f /tmp/B.DKxdsN/kernel-config.awk important.config /tmp/B.DKxdsN/kernel-imq.config /tmp/B.DKxdsN/kernel-patches.config /tmp/B.DKxdsN/kernel-multiarch.config /tmp/B.DKxdsN/kernel-x86.config kernel-x86.config (287): Warning: CONFIG_VIDEO_IVTV_DEPRECATED_IOCTLS already defined in: kernel-multiarch.config (3473) kernel-x86.config (317): Warning: CONFIG_PCIEASPM_DEFAULT already defined in: kernel-multiarch.config (6401) kernel-x86.config (318): Warning: CONFIG_PCIEASPM_POWERSAVE already defined in: kernel-multiarch.config (6402) kernel-x86.config (319): Warning: CONFIG_PCIEASPM_POWER_SUPERSAVE already defined in: kernel-multiarch.config (6403) kernel-x86.config (320): Warning: CONFIG_PCIEASPM_PERFORMANCE already defined in: kernel-multiarch.config (6404) kernel-x86.config (325): Warning: CONFIG_INTEL_TURBO_MAX_3 already defined in: kernel-multiarch.config (6643) kernel-x86.config (344): Warning: CONFIG_PC104 already defined in: kernel-multiarch.config (9956) kernel-x86.config (369): Warning: CONFIG_KCOV already defined in: kernel-multiarch.config (10195) kernel-x86.config (370): Warning: CONFIG_WW_MUTEX_SELFTEST already defined in: kernel-multiarch.config (10223) kernel-x86.config (402): Warning: CONFIG_SND_X86 already defined in: kernel-multiarch.config (12159) kernel-x86.config (403): Warning: CONFIG_HDMI_LPE_AUDIO already defined in: kernel-multiarch.config (12160) + ln -sf arch/x86/defconfig .config + cd - /tmp/B.DKxdsN/BUILD/kernel-4.14-4.14.90 + /usr/bin/make -Otarget -j9 'TARGETOBJ=x86_64-gcc-8.2.0' oldconfig /usr/bin/make -C /tmp/B.DKxdsN/BUILD/kernel-4.14-4.14.90/linux-4.14 O=/tmp/B.DKxdsN/BUILD/kernel-4.14-4.14.90/x86_64-gcc-8.2.0 ARCH=x86_64 CC="x86_64-pld-linux-gcc" HOSTCC="x86_64-pld-linux-gcc -D_FILE_OFFSET_BITS=64" oldconfig make[2]: Entering directory '/tmp/B.DKxdsN/BUILD/kernel-4.14-4.14.90/x86_64-gcc-8.2.0' GEN ./Makefile make[2]: Leaving directory '/tmp/B.DKxdsN/BUILD/kernel-4.14-4.14.90/x86_64-gcc-8.2.0' HOSTCC scripts/basic/fixdep SHIPPED scripts/kconfig/zconf.tab.c SHIPPED scripts/kconfig/zconf.lex.c HOSTCC scripts/kconfig/conf.o HOSTCC scripts/kconfig/zconf.tab.o HOSTLD scripts/kconfig/conf scripts/kconfig/conf --oldconfig Kconfig # # configuration written to .config # + mawk -v 'infile=/tmp/B.DKxdsN/BUILD/kernel-4.14-4.14.90/x86_64-gcc-8.2.0/arch/x86/defconfig' -f /tmp/B.DKxdsN/kernel-track-config-change.awk /tmp/B.DKxdsN/BUILD/kernel-4.14-4.14.90/x86_64-gcc-8.2.0/.config ERROR (kernel-multiarch.config): CONFIG_MODVERSIONS redefined from `n' to `y' ERROR (kernel-multiarch.config): CONFIG_CRYPTO_AEAD redefined from `m' to `y' ERROR (kernel-multiarch.config): CONFIG_CRYPTO_GF128MUL redefined from `m' to `y' ERROR (kernel-multiarch.config): CONFIG_CRYPTO_NULL redefined from `m' to `y' ERROR (kernel-multiarch.config): CONFIG_CRYPTO_GCM redefined from `m' to `y' ERROR (kernel-multiarch.config): CONFIG_CRYPTO_SEQIV redefined from `m' to `y' ERROR (kernel-multiarch.config): CONFIG_CRYPTO_CTR redefined from `m' to `y' ERROR (kernel-multiarch.config): CONFIG_CRYPTO_GHASH redefined from `m' to `y' ERROR (kernel-multiarch.config): CONFIG_CRYPTO_DRBG_MENU redefined from `m' to `y' ERROR (kernel-multiarch.config): CONFIG_CRYPTO_JITTERENTROPY redefined from `m' to `y' There were 10 errors + /usr/bin/make -Otarget -j9 'TARGETOBJ=x86_64-gcc-8.2.0' all /usr/bin/make -C /tmp/B.DKxdsN/BUILD/kernel-4.14-4.14.90/linux-4.14 O=/tmp/B.DKxdsN/BUILD/kernel-4.14-4.14.90/x86_64-gcc-8.2.0 ARCH=x86_64 CC="x86_64-pld-linux-gcc" HOSTCC="x86_64-pld-linux-gcc -D_FILE_OFFSET_BITS=64" GEN ./Makefile scripts/kconfig/conf --silentoldconfig Kconfig make[2]: Entering directory '/tmp/B.DKxdsN/BUILD/kernel-4.14-4.14.90/x86_64-gcc-8.2.0' GEN ./Makefile make[2]: Leaving directory '/tmp/B.DKxdsN/BUILD/kernel-4.14-4.14.90/x86_64-gcc-8.2.0' SYSHDR arch/x86/include/generated/asm/unistd_64_x32.h make[2]: Entering directory '/tmp/B.DKxdsN/BUILD/kernel-4.14-4.14.90/x86_64-gcc-8.2.0' CHK include/generated/uapi/linux/version.h UPD include/generated/uapi/linux/version.h make[2]: Leaving directory '/tmp/B.DKxdsN/BUILD/kernel-4.14-4.14.90/x86_64-gcc-8.2.0' SYSHDR arch/x86/include/generated/asm/unistd_32_ia32.h SYSHDR arch/x86/include/generated/uapi/asm/unistd_32.h make[2]: Entering directory '/tmp/B.DKxdsN/BUILD/kernel-4.14-4.14.90/x86_64-gcc-8.2.0' CHK include/config/kernel.release UPD include/config/kernel.release make[2]: Leaving directory '/tmp/B.DKxdsN/BUILD/kernel-4.14-4.14.90/x86_64-gcc-8.2.0' SYSHDR arch/x86/include/generated/uapi/asm/unistd_x32.h SYSHDR arch/x86/include/generated/uapi/asm/unistd_64.h DESCEND objtool HYPERCALLS arch/x86/include/generated/asm/xen-hypercalls.h HOSTCC scripts/basic/bin2c HOSTCC /tmp/B.DKxdsN/BUILD/kernel-4.14-4.14.90/x86_64-gcc-8.2.0/tools/objtool/fixdep.o HOSTLD /tmp/B.DKxdsN/BUILD/kernel-4.14-4.14.90/x86_64-gcc-8.2.0/tools/objtool/fixdep-in.o LINK /tmp/B.DKxdsN/BUILD/kernel-4.14-4.14.90/x86_64-gcc-8.2.0/tools/objtool/fixdep CC /tmp/B.DKxdsN/BUILD/kernel-4.14-4.14.90/x86_64-gcc-8.2.0/tools/objtool/exec-cmd.o CC /tmp/B.DKxdsN/BUILD/kernel-4.14-4.14.90/x86_64-gcc-8.2.0/tools/objtool/help.o MKDIR /tmp/B.DKxdsN/BUILD/kernel-4.14-4.14.90/x86_64-gcc-8.2.0/tools/objtool/arch/x86/lib/ GEN /tmp/B.DKxdsN/BUILD/kernel-4.14-4.14.90/x86_64-gcc-8.2.0/tools/objtool/arch/x86/lib/inat-tables.c CC /tmp/B.DKxdsN/BUILD/kernel-4.14-4.14.90/x86_64-gcc-8.2.0/tools/objtool/arch/x86/decode.o CC /tmp/B.DKxdsN/BUILD/kernel-4.14-4.14.90/x86_64-gcc-8.2.0/tools/objtool/builtin-check.o CC /tmp/B.DKxdsN/BUILD/kernel-4.14-4.14.90/x86_64-gcc-8.2.0/tools/objtool/builtin-orc.o CC /tmp/B.DKxdsN/BUILD/kernel-4.14-4.14.90/x86_64-gcc-8.2.0/tools/objtool/check.o CC /tmp/B.DKxdsN/BUILD/kernel-4.14-4.14.90/x86_64-gcc-8.2.0/tools/objtool/pager.o CC /tmp/B.DKxdsN/BUILD/kernel-4.14-4.14.90/x86_64-gcc-8.2.0/tools/objtool/parse-options.o CC /tmp/B.DKxdsN/BUILD/kernel-4.14-4.14.90/x86_64-gcc-8.2.0/tools/objtool/orc_gen.o CC /tmp/B.DKxdsN/BUILD/kernel-4.14-4.14.90/x86_64-gcc-8.2.0/tools/objtool/orc_dump.o CC /tmp/B.DKxdsN/BUILD/kernel-4.14-4.14.90/x86_64-gcc-8.2.0/tools/objtool/elf.o LD /tmp/B.DKxdsN/BUILD/kernel-4.14-4.14.90/x86_64-gcc-8.2.0/tools/objtool/arch/x86/objtool-in.o CC /tmp/B.DKxdsN/BUILD/kernel-4.14-4.14.90/x86_64-gcc-8.2.0/tools/objtool/special.o CC /tmp/B.DKxdsN/BUILD/kernel-4.14-4.14.90/x86_64-gcc-8.2.0/tools/objtool/objtool.o CC /tmp/B.DKxdsN/BUILD/kernel-4.14-4.14.90/x86_64-gcc-8.2.0/tools/objtool/libstring.o CC /tmp/B.DKxdsN/BUILD/kernel-4.14-4.14.90/x86_64-gcc-8.2.0/tools/objtool/str_error_r.o CC /tmp/B.DKxdsN/BUILD/kernel-4.14-4.14.90/x86_64-gcc-8.2.0/tools/objtool/run-command.o CC /tmp/B.DKxdsN/BUILD/kernel-4.14-4.14.90/x86_64-gcc-8.2.0/tools/objtool/sigchain.o CC /tmp/B.DKxdsN/BUILD/kernel-4.14-4.14.90/x86_64-gcc-8.2.0/tools/objtool/subcmd-config.o LD /tmp/B.DKxdsN/BUILD/kernel-4.14-4.14.90/x86_64-gcc-8.2.0/tools/objtool/libsubcmd-in.o AR /tmp/B.DKxdsN/BUILD/kernel-4.14-4.14.90/x86_64-gcc-8.2.0/tools/objtool/libsubcmd.a SYSTBL arch/x86/include/generated/asm/syscalls_64.h SYSTBL arch/x86/include/generated/asm/syscalls_32.h make[2]: Entering directory '/tmp/B.DKxdsN/BUILD/kernel-4.14-4.14.90/x86_64-gcc-8.2.0' Using /tmp/B.DKxdsN/BUILD/kernel-4.14-4.14.90/linux-4.14 as source for kernel make[2]: Leaving directory '/tmp/B.DKxdsN/BUILD/kernel-4.14-4.14.90/x86_64-gcc-8.2.0' HOSTCC arch/x86/tools/relocs_common.o LD /tmp/B.DKxdsN/BUILD/kernel-4.14-4.14.90/x86_64-gcc-8.2.0/tools/objtool/objtool-in.o LINK /tmp/B.DKxdsN/BUILD/kernel-4.14-4.14.90/x86_64-gcc-8.2.0/tools/objtool/objtool HOSTCC arch/x86/tools/relocs_32.o WRAP arch/x86/include/generated/asm/clkdev.h WRAP arch/x86/include/generated/asm/dma-contiguous.h WRAP arch/x86/include/generated/asm/early_ioremap.h WRAP arch/x86/include/generated/asm/mcs_spinlock.h WRAP arch/x86/include/generated/asm/mm-arch-hooks.h HOSTCC arch/x86/tools/relocs_64.o make[2]: Entering directory '/tmp/B.DKxdsN/BUILD/kernel-4.14-4.14.90/x86_64-gcc-8.2.0' CHK include/generated/utsrelease.h UPD include/generated/utsrelease.h make[2]: Leaving directory '/tmp/B.DKxdsN/BUILD/kernel-4.14-4.14.90/x86_64-gcc-8.2.0' HOSTLD arch/x86/tools/relocs GENSEED scripts/gcc-plugins/randomize_layout_seed.h CC arch/x86/purgatory/purgatory.o AS arch/x86/purgatory/stack.o AS arch/x86/purgatory/setup-x86_64.o AS arch/x86/purgatory/entry64.o CC arch/x86/purgatory/string.o CC arch/x86/purgatory/sha256.o LD arch/x86/purgatory/purgatory.ro BIN2C arch/x86/purgatory/kexec-purgatory.c HOSTCXX -fPIC scripts/gcc-plugins/structleak_plugin.o HOSTLLD -shared scripts/gcc-plugins/structleak_plugin.so HOSTCXX -fPIC scripts/gcc-plugins/randomize_layout_plugin.o HOSTLLD -shared scripts/gcc-plugins/randomize_layout_plugin.so CHK include/generated/timeconst.h UPD include/generated/timeconst.h CC kernel/bounds.s CHK include/generated/bounds.h UPD include/generated/bounds.h HOSTCC scripts/conmakehash GEN scripts/gdb/linux/constants.py HOSTCC scripts/selinux/genheaders/genheaders CC scripts/mod/empty.o HOSTCC scripts/selinux/mdp/mdp SHIPPED scripts/genksyms/parse.tab.c SHIPPED scripts/genksyms/lex.lex.c SHIPPED scripts/genksyms/parse.tab.h CC scripts/mod/devicetable-offsets.s HOSTCC scripts/sortextable HOSTCC scripts/genksyms/genksyms.o HOSTCC scripts/mod/mk_elfconfig CHK scripts/mod/devicetable-offsets.h UPD scripts/mod/devicetable-offsets.h HOSTCC scripts/kallsyms MKELF scripts/mod/elfconfig.h HOSTCC scripts/genksyms/parse.tab.o HOSTCC scripts/recordmcount HOSTCC scripts/insert-sys-cert HOSTCC scripts/extract-cert HOSTCC scripts/mod/sumversion.o CC arch/x86/kernel/asm-offsets.s CHK include/generated/asm-offsets.h UPD include/generated/asm-offsets.h HOSTCC scripts/asn1_compiler CALL /tmp/B.DKxdsN/BUILD/kernel-4.14-4.14.90/linux-4.14/scripts/checksyscalls.sh HOSTCC scripts/genksyms/lex.lex.o HOSTLD scripts/genksyms/genksyms HOSTCC scripts/mod/file2alias.o HOSTCC scripts/mod/modpost.o HOSTLD scripts/mod/modpost HOSTCC usr/gen_init_cpio GEN usr/initramfs_data.cpio AR arch/x86/crypto/built-in.o CC certs/system_keyring.o AS arch/x86/entry/entry_64.o AS usr/initramfs_data.o AR usr/built-in.o AS arch/x86/entry/thunk_64.o EXTRACT_CERTS CC ipc/compat.o CC arch/x86/entry/syscall_64.o CC certs/blacklist.o CC [M] arch/x86/crypto/glue_helper.o AS [M] arch/x86/crypto/aes-x86_64-asm_64.o CC certs/blacklist_nohashes.o AS certs/system_certificates.o AR certs/built-in.o CC ipc/util.o CC init/main.o CHK include/generated/compile.h UPD include/generated/compile.h CC fs/open.o CC arch/x86/entry/common.o CC [M] arch/x86/crypto/aes_glue.o AS [M] arch/x86/crypto/des3_ede-asm_64.o CC ipc/msgutil.o CC kernel/fork.o CC arch/x86/events/core.o CC [M] arch/x86/crypto/des3_ede_glue.o CC arch/x86/entry/vdso/vma.o AS [M] arch/x86/crypto/camellia-x86_64-asm_64.o CC mm/filemap.o CC arch/x86/entry/vdso/vdso32-setup.o LDS arch/x86/entry/vdso/vdso.lds AS arch/x86/entry/vdso/vdso-note.o CC ipc/msg.o CC kernel/exec_domain.o CC arch/x86/entry/vdso/vclock_gettime.o CC init/do_mounts.o CC arch/x86/entry/vdso/vgetcpu.o CC fs/read_write.o CC arch/x86/events/amd/core.o HOSTCC arch/x86/entry/vdso/vdso2c CC [M] arch/x86/crypto/camellia_glue.o LDS arch/x86/entry/vdso/vdsox32.lds X32 arch/x86/entry/vdso/vdso-note-x32.o X32 arch/x86/entry/vdso/vclock_gettime-x32.o X32 arch/x86/entry/vdso/vgetcpu-x32.o CC mm/mempool.o LDS arch/x86/entry/vdso/vdso32/vdso32.lds CC kernel/panic.o AS [M] arch/x86/crypto/blowfish-x86_64-asm_64.o CC arch/x86/events/amd/uncore.o CC ipc/sem.o CC init/do_mounts_rd.o CC arch/x86/entry/vdso/vdso32/vclock_gettime.o AS arch/x86/entry/vdso/vdso32/note.o CC fs/file_table.o AS arch/x86/entry/vdso/vdso32/system_call.o AS arch/x86/entry/vdso/vdso32/sigreturn.o CC [M] arch/x86/crypto/blowfish_glue.o AS [M] arch/x86/crypto/twofish-x86_64-asm_64.o CC init/do_mounts_initrd.o VDSO arch/x86/entry/vdso/vdso64.so.dbg VDSO arch/x86/entry/vdso/vdsox32.so.dbg CC [M] arch/x86/crypto/twofish_glue.o CC ipc/shm.o AS [M] arch/x86/crypto/twofish-x86_64-asm_64-3way.o VDSO arch/x86/entry/vdso/vdso32.so.dbg CC arch/x86/events/amd/ibs.o CC mm/oom_kill.o OBJCOPY arch/x86/entry/vdso/vdso64.so OBJCOPY arch/x86/entry/vdso/vdsox32.so OBJCOPY arch/x86/entry/vdso/vdso32.so VDSO2C arch/x86/entry/vdso/vdso-image-64.c VDSO2C arch/x86/entry/vdso/vdso-image-x32.c VDSO2C arch/x86/entry/vdso/vdso-image-32.c CC arch/x86/entry/vdso/vdso-image-64.o CC init/initramfs.o CC kernel/cpu.o CC arch/x86/entry/vdso/vdso-image-x32.o CC ipc/syscall.o CC init/calibrate.o CC arch/x86/events/amd/iommu.o CC mm/maccess.o CC arch/x86/entry/vdso/vdso-image-32.o AR arch/x86/entry/vdso/built-in.o CC fs/super.o CC [M] arch/x86/crypto/twofish_glue_3way.o AS [M] arch/x86/crypto/chacha20-ssse3-x86_64.o CC ipc/ipc_sysctl.o CC arch/x86/entry/vsyscall/vsyscall_gtod.o CC [M] arch/x86/events/amd/power.o AR arch/x86/events/amd/built-in.o CC init/init_task.o CC [M] arch/x86/crypto/chacha20_glue.o AS [M] arch/x86/crypto/chacha20-avx2-x86_64.o AS [M] arch/x86/crypto/serpent-sse2-x86_64-asm_64.o CC arch/x86/entry/vsyscall/vsyscall_64.o AS arch/x86/entry/vsyscall/vsyscall_emu_64.o AR arch/x86/entry/vsyscall/built-in.o CC fs/char_dev.o CC init/version.o AR init/mounts.o AR init/built-in.o AS arch/x86/entry/entry_64_compat.o CC [M] arch/x86/crypto/serpent_sse2_glue.o CC arch/x86/entry/syscall_32.o AR arch/x86/entry/built-in.o CC ipc/mqueue.o AS [M] arch/x86/crypto/aesni-intel_asm.o CC ipc/namespace.o CC arch/x86/events/intel/bts.o CC fs/stat.o CC ipc/mq_sysctl.o AR ipc/built-in.o CC arch/x86/events/intel/core.o CC [M] arch/x86/crypto/aesni-intel_glue.o CC arch/x86/events/msr.o CC arch/x86/hyperv/hv_init.o CC [M] arch/x86/crypto/fpu.o CC mm/page_alloc.o AS [M] arch/x86/crypto/aesni-intel_avx-x86_64.o AS [M] arch/x86/crypto/aes_ctrby8_avx-x86_64.o AS [M] arch/x86/crypto/ghash-clmulni-intel_asm.o CC arch/x86/events/intel/ds.o CC arch/x86/hyperv/mmu.o AR arch/x86/hyperv/built-in.o CC security/apparmor/apparmorfs.o CC fs/exec.o CC [M] arch/x86/crypto/ghash-clmulni-intel_glue.o CC fs/pipe.o CC arch/x86/events/intel/knc.o GEN security/apparmor/capability_names.h Terminated ended at: Thu Dec 27 01:41:09 2018, done in 0:00:35.911337 error: No files produced. + chmod -R u+rwX /tmp/B.DKxdsN/BUILD CC [M] arch/x86/crypto/crc32c-intel_glue.o CC security/apparmor/audit.o AS [M] arch/x86/crypto/crc32c-pcl-intel-asm_64.o AS [M] arch/x86/crypto/sha1_ssse3_asm.o CC arch/x86/events/intel/lbr.o CC security/apparmor/context.o + rm -rf /tmp/B.DKxdsN/tmp /tmp/B.DKxdsN/BUILD CC fs/fcntl.o CC mm/page-writeback.o CC arch/x86/events/intel/p4.o CC [M] arch/x86/crypto/sha1_ssse3_glue.o AS [M] arch/x86/crypto/sha1_avx2_x86_64_asm.o CC crypto/api.o AS [M] arch/x86/crypto/sha1_ni_asm.o CC fs/ioctl.o CC kernel/exit.o AS [M] arch/x86/crypto/crc32-pclmul_asm.o AS [M] arch/x86/crypto/sha256-ssse3-asm.o CC kernel/resource.o In file included from /tmp/B.DKxdsN/BUILD/kernel-4.14-4.14.90/linux-4.14/arch/x86/include/asm/smp.h:12, from /tmp/B.DKxdsN/BUILD/kernel-4.14-4.14.90/linux-4.14/arch/x86/include/asm/mmzone_64.h:11, from /tmp/B.DKxdsN/BUILD/kernel-4.14-4.14.90/linux-4.14/arch/x86/include/asm/mmzone.h:5, from /tmp/B.DKxdsN/BUILD/kernel-4.14-4.14.90/linux-4.14/include/linux/mmzone.h:919, from /tmp/B.DKxdsN/BUILD/kernel-4.14-4.14.90/linux-4.14/include/linux/gfp.h:6, from /tmp/B.DKxdsN/BUILD/kernel-4.14-4.14.90/linux-4.14/include/linux/slab.h:15, from /tmp/B.DKxdsN/BUILD/kernel-4.14-4.14.90/linux-4.14/kernel/resource.c:16: /tmp/B.DKxdsN/BUILD/kernel-4.14-4.14.90/linux-4.14/arch/x86/include/asm/mpspec.h:8:10: fatal error: asm/apicdef.h: No such file or directory #include <asm/apicdef.h> ^~~~~~~~~~~~~~~ compilation terminated. make[3]: *** [/tmp/B.DKxdsN/BUILD/kernel-4.14-4.14.90/linux-4.14/scripts/Makefile.build:326: kernel/resource.o] Error 1 make[3]: *** Waiting for unfinished jobs.... make[4]: *** No rule to make target 'arch/x86/crypto/sha256-avx2-asm.o', needed by 'arch/x86/crypto/sha256-ssse3.o'. Stop. make[4]: *** Waiting for unfinished jobs.... AS [M] arch/x86/crypto/sha256-avx-asm.o x86_64-pld-linux-gcc: error: /tmp/B.DKxdsN/BUILD/kernel-4.14-4.14.90/linux-4.14/arch/x86/crypto/sha256-avx-asm.S: No such file or directory x86_64-pld-linux-gcc: fatal error: no input files compilation terminated. make[4]: *** [/tmp/B.DKxdsN/BUILD/kernel-4.14-4.14.90/linux-4.14/scripts/Makefile.build:427: arch/x86/crypto/sha256-avx-asm.o] Error 1 make[5]: *** No rule to make target 'arch/x86/events/intel/rapl.o', needed by 'arch/x86/events/intel/intel-rapl-perf.o'. Stop. make[5]: *** Waiting for unfinished jobs.... CC arch/x86/events/intel/pt.o x86_64-pld-linux-gcc: error: /tmp/B.DKxdsN/BUILD/kernel-4.14-4.14.90/linux-4.14/arch/x86/events/intel/pt.c: No such file or directory x86_64-pld-linux-gcc: fatal error: no input files compilation terminated. make[5]: *** [/tmp/B.DKxdsN/BUILD/kernel-4.14-4.14.90/linux-4.14/scripts/Makefile.build:327: arch/x86/events/intel/pt.o] Error 1 CC crypto/cipher.o In file included from /tmp/B.DKxdsN/BUILD/kernel-4.14-4.14.90/linux-4.14/crypto/internal.h:19, from /tmp/B.DKxdsN/BUILD/kernel-4.14-4.14.90/linux-4.14/crypto/cipher.c:21: /tmp/B.DKxdsN/BUILD/kernel-4.14-4.14.90/linux-4.14/include/linux/highmem.h:12:10: fatal error: asm/cacheflush.h: No such file or directory #include <asm/cacheflush.h> ^~~~~~~~~~~~~~~~~~ compilation terminated. make[3]: *** [/tmp/B.DKxdsN/BUILD/kernel-4.14-4.14.90/linux-4.14/scripts/Makefile.build:327: crypto/cipher.o] Error 1 make[3]: *** Waiting for unfinished jobs.... CC kernel/softirq.o In file included from /tmp/B.DKxdsN/BUILD/kernel-4.14-4.14.90/linux-4.14/include/linux/node.h:18, from /tmp/B.DKxdsN/BUILD/kernel-4.14-4.14.90/linux-4.14/include/linux/cpu.h:17, from /tmp/B.DKxdsN/BUILD/kernel-4.14-4.14.90/linux-4.14/kernel/softirq.c:20: /tmp/B.DKxdsN/BUILD/kernel-4.14-4.14.90/linux-4.14/include/linux/device.h:30:10: fatal error: asm/device.h: No such file or directory #include <asm/device.h> ^~~~~~~~~~~~~~ compilation terminated. make[3]: *** [/tmp/B.DKxdsN/BUILD/kernel-4.14-4.14.90/linux-4.14/scripts/Makefile.build:326: kernel/softirq.o] Error 1 make[2]: *** [/tmp/B.DKxdsN/BUILD/kernel-4.14-4.14.90/linux-4.14/Makefile:1044: kernel] Error 2 make[2]: *** Waiting for unfinished jobs.... CC crypto/compress.o In file included from /tmp/B.DKxdsN/BUILD/kernel-4.14-4.14.90/linux-4.14/include/linux/types.h:6, from /tmp/B.DKxdsN/BUILD/kernel-4.14-4.14.90/linux-4.14/crypto/compress.c:14: /tmp/B.DKxdsN/BUILD/kernel-4.14-4.14.90/linux-4.14/include/uapi/linux/types.h:5:10: fatal error: asm/types.h: No such file or directory #include <asm/types.h> ^~~~~~~~~~~~~ compilation terminated. make[3]: *** [/tmp/B.DKxdsN/BUILD/kernel-4.14-4.14.90/linux-4.14/scripts/Makefile.build:327: crypto/compress.o] Error 1 make[2]: *** [/tmp/B.DKxdsN/BUILD/kernel-4.14-4.14.90/linux-4.14/Makefile:1044: crypto] Error 2 CC [M] arch/x86/crypto/crc32-pclmul_glue.o In file included from /tmp/B.DKxdsN/BUILD/kernel-4.14-4.14.90/linux-4.14/include/linux/skbuff.h:34, from /tmp/B.DKxdsN/BUILD/kernel-4.14-4.14.90/linux-4.14/include/crypto/algapi.h:18, from /tmp/B.DKxdsN/BUILD/kernel-4.14-4.14.90/linux-4.14/include/crypto/internal/hash.h:16, from /tmp/B.DKxdsN/BUILD/kernel-4.14-4.14.90/linux-4.14/arch/x86/crypto/crc32-pclmul_glue.c:34: /tmp/B.DKxdsN/BUILD/kernel-4.14-4.14.90/linux-4.14/include/linux/dma-mapping.h:198:10: fatal error: asm/dma-mapping.h: No such file or directory #include <asm/dma-mapping.h> ^~~~~~~~~~~~~~~~~~~ compilation terminated. make[4]: *** [/tmp/B.DKxdsN/BUILD/kernel-4.14-4.14.90/linux-4.14/scripts/Makefile.build:327: arch/x86/crypto/crc32-pclmul_glue.o] Error 1 make[3]: *** [/tmp/B.DKxdsN/BUILD/kernel-4.14-4.14.90/linux-4.14/scripts/Makefile.build:585: arch/x86/crypto] Error 2 make[3]: *** Waiting for unfinished jobs.... /tmp/B.DKxdsN/BUILD/kernel-4.14-4.14.90/linux-4.14/scripts/Makefile.build:45: /tmp/B.DKxdsN/BUILD/kernel-4.14-4.14.90/linux-4.14/arch/x86/ia32/Makefile: No such file or directory make[4]: *** No rule to make target '/tmp/B.DKxdsN/BUILD/kernel-4.14-4.14.90/linux-4.14/arch/x86/ia32/Makefile'. Stop. make[3]: *** [/tmp/B.DKxdsN/BUILD/kernel-4.14-4.14.90/linux-4.14/scripts/Makefile.build:585: arch/x86/ia32] Error 2 CC mm/swap.o In file included from /tmp/B.DKxdsN/BUILD/kernel-4.14-4.14.90/linux-4.14/include/linux/errno.h:5, from /tmp/B.DKxdsN/BUILD/kernel-4.14-4.14.90/linux-4.14/include/linux/mm.h:5, from /tmp/B.DKxdsN/BUILD/kernel-4.14-4.14.90/linux-4.14/mm/swap.c:16: /tmp/B.DKxdsN/BUILD/kernel-4.14-4.14.90/linux-4.14/include/uapi/linux/errno.h:1:10: fatal error: asm/errno.h: No such file or directory #include <asm/errno.h> ^~~~~~~~~~~~~ compilation terminated. make[3]: *** [/tmp/B.DKxdsN/BUILD/kernel-4.14-4.14.90/linux-4.14/scripts/Makefile.build:326: mm/swap.o] Error 1 make[3]: *** Waiting for unfinished jobs.... CC fs/select.o In file included from /tmp/B.DKxdsN/BUILD/kernel-4.14-4.14.90/linux-4.14/include/linux/kernel.h:7, from /tmp/B.DKxdsN/BUILD/kernel-4.14-4.14.90/linux-4.14/fs/select.c:18: /tmp/B.DKxdsN/BUILD/kernel-4.14-4.14.90/linux-4.14/include/linux/linkage.h:8:10: fatal error: asm/linkage.h: No such file or directory #include <asm/linkage.h> ^~~~~~~~~~~~~~~ compilation terminated. make[3]: *** [/tmp/B.DKxdsN/BUILD/kernel-4.14-4.14.90/linux-4.14/scripts/Makefile.build:327: fs/select.o] Error 1 make[3]: *** Waiting for unfinished jobs.... CC security/apparmor/lib.o In file included from /tmp/B.DKxdsN/BUILD/kernel-4.14-4.14.90/linux-4.14/include/linux/errno.h:5, from /tmp/B.DKxdsN/BUILD/kernel-4.14-4.14.90/linux-4.14/include/linux/mm.h:5, from /tmp/B.DKxdsN/BUILD/kernel-4.14-4.14.90/linux-4.14/security/apparmor/lib.c:16: /tmp/B.DKxdsN/BUILD/kernel-4.14-4.14.90/linux-4.14/include/uapi/linux/errno.h:1:10: fatal error: asm/errno.h: No such file or directory #include <asm/errno.h> ^~~~~~~~~~~~~ compilation terminated. make[4]: *** [/tmp/B.DKxdsN/BUILD/kernel-4.14-4.14.90/linux-4.14/scripts/Makefile.build:326: security/apparmor/lib.o] Error 1 make[4]: *** Waiting for unfinished jobs.... GEN security/selinux/flask.h security/selinux/av_permissions.h CC security/integrity/iint.o In file included from /tmp/B.DKxdsN/BUILD/kernel-4.14-4.14.90/linux-4.14/include/linux/mmdebug.h:5, from /tmp/B.DKxdsN/BUILD/kernel-4.14-4.14.90/linux-4.14/include/linux/gfp.h:5, from /tmp/B.DKxdsN/BUILD/kernel-4.14-4.14.90/linux-4.14/include/linux/slab.h:15, from /tmp/B.DKxdsN/BUILD/kernel-4.14-4.14.90/linux-4.14/security/integrity/iint.c:18: /tmp/B.DKxdsN/BUILD/kernel-4.14-4.14.90/linux-4.14/include/linux/bug.h:5:10: fatal error: asm/bug.h: No such file or directory #include <asm/bug.h> ^~~~~~~~~~~ compilation terminated. make[4]: *** [/tmp/B.DKxdsN/BUILD/kernel-4.14-4.14.90/linux-4.14/scripts/Makefile.build:327: security/integrity/iint.o] Error 1 make[3]: *** [/tmp/B.DKxdsN/BUILD/kernel-4.14-4.14.90/linux-4.14/scripts/Makefile.build:585: security/integrity] Error 2 make[3]: *** Waiting for unfinished jobs.... CC security/smack/smack_lsm.o In file included from /tmp/B.DKxdsN/BUILD/kernel-4.14-4.14.90/linux-4.14/include/linux/mmdebug.h:5, from /tmp/B.DKxdsN/BUILD/kernel-4.14-4.14.90/linux-4.14/include/linux/gfp.h:5, from /tmp/B.DKxdsN/BUILD/kernel-4.14-4.14.90/linux-4.14/include/linux/slab.h:15, from /tmp/B.DKxdsN/BUILD/kernel-4.14-4.14.90/linux-4.14/include/linux/xattr.h:15, from /tmp/B.DKxdsN/BUILD/kernel-4.14-4.14.90/linux-4.14/security/smack/smack_lsm.c:21: /tmp/B.DKxdsN/BUILD/kernel-4.14-4.14.90/linux-4.14/include/linux/bug.h:5:10: fatal error: asm/bug.h: No such file or directory #include <asm/bug.h> ^~~~~~~~~~~ compilation terminated. make[4]: *** [/tmp/B.DKxdsN/BUILD/kernel-4.14-4.14.90/linux-4.14/scripts/Makefile.build:327: security/smack/smack_lsm.o] Error 1 make[3]: *** [/tmp/B.DKxdsN/BUILD/kernel-4.14-4.14.90/linux-4.14/scripts/Makefile.build:585: security/smack] Error 2 CC security/selinux/avc.o In file included from /tmp/B.DKxdsN/BUILD/kernel-4.14-4.14.90/linux-4.14/include/linux/types.h:6, from /tmp/B.DKxdsN/BUILD/kernel-4.14-4.14.90/linux-4.14/security/selinux/avc.c:16: /tmp/B.DKxdsN/BUILD/kernel-4.14-4.14.90/linux-4.14/include/uapi/linux/types.h:5:10: fatal error: asm/types.h: No such file or directory #include <asm/types.h> ^~~~~~~~~~~~~ compilation terminated. make[4]: *** [/tmp/B.DKxdsN/BUILD/kernel-4.14-4.14.90/linux-4.14/scripts/Makefile.build:327: security/selinux/avc.o] Error 1 make[4]: *** Waiting for unfinished jobs.... CC security/keys/gc.o In file included from /tmp/B.DKxdsN/BUILD/kernel-4.14-4.14.90/linux-4.14/include/linux/types.h:6, from /tmp/B.DKxdsN/BUILD/kernel-4.14-4.14.90/linux-4.14/include/linux/list.h:5, from /tmp/B.DKxdsN/BUILD/kernel-4.14-4.14.90/linux-4.14/include/linux/module.h:9, from /tmp/B.DKxdsN/BUILD/kernel-4.14-4.14.90/linux-4.14/security/keys/gc.c:12: /tmp/B.DKxdsN/BUILD/kernel-4.14-4.14.90/linux-4.14/include/uapi/linux/types.h:5:10: fatal error: asm/types.h: No such file or directory #include <asm/types.h> ^~~~~~~~~~~~~ compilation terminated. make[4]: *** [/tmp/B.DKxdsN/BUILD/kernel-4.14-4.14.90/linux-4.14/scripts/Makefile.build:327: security/keys/gc.o] Error 1 make[4]: *** Waiting for unfinished jobs.... CC security/keys/key.o In file included from /tmp/B.DKxdsN/BUILD/kernel-4.14-4.14.90/linux-4.14/include/linux/types.h:6, from /tmp/B.DKxdsN/BUILD/kernel-4.14-4.14.90/linux-4.14/include/linux/list.h:5, from /tmp/B.DKxdsN/BUILD/kernel-4.14-4.14.90/linux-4.14/include/linux/module.h:9, from /tmp/B.DKxdsN/BUILD/kernel-4.14-4.14.90/linux-4.14/security/keys/key.c:12: /tmp/B.DKxdsN/BUILD/kernel-4.14-4.14.90/linux-4.14/include/uapi/linux/types.h:5:10: fatal error: asm/types.h: No such file or directory #include <asm/types.h> ^~~~~~~~~~~~~ compilation terminated. make[4]: *** [/tmp/B.DKxdsN/BUILD/kernel-4.14-4.14.90/linux-4.14/scripts/Makefile.build:327: security/keys/key.o] Error 1 make[3]: *** [/tmp/B.DKxdsN/BUILD/kernel-4.14-4.14.90/linux-4.14/scripts/Makefile.build:585: security/keys] Error 2 CC security/selinux/hooks.o In file included from /tmp/B.DKxdsN/BUILD/kernel-4.14-4.14.90/linux-4.14/include/linux/compiler.h:164, from /tmp/B.DKxdsN/BUILD/kernel-4.14-4.14.90/linux-4.14/include/linux/init.h:5, from /tmp/B.DKxdsN/BUILD/kernel-4.14-4.14.90/linux-4.14/security/selinux/hooks.c:27: /tmp/B.DKxdsN/BUILD/kernel-4.14-4.14.90/linux-4.14/include/uapi/linux/types.h:5:10: fatal error: asm/types.h: No such file or directory #include <asm/types.h> ^~~~~~~~~~~~~ compilation terminated. make[4]: *** [/tmp/B.DKxdsN/BUILD/kernel-4.14-4.14.90/linux-4.14/scripts/Makefile.build:327: security/selinux/hooks.o] Error 1 make[3]: *** [/tmp/B.DKxdsN/BUILD/kernel-4.14-4.14.90/linux-4.14/scripts/Makefile.build:585: security/selinux] Error 2 CC security/apparmor/ipc.o make[3]: *** [/tmp/B.DKxdsN/BUILD/kernel-4.14-4.14.90/linux-4.14/scripts/Makefile.build:585: security/apparmor] Error 2 make[2]: *** [/tmp/B.DKxdsN/BUILD/kernel-4.14-4.14.90/linux-4.14/Makefile:1044: security] Error 2 CC arch/x86/events/intel/p6.o make[4]: *** [/tmp/B.DKxdsN/BUILD/kernel-4.14-4.14.90/linux-4.14/scripts/Makefile.build:585: arch/x86/events/intel] Error 2 make[3]: *** [/tmp/B.DKxdsN/BUILD/kernel-4.14-4.14.90/linux-4.14/scripts/Makefile.build:585: arch/x86/events] Error 2 make[2]: *** [/tmp/B.DKxdsN/BUILD/kernel-4.14-4.14.90/linux-4.14/Makefile:1044: arch/x86] Error 2 CC mm/readahead.o In file included from /tmp/B.DKxdsN/BUILD/kernel-4.14-4.14.90/linux-4.14/include/linux/kernel.h:7, from /tmp/B.DKxdsN/BUILD/kernel-4.14-4.14.90/linux-4.14/mm/readahead.c:10: /tmp/B.DKxdsN/BUILD/kernel-4.14-4.14.90/linux-4.14/include/linux/linkage.h:8:10: fatal error: asm/linkage.h: No such file or directory #include <asm/linkage.h> ^~~~~~~~~~~~~~~ compilation terminated. make[2]: *** [/tmp/B.DKxdsN/BUILD/kernel-4.14-4.14.90/linux-4.14/Makefile:1044: mm] Error 2 CC fs/readdir.o In file included from /tmp/B.DKxdsN/BUILD/kernel-4.14-4.14.90/linux-4.14/include/linux/kernel.h:7, from /tmp/B.DKxdsN/BUILD/kernel-4.14-4.14.90/linux-4.14/fs/readdir.c:9: /tmp/B.DKxdsN/BUILD/kernel-4.14-4.14.90/linux-4.14/include/linux/linkage.h:8:10: fatal error: asm/linkage.h: No such file or directory #include <asm/linkage.h> ^~~~~~~~~~~~~~~ compilation terminated. CC fs/namei.o In file included from /tmp/B.DKxdsN/BUILD/kernel-4.14-4.14.90/linux-4.14/include/linux/compiler.h:164, from /tmp/B.DKxdsN/BUILD/kernel-4.14-4.14.90/linux-4.14/include/linux/init.h:5, from /tmp/B.DKxdsN/BUILD/kernel-4.14-4.14.90/linux-4.14/fs/namei.c:18: /tmp/B.DKxdsN/BUILD/kernel-4.14-4.14.90/linux-4.14/include/uapi/linux/types.h:5:10: fatal error: asm/types.h: No such file or directory #include <asm/types.h> ^~~~~~~~~~~~~ compilation terminated. make[2]: *** [/tmp/B.DKxdsN/BUILD/kernel-4.14-4.14.90/linux-4.14/Makefile:1044: fs] Error 2 make[1]: *** [Makefile:146: sub-make] Error 2 make: *** [Makefile:9: all] Error 2 + rm -rf /tmp/B.DKxdsN Begin-PLD-Builder-Info Build-Time: user:12.30s sys:9.77s real:54.92s (faults io:0 non-io:159774) End-PLD-Builder-Info
[Back to list of logs] [View rpm -qa of builder]