FailedOk

th/SRPMS[OK]
th/x32[OK]
th/i686[OK]
th/x86_64[OK]

ac/SRPMS[OK]
ac/i386[OK]
ac/i586[OK]
ac/i686[OK]
ac/alpha[OK]
ac/amd64[OK]
ac/athlon[OK]
ac/ppc[OK]
ac/sparc[OK]
ac/sparc64[OK]

Advanced Search
main()
Powered by PLD Linux
(c) 2002-2019 PLD Team
$Revision: 1.37 $
Powered by BOFH.
Your IP: 54.226.25.74

kernel 7797fcf3-2e56-4b6a-8d6a-bd8998c4d090

Status:Failed
Source URL:ftp://buildlogs.pld-linux.org/th/x86_64/FAIL/kernel,7797fcf3-2e56-4b6a-8d6a-bd8998c4d090.bz2
text/plain URL:View!
full text:View!
rpm -qa of builder:View!
Date:2018/12/27 01:41:17
Runtime:0:00:35.911337

Toc:

  • error 1
  • error: No files produced.
  • error 2
  • /tmp/B.DKxdsN/BUILD/kernel-4.14-4.14.90/linux-4.14/arch/x86/include/asm/mpspec.h:8:10: fatal error: asm/apicdef.h: No such file or directory
  • error 3
  • compilation terminated.
  • error 4
  • make[3]: *** [/tmp/B.DKxdsN/BUILD/kernel-4.14-4.14.90/linux-4.14/scripts/Makefile.build:326: kernel/resource.o] Error 1
  • error 5
  • make[4]: *** No rule to make target 'arch/x86/crypto/sha256-avx2-asm.o', needed by 'arch/x86/crypto/sha256-ssse3.o'. Stop.
  • error 6
  • x86_64-pld-linux-gcc: error: /tmp/B.DKxdsN/BUILD/kernel-4.14-4.14.90/linux-4.14/arch/x86/crypto/sha256-avx-asm.S: No such file or directory
  • error 7
  • x86_64-pld-linux-gcc: fatal error: no input files
  • error 8
  • compilation terminated.
  • error 9
  • make[4]: *** [/tmp/B.DKxdsN/BUILD/kernel-4.14-4.14.90/linux-4.14/scripts/Makefile.build:427: arch/x86/crypto/sha256-avx-asm.o] Error 1
  • error 10
  • make[5]: *** No rule to make target 'arch/x86/events/intel/rapl.o', needed by 'arch/x86/events/intel/intel-rapl-perf.o'. Stop.
  • error 11
  • x86_64-pld-linux-gcc: error: /tmp/B.DKxdsN/BUILD/kernel-4.14-4.14.90/linux-4.14/arch/x86/events/intel/pt.c: No such file or directory
  • error 12
  • x86_64-pld-linux-gcc: fatal error: no input files
  • error 13
  • compilation terminated.
  • error 14
  • make[5]: *** [/tmp/B.DKxdsN/BUILD/kernel-4.14-4.14.90/linux-4.14/scripts/Makefile.build:327: arch/x86/events/intel/pt.o] Error 1
  • error 15
  • /tmp/B.DKxdsN/BUILD/kernel-4.14-4.14.90/linux-4.14/include/linux/highmem.h:12:10: fatal error: asm/cacheflush.h: No such file or directory
  • error 16
  • compilation terminated.
  • error 17
  • make[3]: *** [/tmp/B.DKxdsN/BUILD/kernel-4.14-4.14.90/linux-4.14/scripts/Makefile.build:327: crypto/cipher.o] Error 1
  • error 18
  • /tmp/B.DKxdsN/BUILD/kernel-4.14-4.14.90/linux-4.14/include/linux/device.h:30:10: fatal error: asm/device.h: No such file or directory
  • error 19
  • compilation terminated.
  • error 20
  • make[3]: *** [/tmp/B.DKxdsN/BUILD/kernel-4.14-4.14.90/linux-4.14/scripts/Makefile.build:326: kernel/softirq.o] Error 1
  • error 21
  • make[2]: *** [/tmp/B.DKxdsN/BUILD/kernel-4.14-4.14.90/linux-4.14/Makefile:1044: kernel] Error 2
  • error 22
  • /tmp/B.DKxdsN/BUILD/kernel-4.14-4.14.90/linux-4.14/include/uapi/linux/types.h:5:10: fatal error: asm/types.h: No such file or directory
  • error 23
  • compilation terminated.
  • error 24
  • make[3]: *** [/tmp/B.DKxdsN/BUILD/kernel-4.14-4.14.90/linux-4.14/scripts/Makefile.build:327: crypto/compress.o] Error 1
  • error 25
  • make[2]: *** [/tmp/B.DKxdsN/BUILD/kernel-4.14-4.14.90/linux-4.14/Makefile:1044: crypto] Error 2
  • error 26
  • /tmp/B.DKxdsN/BUILD/kernel-4.14-4.14.90/linux-4.14/include/linux/dma-mapping.h:198:10: fatal error: asm/dma-mapping.h: No such file or directory
  • error 27
  • compilation terminated.
  • error 28
  • make[4]: *** [/tmp/B.DKxdsN/BUILD/kernel-4.14-4.14.90/linux-4.14/scripts/Makefile.build:327: arch/x86/crypto/crc32-pclmul_glue.o] Error 1
  • error 29
  • make[3]: *** [/tmp/B.DKxdsN/BUILD/kernel-4.14-4.14.90/linux-4.14/scripts/Makefile.build:585: arch/x86/crypto] Error 2
  • error 30
  • make[4]: *** No rule to make target '/tmp/B.DKxdsN/BUILD/kernel-4.14-4.14.90/linux-4.14/arch/x86/ia32/Makefile'. Stop.
  • error 31
  • make[3]: *** [/tmp/B.DKxdsN/BUILD/kernel-4.14-4.14.90/linux-4.14/scripts/Makefile.build:585: arch/x86/ia32] Error 2
  • error 32
  • /tmp/B.DKxdsN/BUILD/kernel-4.14-4.14.90/linux-4.14/include/uapi/linux/errno.h:1:10: fatal error: asm/errno.h: No such file or directory
  • error 33
  • compilation terminated.
  • error 34
  • make[3]: *** [/tmp/B.DKxdsN/BUILD/kernel-4.14-4.14.90/linux-4.14/scripts/Makefile.build:326: mm/swap.o] Error 1
  • error 35
  • /tmp/B.DKxdsN/BUILD/kernel-4.14-4.14.90/linux-4.14/include/linux/linkage.h:8:10: fatal error: asm/linkage.h: No such file or directory
  • error 36
  • compilation terminated.
  • error 37
  • make[3]: *** [/tmp/B.DKxdsN/BUILD/kernel-4.14-4.14.90/linux-4.14/scripts/Makefile.build:327: fs/select.o] Error 1
  • error 38
  • /tmp/B.DKxdsN/BUILD/kernel-4.14-4.14.90/linux-4.14/include/uapi/linux/errno.h:1:10: fatal error: asm/errno.h: No such file or directory
  • error 39
  • compilation terminated.
  • error 40
  • make[4]: *** [/tmp/B.DKxdsN/BUILD/kernel-4.14-4.14.90/linux-4.14/scripts/Makefile.build:326: security/apparmor/lib.o] Error 1
  • error 41
  • /tmp/B.DKxdsN/BUILD/kernel-4.14-4.14.90/linux-4.14/include/linux/bug.h:5:10: fatal error: asm/bug.h: No such file or directory
  • error 42
  • compilation terminated.
  • error 43
  • make[4]: *** [/tmp/B.DKxdsN/BUILD/kernel-4.14-4.14.90/linux-4.14/scripts/Makefile.build:327: security/integrity/iint.o] Error 1
  • error 44
  • make[3]: *** [/tmp/B.DKxdsN/BUILD/kernel-4.14-4.14.90/linux-4.14/scripts/Makefile.build:585: security/integrity] Error 2
  • error 45
  • /tmp/B.DKxdsN/BUILD/kernel-4.14-4.14.90/linux-4.14/include/linux/bug.h:5:10: fatal error: asm/bug.h: No such file or directory
  • error 46
  • compilation terminated.
  • error 47
  • make[4]: *** [/tmp/B.DKxdsN/BUILD/kernel-4.14-4.14.90/linux-4.14/scripts/Makefile.build:327: security/smack/smack_lsm.o] Error 1
  • error 48
  • make[3]: *** [/tmp/B.DKxdsN/BUILD/kernel-4.14-4.14.90/linux-4.14/scripts/Makefile.build:585: security/smack] Error 2
  • error 49
  • /tmp/B.DKxdsN/BUILD/kernel-4.14-4.14.90/linux-4.14/include/uapi/linux/types.h:5:10: fatal error: asm/types.h: No such file or directory
  • error 50
  • compilation terminated.
  • error 51
  • make[4]: *** [/tmp/B.DKxdsN/BUILD/kernel-4.14-4.14.90/linux-4.14/scripts/Makefile.build:327: security/selinux/avc.o] Error 1
  • error 52
  • /tmp/B.DKxdsN/BUILD/kernel-4.14-4.14.90/linux-4.14/include/uapi/linux/types.h:5:10: fatal error: asm/types.h: No such file or directory
  • error 53
  • compilation terminated.
  • error 54
  • make[4]: *** [/tmp/B.DKxdsN/BUILD/kernel-4.14-4.14.90/linux-4.14/scripts/Makefile.build:327: security/keys/gc.o] Error 1
  • error 55
  • /tmp/B.DKxdsN/BUILD/kernel-4.14-4.14.90/linux-4.14/include/uapi/linux/types.h:5:10: fatal error: asm/types.h: No such file or directory
  • error 56
  • compilation terminated.
  • error 57
  • make[4]: *** [/tmp/B.DKxdsN/BUILD/kernel-4.14-4.14.90/linux-4.14/scripts/Makefile.build:327: security/keys/key.o] Error 1
  • error 58
  • make[3]: *** [/tmp/B.DKxdsN/BUILD/kernel-4.14-4.14.90/linux-4.14/scripts/Makefile.build:585: security/keys] Error 2
  • error 59
  • /tmp/B.DKxdsN/BUILD/kernel-4.14-4.14.90/linux-4.14/include/uapi/linux/types.h:5:10: fatal error: asm/types.h: No such file or directory
  • error 60
  • compilation terminated.
  • error 61
  • make[4]: *** [/tmp/B.DKxdsN/BUILD/kernel-4.14-4.14.90/linux-4.14/scripts/Makefile.build:327: security/selinux/hooks.o] Error 1
  • error 62
  • make[3]: *** [/tmp/B.DKxdsN/BUILD/kernel-4.14-4.14.90/linux-4.14/scripts/Makefile.build:585: security/selinux] Error 2
  • error 63
  • make[3]: *** [/tmp/B.DKxdsN/BUILD/kernel-4.14-4.14.90/linux-4.14/scripts/Makefile.build:585: security/apparmor] Error 2
  • error 64
  • make[2]: *** [/tmp/B.DKxdsN/BUILD/kernel-4.14-4.14.90/linux-4.14/Makefile:1044: security] Error 2
  • error 65
  • make[4]: *** [/tmp/B.DKxdsN/BUILD/kernel-4.14-4.14.90/linux-4.14/scripts/Makefile.build:585: arch/x86/events/intel] Error 2
  • error 66
  • make[3]: *** [/tmp/B.DKxdsN/BUILD/kernel-4.14-4.14.90/linux-4.14/scripts/Makefile.build:585: arch/x86/events] Error 2
  • error 67
  • make[2]: *** [/tmp/B.DKxdsN/BUILD/kernel-4.14-4.14.90/linux-4.14/Makefile:1044: arch/x86] Error 2
  • error 68
  • /tmp/B.DKxdsN/BUILD/kernel-4.14-4.14.90/linux-4.14/include/linux/linkage.h:8:10: fatal error: asm/linkage.h: No such file or directory
  • error 69
  • compilation terminated.
  • error 70
  • make[2]: *** [/tmp/B.DKxdsN/BUILD/kernel-4.14-4.14.90/linux-4.14/Makefile:1044: mm] Error 2
  • error 71
  • /tmp/B.DKxdsN/BUILD/kernel-4.14-4.14.90/linux-4.14/include/linux/linkage.h:8:10: fatal error: asm/linkage.h: No such file or directory
  • error 72
  • compilation terminated.
  • error 73
  • /tmp/B.DKxdsN/BUILD/kernel-4.14-4.14.90/linux-4.14/include/uapi/linux/types.h:5:10: fatal error: asm/types.h: No such file or directory
  • error 74
  • compilation terminated.
  • error 75
  • make[2]: *** [/tmp/B.DKxdsN/BUILD/kernel-4.14-4.14.90/linux-4.14/Makefile:1044: fs] Error 2
  • error 76
  • make[1]: *** [Makefile:146: sub-make] Error 2

Content:

  CC      arch/x86/entry/vdso/vclock_gettime.o
  CC      init/do_mounts.o
  CC      arch/x86/entry/vdso/vgetcpu.o
  CC      fs/read_write.o
  CC      arch/x86/events/amd/core.o
  HOSTCC  arch/x86/entry/vdso/vdso2c
  CC [M]  arch/x86/crypto/camellia_glue.o
  LDS     arch/x86/entry/vdso/vdsox32.lds
  X32     arch/x86/entry/vdso/vdso-note-x32.o
  X32     arch/x86/entry/vdso/vclock_gettime-x32.o
  X32     arch/x86/entry/vdso/vgetcpu-x32.o
  CC      mm/mempool.o
  LDS     arch/x86/entry/vdso/vdso32/vdso32.lds
  CC      kernel/panic.o
  AS [M]  arch/x86/crypto/blowfish-x86_64-asm_64.o
  CC      arch/x86/events/amd/uncore.o
  CC      ipc/sem.o
  CC      init/do_mounts_rd.o
  CC      arch/x86/entry/vdso/vdso32/vclock_gettime.o
  AS      arch/x86/entry/vdso/vdso32/note.o
  CC      fs/file_table.o
  AS      arch/x86/entry/vdso/vdso32/system_call.o
  AS      arch/x86/entry/vdso/vdso32/sigreturn.o
  CC [M]  arch/x86/crypto/blowfish_glue.o
  AS [M]  arch/x86/crypto/twofish-x86_64-asm_64.o
  CC      init/do_mounts_initrd.o
  VDSO    arch/x86/entry/vdso/vdso64.so.dbg
  VDSO    arch/x86/entry/vdso/vdsox32.so.dbg
  CC [M]  arch/x86/crypto/twofish_glue.o
  CC      ipc/shm.o
  AS [M]  arch/x86/crypto/twofish-x86_64-asm_64-3way.o
  VDSO    arch/x86/entry/vdso/vdso32.so.dbg
  CC      arch/x86/events/amd/ibs.o
  CC      mm/oom_kill.o
  OBJCOPY arch/x86/entry/vdso/vdso64.so
  OBJCOPY arch/x86/entry/vdso/vdsox32.so
  OBJCOPY arch/x86/entry/vdso/vdso32.so
  VDSO2C  arch/x86/entry/vdso/vdso-image-64.c
  VDSO2C  arch/x86/entry/vdso/vdso-image-x32.c
  VDSO2C  arch/x86/entry/vdso/vdso-image-32.c
  CC      arch/x86/entry/vdso/vdso-image-64.o
  CC      init/initramfs.o
  CC      kernel/cpu.o
  CC      arch/x86/entry/vdso/vdso-image-x32.o
  CC      ipc/syscall.o
  CC      init/calibrate.o
  CC      arch/x86/events/amd/iommu.o
  CC      mm/maccess.o
  CC      arch/x86/entry/vdso/vdso-image-32.o
  AR      arch/x86/entry/vdso/built-in.o
  CC      fs/super.o
  CC [M]  arch/x86/crypto/twofish_glue_3way.o
  AS [M]  arch/x86/crypto/chacha20-ssse3-x86_64.o
  CC      ipc/ipc_sysctl.o
  CC      arch/x86/entry/vsyscall/vsyscall_gtod.o
  CC [M]  arch/x86/events/amd/power.o
  AR      arch/x86/events/amd/built-in.o
  CC      init/init_task.o
  CC [M]  arch/x86/crypto/chacha20_glue.o
  AS [M]  arch/x86/crypto/chacha20-avx2-x86_64.o
  AS [M]  arch/x86/crypto/serpent-sse2-x86_64-asm_64.o
  CC      arch/x86/entry/vsyscall/vsyscall_64.o
  AS      arch/x86/entry/vsyscall/vsyscall_emu_64.o
  AR      arch/x86/entry/vsyscall/built-in.o
  CC      fs/char_dev.o
  CC      init/version.o
  AR      init/mounts.o
  AR      init/built-in.o
  AS      arch/x86/entry/entry_64_compat.o
  CC [M]  arch/x86/crypto/serpent_sse2_glue.o
  CC      arch/x86/entry/syscall_32.o
  AR      arch/x86/entry/built-in.o
  CC      ipc/mqueue.o
  AS [M]  arch/x86/crypto/aesni-intel_asm.o
  CC      ipc/namespace.o
  CC      arch/x86/events/intel/bts.o
  CC      fs/stat.o
  CC      ipc/mq_sysctl.o
  AR      ipc/built-in.o
  CC      arch/x86/events/intel/core.o
  CC [M]  arch/x86/crypto/aesni-intel_glue.o
  CC      arch/x86/events/msr.o
  CC      arch/x86/hyperv/hv_init.o
  CC [M]  arch/x86/crypto/fpu.o
  CC      mm/page_alloc.o
  AS [M]  arch/x86/crypto/aesni-intel_avx-x86_64.o
  AS [M]  arch/x86/crypto/aes_ctrby8_avx-x86_64.o
  AS [M]  arch/x86/crypto/ghash-clmulni-intel_asm.o
  CC      arch/x86/events/intel/ds.o
  CC      arch/x86/hyperv/mmu.o
  AR      arch/x86/hyperv/built-in.o
  CC      security/apparmor/apparmorfs.o
  CC      fs/exec.o
  CC [M]  arch/x86/crypto/ghash-clmulni-intel_glue.o
  CC      fs/pipe.o
  CC      arch/x86/events/intel/knc.o
  GEN     security/apparmor/capability_names.h
Terminated
ended at: Thu Dec 27 01:41:09 2018, done in 0:00:35.911337
error: No files produced.
+ chmod -R u+rwX /tmp/B.DKxdsN/BUILD
  CC [M]  arch/x86/crypto/crc32c-intel_glue.o
  CC      security/apparmor/audit.o
  AS [M]  arch/x86/crypto/crc32c-pcl-intel-asm_64.o
  AS [M]  arch/x86/crypto/sha1_ssse3_asm.o
  CC      arch/x86/events/intel/lbr.o
  CC      security/apparmor/context.o
+ rm -rf /tmp/B.DKxdsN/tmp /tmp/B.DKxdsN/BUILD
  CC      fs/fcntl.o
  CC      mm/page-writeback.o
  CC      arch/x86/events/intel/p4.o
  CC [M]  arch/x86/crypto/sha1_ssse3_glue.o
  AS [M]  arch/x86/crypto/sha1_avx2_x86_64_asm.o
  CC      crypto/api.o
  AS [M]  arch/x86/crypto/sha1_ni_asm.o
  CC      fs/ioctl.o
  CC      kernel/exit.o
  AS [M]  arch/x86/crypto/crc32-pclmul_asm.o
  AS [M]  arch/x86/crypto/sha256-ssse3-asm.o
  CC      kernel/resource.o
In file included from /tmp/B.DKxdsN/BUILD/kernel-4.14-4.14.90/linux-4.14/arch/x86/include/asm/smp.h:12,
                 from /tmp/B.DKxdsN/BUILD/kernel-4.14-4.14.90/linux-4.14/arch/x86/include/asm/mmzone_64.h:11,
                 from /tmp/B.DKxdsN/BUILD/kernel-4.14-4.14.90/linux-4.14/arch/x86/include/asm/mmzone.h:5,
                 from /tmp/B.DKxdsN/BUILD/kernel-4.14-4.14.90/linux-4.14/include/linux/mmzone.h:919,
                 from /tmp/B.DKxdsN/BUILD/kernel-4.14-4.14.90/linux-4.14/include/linux/gfp.h:6,
                 from /tmp/B.DKxdsN/BUILD/kernel-4.14-4.14.90/linux-4.14/include/linux/slab.h:15,
                 from /tmp/B.DKxdsN/BUILD/kernel-4.14-4.14.90/linux-4.14/kernel/resource.c:16:
/tmp/B.DKxdsN/BUILD/kernel-4.14-4.14.90/linux-4.14/arch/x86/include/asm/mpspec.h:8:10: fatal error: asm/apicdef.h: No such file or directory
 #include <asm/apicdef.h>
          ^~~~~~~~~~~~~~~
compilation terminated.
make[3]: *** [/tmp/B.DKxdsN/BUILD/kernel-4.14-4.14.90/linux-4.14/scripts/Makefile.build:326: kernel/resource.o] Error 1
make[3]: *** Waiting for unfinished jobs....
make[4]: *** No rule to make target 'arch/x86/crypto/sha256-avx2-asm.o', needed by 'arch/x86/crypto/sha256-ssse3.o'.  Stop.
make[4]: *** Waiting for unfinished jobs....
  AS [M]  arch/x86/crypto/sha256-avx-asm.o
x86_64-pld-linux-gcc: error: /tmp/B.DKxdsN/BUILD/kernel-4.14-4.14.90/linux-4.14/arch/x86/crypto/sha256-avx-asm.S: No such file or directory
x86_64-pld-linux-gcc: fatal error: no input files
compilation terminated.
make[4]: *** [/tmp/B.DKxdsN/BUILD/kernel-4.14-4.14.90/linux-4.14/scripts/Makefile.build:427: arch/x86/crypto/sha256-avx-asm.o] Error 1
make[5]: *** No rule to make target 'arch/x86/events/intel/rapl.o', needed by 'arch/x86/events/intel/intel-rapl-perf.o'.  Stop.
make[5]: *** Waiting for unfinished jobs....
  CC      arch/x86/events/intel/pt.o
x86_64-pld-linux-gcc: error: /tmp/B.DKxdsN/BUILD/kernel-4.14-4.14.90/linux-4.14/arch/x86/events/intel/pt.c: No such file or directory
x86_64-pld-linux-gcc: fatal error: no input files
compilation terminated.
make[5]: *** [/tmp/B.DKxdsN/BUILD/kernel-4.14-4.14.90/linux-4.14/scripts/Makefile.build:327: arch/x86/events/intel/pt.o] Error 1
  CC      crypto/cipher.o
In file included from /tmp/B.DKxdsN/BUILD/kernel-4.14-4.14.90/linux-4.14/crypto/internal.h:19,
                 from /tmp/B.DKxdsN/BUILD/kernel-4.14-4.14.90/linux-4.14/crypto/cipher.c:21:
/tmp/B.DKxdsN/BUILD/kernel-4.14-4.14.90/linux-4.14/include/linux/highmem.h:12:10: fatal error: asm/cacheflush.h: No such file or directory
 #include <asm/cacheflush.h>
          ^~~~~~~~~~~~~~~~~~
compilation terminated.
make[3]: *** [/tmp/B.DKxdsN/BUILD/kernel-4.14-4.14.90/linux-4.14/scripts/Makefile.build:327: crypto/cipher.o] Error 1
make[3]: *** Waiting for unfinished jobs....
  CC      kernel/softirq.o
In file included from /tmp/B.DKxdsN/BUILD/kernel-4.14-4.14.90/linux-4.14/include/linux/node.h:18,
                 from /tmp/B.DKxdsN/BUILD/kernel-4.14-4.14.90/linux-4.14/include/linux/cpu.h:17,
                 from /tmp/B.DKxdsN/BUILD/kernel-4.14-4.14.90/linux-4.14/kernel/softirq.c:20:
/tmp/B.DKxdsN/BUILD/kernel-4.14-4.14.90/linux-4.14/include/linux/device.h:30:10: fatal error: asm/device.h: No such file or directory
 #include <asm/device.h>
          ^~~~~~~~~~~~~~
compilation terminated.
make[3]: *** [/tmp/B.DKxdsN/BUILD/kernel-4.14-4.14.90/linux-4.14/scripts/Makefile.build:326: kernel/softirq.o] Error 1
make[2]: *** [/tmp/B.DKxdsN/BUILD/kernel-4.14-4.14.90/linux-4.14/Makefile:1044: kernel] Error 2
make[2]: *** Waiting for unfinished jobs....
  CC      crypto/compress.o
In file included from /tmp/B.DKxdsN/BUILD/kernel-4.14-4.14.90/linux-4.14/include/linux/types.h:6,
                 from /tmp/B.DKxdsN/BUILD/kernel-4.14-4.14.90/linux-4.14/crypto/compress.c:14:
/tmp/B.DKxdsN/BUILD/kernel-4.14-4.14.90/linux-4.14/include/uapi/linux/types.h:5:10: fatal error: asm/types.h: No such file or directory
 #include <asm/types.h>
          ^~~~~~~~~~~~~
compilation terminated.
make[3]: *** [/tmp/B.DKxdsN/BUILD/kernel-4.14-4.14.90/linux-4.14/scripts/Makefile.build:327: crypto/compress.o] Error 1
make[2]: *** [/tmp/B.DKxdsN/BUILD/kernel-4.14-4.14.90/linux-4.14/Makefile:1044: crypto] Error 2
  CC [M]  arch/x86/crypto/crc32-pclmul_glue.o
In file included from /tmp/B.DKxdsN/BUILD/kernel-4.14-4.14.90/linux-4.14/include/linux/skbuff.h:34,
                 from /tmp/B.DKxdsN/BUILD/kernel-4.14-4.14.90/linux-4.14/include/crypto/algapi.h:18,
                 from /tmp/B.DKxdsN/BUILD/kernel-4.14-4.14.90/linux-4.14/include/crypto/internal/hash.h:16,
                 from /tmp/B.DKxdsN/BUILD/kernel-4.14-4.14.90/linux-4.14/arch/x86/crypto/crc32-pclmul_glue.c:34:
/tmp/B.DKxdsN/BUILD/kernel-4.14-4.14.90/linux-4.14/include/linux/dma-mapping.h:198:10: fatal error: asm/dma-mapping.h: No such file or directory
 #include <asm/dma-mapping.h>
          ^~~~~~~~~~~~~~~~~~~
compilation terminated.
make[4]: *** [/tmp/B.DKxdsN/BUILD/kernel-4.14-4.14.90/linux-4.14/scripts/Makefile.build:327: arch/x86/crypto/crc32-pclmul_glue.o] Error 1
make[3]: *** [/tmp/B.DKxdsN/BUILD/kernel-4.14-4.14.90/linux-4.14/scripts/Makefile.build:585: arch/x86/crypto] Error 2
make[3]: *** Waiting for unfinished jobs....
/tmp/B.DKxdsN/BUILD/kernel-4.14-4.14.90/linux-4.14/scripts/Makefile.build:45: /tmp/B.DKxdsN/BUILD/kernel-4.14-4.14.90/linux-4.14/arch/x86/ia32/Makefile: No such file or directory
make[4]: *** No rule to make target '/tmp/B.DKxdsN/BUILD/kernel-4.14-4.14.90/linux-4.14/arch/x86/ia32/Makefile'.  Stop.
make[3]: *** [/tmp/B.DKxdsN/BUILD/kernel-4.14-4.14.90/linux-4.14/scripts/Makefile.build:585: arch/x86/ia32] Error 2
  CC      mm/swap.o
In file included from /tmp/B.DKxdsN/BUILD/kernel-4.14-4.14.90/linux-4.14/include/linux/errno.h:5,
                 from /tmp/B.DKxdsN/BUILD/kernel-4.14-4.14.90/linux-4.14/include/linux/mm.h:5,
                 from /tmp/B.DKxdsN/BUILD/kernel-4.14-4.14.90/linux-4.14/mm/swap.c:16:
/tmp/B.DKxdsN/BUILD/kernel-4.14-4.14.90/linux-4.14/include/uapi/linux/errno.h:1:10: fatal error: asm/errno.h: No such file or directory
 #include <asm/errno.h>
          ^~~~~~~~~~~~~
compilation terminated.
make[3]: *** [/tmp/B.DKxdsN/BUILD/kernel-4.14-4.14.90/linux-4.14/scripts/Makefile.build:326: mm/swap.o] Error 1
make[3]: *** Waiting for unfinished jobs....
  CC      fs/select.o
In file included from /tmp/B.DKxdsN/BUILD/kernel-4.14-4.14.90/linux-4.14/include/linux/kernel.h:7,
                 from /tmp/B.DKxdsN/BUILD/kernel-4.14-4.14.90/linux-4.14/fs/select.c:18:
/tmp/B.DKxdsN/BUILD/kernel-4.14-4.14.90/linux-4.14/include/linux/linkage.h:8:10: fatal error: asm/linkage.h: No such file or directory
 #include <asm/linkage.h>
          ^~~~~~~~~~~~~~~
compilation terminated.
make[3]: *** [/tmp/B.DKxdsN/BUILD/kernel-4.14-4.14.90/linux-4.14/scripts/Makefile.build:327: fs/select.o] Error 1
make[3]: *** Waiting for unfinished jobs....
  CC      security/apparmor/lib.o
In file included from /tmp/B.DKxdsN/BUILD/kernel-4.14-4.14.90/linux-4.14/include/linux/errno.h:5,
                 from /tmp/B.DKxdsN/BUILD/kernel-4.14-4.14.90/linux-4.14/include/linux/mm.h:5,
                 from /tmp/B.DKxdsN/BUILD/kernel-4.14-4.14.90/linux-4.14/security/apparmor/lib.c:16:
/tmp/B.DKxdsN/BUILD/kernel-4.14-4.14.90/linux-4.14/include/uapi/linux/errno.h:1:10: fatal error: asm/errno.h: No such file or directory
 #include <asm/errno.h>
          ^~~~~~~~~~~~~
compilation terminated.
make[4]: *** [/tmp/B.DKxdsN/BUILD/kernel-4.14-4.14.90/linux-4.14/scripts/Makefile.build:326: security/apparmor/lib.o] Error 1
make[4]: *** Waiting for unfinished jobs....
  GEN     security/selinux/flask.h security/selinux/av_permissions.h
  CC      security/integrity/iint.o
In file included from /tmp/B.DKxdsN/BUILD/kernel-4.14-4.14.90/linux-4.14/include/linux/mmdebug.h:5,
                 from /tmp/B.DKxdsN/BUILD/kernel-4.14-4.14.90/linux-4.14/include/linux/gfp.h:5,
                 from /tmp/B.DKxdsN/BUILD/kernel-4.14-4.14.90/linux-4.14/include/linux/slab.h:15,
                 from /tmp/B.DKxdsN/BUILD/kernel-4.14-4.14.90/linux-4.14/security/integrity/iint.c:18:
/tmp/B.DKxdsN/BUILD/kernel-4.14-4.14.90/linux-4.14/include/linux/bug.h:5:10: fatal error: asm/bug.h: No such file or directory
 #include <asm/bug.h>
          ^~~~~~~~~~~
compilation terminated.
make[4]: *** [/tmp/B.DKxdsN/BUILD/kernel-4.14-4.14.90/linux-4.14/scripts/Makefile.build:327: security/integrity/iint.o] Error 1
make[3]: *** [/tmp/B.DKxdsN/BUILD/kernel-4.14-4.14.90/linux-4.14/scripts/Makefile.build:585: security/integrity] Error 2
make[3]: *** Waiting for unfinished jobs....
  CC      security/smack/smack_lsm.o
In file included from /tmp/B.DKxdsN/BUILD/kernel-4.14-4.14.90/linux-4.14/include/linux/mmdebug.h:5,
                 from /tmp/B.DKxdsN/BUILD/kernel-4.14-4.14.90/linux-4.14/include/linux/gfp.h:5,
                 from /tmp/B.DKxdsN/BUILD/kernel-4.14-4.14.90/linux-4.14/include/linux/slab.h:15,
                 from /tmp/B.DKxdsN/BUILD/kernel-4.14-4.14.90/linux-4.14/include/linux/xattr.h:15,
                 from /tmp/B.DKxdsN/BUILD/kernel-4.14-4.14.90/linux-4.14/security/smack/smack_lsm.c:21:
/tmp/B.DKxdsN/BUILD/kernel-4.14-4.14.90/linux-4.14/include/linux/bug.h:5:10: fatal error: asm/bug.h: No such file or directory
 #include <asm/bug.h>
          ^~~~~~~~~~~
compilation terminated.
make[4]: *** [/tmp/B.DKxdsN/BUILD/kernel-4.14-4.14.90/linux-4.14/scripts/Makefile.build:327: security/smack/smack_lsm.o] Error 1
make[3]: *** [/tmp/B.DKxdsN/BUILD/kernel-4.14-4.14.90/linux-4.14/scripts/Makefile.build:585: security/smack] Error 2
  CC      security/selinux/avc.o
In file included from /tmp/B.DKxdsN/BUILD/kernel-4.14-4.14.90/linux-4.14/include/linux/types.h:6,
                 from /tmp/B.DKxdsN/BUILD/kernel-4.14-4.14.90/linux-4.14/security/selinux/avc.c:16:
/tmp/B.DKxdsN/BUILD/kernel-4.14-4.14.90/linux-4.14/include/uapi/linux/types.h:5:10: fatal error: asm/types.h: No such file or directory
 #include <asm/types.h>
          ^~~~~~~~~~~~~
compilation terminated.
make[4]: *** [/tmp/B.DKxdsN/BUILD/kernel-4.14-4.14.90/linux-4.14/scripts/Makefile.build:327: security/selinux/avc.o] Error 1
make[4]: *** Waiting for unfinished jobs....
  CC      security/keys/gc.o
In file included from /tmp/B.DKxdsN/BUILD/kernel-4.14-4.14.90/linux-4.14/include/linux/types.h:6,
                 from /tmp/B.DKxdsN/BUILD/kernel-4.14-4.14.90/linux-4.14/include/linux/list.h:5,
                 from /tmp/B.DKxdsN/BUILD/kernel-4.14-4.14.90/linux-4.14/include/linux/module.h:9,
                 from /tmp/B.DKxdsN/BUILD/kernel-4.14-4.14.90/linux-4.14/security/keys/gc.c:12:
/tmp/B.DKxdsN/BUILD/kernel-4.14-4.14.90/linux-4.14/include/uapi/linux/types.h:5:10: fatal error: asm/types.h: No such file or directory
 #include <asm/types.h>
          ^~~~~~~~~~~~~
compilation terminated.
make[4]: *** [/tmp/B.DKxdsN/BUILD/kernel-4.14-4.14.90/linux-4.14/scripts/Makefile.build:327: security/keys/gc.o] Error 1
make[4]: *** Waiting for unfinished jobs....
  CC      security/keys/key.o
In file included from /tmp/B.DKxdsN/BUILD/kernel-4.14-4.14.90/linux-4.14/include/linux/types.h:6,
                 from /tmp/B.DKxdsN/BUILD/kernel-4.14-4.14.90/linux-4.14/include/linux/list.h:5,
                 from /tmp/B.DKxdsN/BUILD/kernel-4.14-4.14.90/linux-4.14/include/linux/module.h:9,
                 from /tmp/B.DKxdsN/BUILD/kernel-4.14-4.14.90/linux-4.14/security/keys/key.c:12:
/tmp/B.DKxdsN/BUILD/kernel-4.14-4.14.90/linux-4.14/include/uapi/linux/types.h:5:10: fatal error: asm/types.h: No such file or directory
 #include <asm/types.h>
          ^~~~~~~~~~~~~
compilation terminated.
make[4]: *** [/tmp/B.DKxdsN/BUILD/kernel-4.14-4.14.90/linux-4.14/scripts/Makefile.build:327: security/keys/key.o] Error 1
make[3]: *** [/tmp/B.DKxdsN/BUILD/kernel-4.14-4.14.90/linux-4.14/scripts/Makefile.build:585: security/keys] Error 2
  CC      security/selinux/hooks.o
In file included from /tmp/B.DKxdsN/BUILD/kernel-4.14-4.14.90/linux-4.14/include/linux/compiler.h:164,
                 from /tmp/B.DKxdsN/BUILD/kernel-4.14-4.14.90/linux-4.14/include/linux/init.h:5,
                 from /tmp/B.DKxdsN/BUILD/kernel-4.14-4.14.90/linux-4.14/security/selinux/hooks.c:27:
/tmp/B.DKxdsN/BUILD/kernel-4.14-4.14.90/linux-4.14/include/uapi/linux/types.h:5:10: fatal error: asm/types.h: No such file or directory
 #include <asm/types.h>
          ^~~~~~~~~~~~~
compilation terminated.
make[4]: *** [/tmp/B.DKxdsN/BUILD/kernel-4.14-4.14.90/linux-4.14/scripts/Makefile.build:327: security/selinux/hooks.o] Error 1
make[3]: *** [/tmp/B.DKxdsN/BUILD/kernel-4.14-4.14.90/linux-4.14/scripts/Makefile.build:585: security/selinux] Error 2
  CC      security/apparmor/ipc.o
make[3]: *** [/tmp/B.DKxdsN/BUILD/kernel-4.14-4.14.90/linux-4.14/scripts/Makefile.build:585: security/apparmor] Error 2
make[2]: *** [/tmp/B.DKxdsN/BUILD/kernel-4.14-4.14.90/linux-4.14/Makefile:1044: security] Error 2
  CC      arch/x86/events/intel/p6.o
make[4]: *** [/tmp/B.DKxdsN/BUILD/kernel-4.14-4.14.90/linux-4.14/scripts/Makefile.build:585: arch/x86/events/intel] Error 2
make[3]: *** [/tmp/B.DKxdsN/BUILD/kernel-4.14-4.14.90/linux-4.14/scripts/Makefile.build:585: arch/x86/events] Error 2
make[2]: *** [/tmp/B.DKxdsN/BUILD/kernel-4.14-4.14.90/linux-4.14/Makefile:1044: arch/x86] Error 2
  CC      mm/readahead.o
In file included from /tmp/B.DKxdsN/BUILD/kernel-4.14-4.14.90/linux-4.14/include/linux/kernel.h:7,
                 from /tmp/B.DKxdsN/BUILD/kernel-4.14-4.14.90/linux-4.14/mm/readahead.c:10:
/tmp/B.DKxdsN/BUILD/kernel-4.14-4.14.90/linux-4.14/include/linux/linkage.h:8:10: fatal error: asm/linkage.h: No such file or directory
 #include <asm/linkage.h>
          ^~~~~~~~~~~~~~~
compilation terminated.
make[2]: *** [/tmp/B.DKxdsN/BUILD/kernel-4.14-4.14.90/linux-4.14/Makefile:1044: mm] Error 2
  CC      fs/readdir.o
In file included from /tmp/B.DKxdsN/BUILD/kernel-4.14-4.14.90/linux-4.14/include/linux/kernel.h:7,
                 from /tmp/B.DKxdsN/BUILD/kernel-4.14-4.14.90/linux-4.14/fs/readdir.c:9:
/tmp/B.DKxdsN/BUILD/kernel-4.14-4.14.90/linux-4.14/include/linux/linkage.h:8:10: fatal error: asm/linkage.h: No such file or directory
 #include <asm/linkage.h>
          ^~~~~~~~~~~~~~~
compilation terminated.
  CC      fs/namei.o
In file included from /tmp/B.DKxdsN/BUILD/kernel-4.14-4.14.90/linux-4.14/include/linux/compiler.h:164,
                 from /tmp/B.DKxdsN/BUILD/kernel-4.14-4.14.90/linux-4.14/include/linux/init.h:5,
                 from /tmp/B.DKxdsN/BUILD/kernel-4.14-4.14.90/linux-4.14/fs/namei.c:18:
/tmp/B.DKxdsN/BUILD/kernel-4.14-4.14.90/linux-4.14/include/uapi/linux/types.h:5:10: fatal error: asm/types.h: No such file or directory
 #include <asm/types.h>
          ^~~~~~~~~~~~~
compilation terminated.
make[2]: *** [/tmp/B.DKxdsN/BUILD/kernel-4.14-4.14.90/linux-4.14/Makefile:1044: fs] Error 2
make[1]: *** [Makefile:146: sub-make] Error 2
make: *** [Makefile:9: all] Error 2
+ rm -rf /tmp/B.DKxdsN
Begin-PLD-Builder-Info
Build-Time: user:12.30s sys:9.77s real:54.92s (faults io:0 non-io:159774)

End-PLD-Builder-Info
[Back to list of logs] [View rpm -qa of builder]