FailedOk

th/SRPMS[OK]
th/x32[OK]
th/i686[OK]
th/x86_64[OK]

ac/SRPMS[OK]
ac/i386[OK]
ac/i586[OK]
ac/i686[OK]
ac/alpha[OK]
ac/amd64[OK]
ac/athlon[OK]
ac/ppc[OK]
ac/sparc[OK]
ac/sparc64[OK]

Advanced Search
main()
Powered by PLD Linux
(c) 2002-2018 PLD Team
$Revision: 1.37 $
Powered by KDE.
Your IP: 54.196.5.6

kernel dec0e7bc-7a51-4f61-ae85-3c6845d7957c

Status:Failed
Source URL:ftp://buildlogs.pld-linux.org/th/x86_64/FAIL/kernel,dec0e7bc-7a51-4f61-ae85-3c6845d7957c.bz2
text/plain URL:View!
full text:View!
rpm -qa of builder:View!
Date:2018/07/28 11:56:37
Runtime:0:00:22.116866

Toc:

  • error 1
  • rpm: error: Failed build dependencies:
  • error 2
  • rpm: error: Failed build dependencies:
  • prep
  • Executing(%prep): /bin/sh -e /tmp/B.eLUPXz/BUILD/tmp/rpm-tmp.11452
  • build
  • Executing(%build): /bin/sh -e /tmp/B.eLUPXz/BUILD/tmp/rpm-tmp.20572
  • error 3
  • /usr/lib64/gcc/x86_64-pld-linux/8.2.0/plugin/include/attribs.h:118:12: error: 'get_identifier_with_length' was not declared in this scope
  • error 4
  • make[2]: *** [scripts/Makefile.gcc-plugins:70: gcc-plugins-check] Error 1
  • error 5
  • make[1]: *** [Makefile:146: sub-make] Error 2
  • error 6
  • error: Bad exit status from /tmp/B.eLUPXz/BUILD/tmp/rpm-tmp.20572 (%build)
  • error 7
  • RPM build errors:
  • error 8
  • error: No files produced.

Content:

checking if we should skip the build
started at: Sat Jul 28 11:55:36 2018
killing old processes on a builder
mesg: ttyname failed: Inappropriate ioctl for device
sending signal 9 to pid -1
Killed
cleaning up /tmp
mesg: ttyname failed: Inappropriate ioctl for device
fetching https://srcbuilder.pld-linux.org/th//srpms/dec0e7bc-7a51-4f61-ae85-3c6845d7957c/kernel-4.14-4.14.59-1.src.rpm
fetched 103186833 bytes, 11571.0 K/s
installing srpm: kernel-4.14-4.14.59-1.src.rpm
mesg: ttyname failed: Inappropriate ioctl for device
+ install -d /tmp/B.eLUPXz/BUILD /tmp/B.eLUPXz/RPMS
+ LC_ALL=en_US.UTF-8
+ rpm -qp --changelog kernel-4.14-4.14.59-1.src.rpm
* Sat Jul 28 2018 PLD Linux Team <feedback@pld-linux.org>
- For complete changelog see: http://git.pld-linux.org/?p=packages/kernel-4.14.git;a=log;h=LINUX_4_14
* Sat Jul 28 2018 Jan Rękorajski <baggins@pld-linux.org> be865411 - 4.14.59 * Tue Jul 24 2018 Jan Rękorajski <baggins@pld-linux.org> cfa908e9 - 4.14.57 * Thu Jul 12 2018 Jan Rękorajski <baggins@pld-linux.org> 1412d0af - 4.14.55 * Mon Jul 09 2018 Jan Rękorajski <baggins@pld-linux.org> a871aa92 - 4.14.54 * Sat Jul 07 2018 Jan Rękorajski <baggins@pld-linux.org> 5ff068be - 4.14.53 * Mon Jun 18 2018 Jan Rękorajski <baggins@pld-linux.org> b92d252f - 4.14.50 * Sat Jun 16 2018 Jan Rękorajski <baggins@pld-linux.org> ba281bc7 - 4.14.49 * Thu Jun 07 2018 Jan Rękorajski <baggins@pld-linux.org> 88cbe42c - 4.14.48 * Thu May 31 2018 Jan Rękorajski <baggins@pld-linux.org> 5f89ef04 - 4.14.47 * Wed May 23 2018 Jan Rękorajski <baggins@pld-linux.org> b6251d94 - 4.14.43 * Thu May 10 2018 Jan Rękorajski <baggins@pld-linux.org> 7ddb51dc - 4.14.40 * Sun May 06 2018 Jan Rękorajski <baggins@pld-linux.org> 9022716f - 4.14.39 * Sun Apr 29 2018 Jan Rękorajski <baggins@pld-linux.org> a9c08532 - 4.14.38 * Mon Apr 23 2018 Jan Rękorajski <baggins@pld-linux.org> a6877ea3 - updated apparmor patch - rel 1 * Sat Apr 21 2018 Jan Rękorajski <baggins@pld-linux.org> 9181895e - 4.14.35 - apparmor patches require update * Sun Apr 15 2018 Jan Rękorajski <baggins@pld-linux.org> 5f71fe1f - 4.14.34 * Tue Apr 10 2018 Jan Rękorajski <baggins@pld-linux.org> 42f9d5b5 - 4.14.33 * Sat Apr 07 2018 Jan Rękorajski <baggins@pld-linux.org> 1e40aa9c - 4.14.32 * Sun Mar 25 2018 Jan Rękorajski <baggins@pld-linux.org> 05cf4500 - 4.14.30 * Thu Mar 22 2018 Jan Rękorajski <baggins@pld-linux.org> bd0414de - 4.14.29 + rpm -Uhv --nodeps --define '_topdir /tmp/B.eLUPXz' --define '_specdir %{_topdir}' --define '_sourcedir %{_specdir}' --define '_rpmdir %{_topdir}/RPMS' --define '_builddir %{_topdir}/BUILD' kernel-4.14-4.14.59-1.src.rpm Preparing... ################################################## kernel-4.14 ################################################## + rm -f kernel-4.14-4.14.59-1.src.rpm mesg: ttyname failed: Inappropriate ioctl for device + install -m 700 -d /tmp/B.eLUPXz/BUILD/tmp mesg: ttyname failed: Inappropriate ioctl for device + TMPDIR=/tmp/B.eLUPXz/BUILD/tmp + exec nice -n 0 rpmbuild -bp --short-circuit --nodeps --define '_topdir /tmp/B.eLUPXz' --define '_specdir %{_topdir}' --define '_sourcedir %{_specdir}' --define '_rpmdir %{_topdir}/RPMS' --define '_builddir %{_topdir}/BUILD' --target x86_64-pld-linux --define 'prep exit 0' /tmp/B.eLUPXz/kernel.spec Building target platforms: x86_64-pld-linux checking BuildConflict-ing packages no BuildConflicts found checking BR rpm: error: Failed build dependencies: rpm: gcc-plugin-devel is needed by kernel-4.14-4.14.59-1.src rpm: Building target platforms: x86_64-pld-linux updating poldek cache... ready is up to date Retrieving th::packages.ndir.md... th is up to date Retrieving th::packages.ndir.md... th is up to date Retrieving th-ready::packages.ndir.md... th-ready is up to date Retrieving th-ready::packages.ndir.md... th-ready is up to date Retrieving th-test::packages.ndir.md... Retrieving th-test::packages.ndir.diff.toc.gz... Retrieving diff::packages.ndir.2018.07.27-17.39.02.gz... Loading [pndir]th-test... Applying packages.ndir.2018.07.27-17.39.02.gz... Retrieving diff::packages.ndir.2018.07.28-01.47.03.gz... ..............................done Retrieving diff::packages.ndir.dscr.2018.07.28-01.47.03.gz... Applying packages.ndir.2018.07.28-01.47.03.gz... Writing /root/.poldek-cache/[...]/packages.ndir.gz... Retrieving th-test::packages.ndir.md... Retrieving th-test::packages.ndir.diff.toc.gz... ..............................done Retrieving diff::packages.ndir.2018.07.27-20.12.02.gz... ..............................done Retrieving diff::packages.ndir.dscr.2018.07.27-20.12.02.gz... Loading [pndir]th-test... Applying packages.ndir.2018.07.27-20.12.02.gz... Retrieving diff::packages.ndir.2018.07.27-20.17.01.gz... ..............................done Retrieving diff::packages.ndir.dscr.2018.07.27-20.17.01.gz... Applying packages.ndir.2018.07.27-20.17.01.gz... Retrieving diff::packages.ndir.2018.07.28-06.01.01.gz... ..............................done Retrieving diff::packages.ndir.dscr.2018.07.28-06.01.01.gz... Applying packages.ndir.2018.07.28-06.01.01.gz... Retrieving diff::packages.ndir.2018.07.28-06.27.01.gz... ..............................done Retrieving diff::packages.ndir.dscr.2018.07.28-06.27.01.gz... Applying packages.ndir.2018.07.28-06.27.01.gz... Writing /root/.poldek-cache/[...]/packages.ndir.gz... checking conflicting packages in BRed packages poldek: Loading [pndir]ready... poldek: Loading [pndir]th-test... poldek: Loading [pndir]th-test... poldek: Loading [pndir]th-ready... poldek: Loading [pndir]th-ready... poldek: Loading [pndir]th... poldek: Loading [pndir]th... poldek: 32083 packages read poldek: Removed 5069 duplicate packages from available set poldek: Processing dependencies... poldek: There are 1 package to install: poldek: I gcc-plugin-devel-8.2.0-3.x86_64 poldek: This operation will use 7.7MB of disk space. poldek: Need to get 1.2MB of archives. poldek: Executing pm-command.sh --upgrade -vh --test --root / --define _check_dirname_deps 1... poldek: Preparing... ################################################## no conflicts found checking BR rpm: error: Failed build dependencies: rpm: gcc-plugin-devel is needed by kernel-4.14-4.14.59-1.src rpm: Building target platforms: x86_64-pld-linux installing BR: gcc\-plugin\-devel + poldek --noask --caplookup -Q -v '--ignore=hhvm-*' '--ignore=php4-*' '--ignore=php52-*' '--ignore=php54-*' '--ignore=php55-*' '--ignore=php56-*' '--ignore=php70-*' '--ignore=php71-*' '--ignore=php72-*' --upgrade gcc-plugin-devel Loading [pndir]ready... Loading [pndir]th-test... Loading [pndir]th-test... Loading [pndir]th-ready... Loading [pndir]th-ready... Loading [pndir]th... Loading [pndir]th... 32083 packages read Removed 5069 duplicate packages from available set Processing dependencies... There are 1 package to install: I gcc-plugin-devel-8.2.0-3.x86_64 This operation will use 7.7MB of disk space. Need to get 1.2MB of archives. Executing pm-command.sh --upgrade -vh --root / --define _check_dirname_deps 1... Preparing... ################################################## gcc-plugin-devel ################################################## building RPM using: set -ex; : build-id: dec0e7bc-7a51-4f61-ae85-3c6845d7957c; TMPDIR=/tmp/B.eLUPXz/BUILD/tmp exec nice -n 0 rpmbuild -bb --define '_smp_mflags -j9' --define '_make_opts -Otarget' --define '_pld_builder 1' --define '_topdir /tmp/B.eLUPXz' --define '_specdir %{_topdir}' --define '_sourcedir %{_specdir}' --define '_rpmdir %{_topdir}/RPMS' --define '_builddir %{_topdir}/BUILD' --target x86_64-pld-linux /tmp/B.eLUPXz/kernel.spec mesg: ttyname failed: Inappropriate ioctl for device + : build-id: dec0e7bc-7a51-4f61-ae85-3c6845d7957c + TMPDIR=/tmp/B.eLUPXz/BUILD/tmp + exec nice -n 0 rpmbuild -bb --define '_smp_mflags -j9' --define '_make_opts -Otarget' --define '_pld_builder 1' --define '_topdir /tmp/B.eLUPXz' --define '_specdir %{_topdir}' --define '_sourcedir %{_specdir}' --define '_rpmdir %{_topdir}/RPMS' --define '_builddir %{_topdir}/BUILD' --target x86_64-pld-linux /tmp/B.eLUPXz/kernel.spec Building target platforms: x86_64-pld-linux Executing(%prep): /bin/sh -e /tmp/B.eLUPXz/BUILD/tmp/rpm-tmp.11452 + umask 022 + cd /tmp/B.eLUPXz/BUILD + cd /tmp/B.eLUPXz/BUILD + rm -rf kernel-4.14-4.14.59 + /bin/mkdir -p kernel-4.14-4.14.59 + cd kernel-4.14-4.14.59 + /usr/bin/xz -dc /tmp/B.eLUPXz/linux-4.14.tar.xz + /bin/tar -xf - + STATUS=0 + '[' 0 -ne 0 ']' + /bin/id -u + '[' 1000 '=' 0 ']' + /bin/id -u + '[' 1000 '=' 0 ']' + /bin/chmod -Rf a+rX,u+w,g-w,o-w . + ln -s /tmp/B.eLUPXz/kernel-module-build.pl kernel-module-build.pl + ln -s /tmp/B.eLUPXz/kernel.make Makefile + cd linux-4.14 + echo 'Patch #0 (patch-4.14.59.xz):' Patch #0 (patch-4.14.59.xz): + '[' -f /tmp/B.eLUPXz/patch-4.14.59.xz ']' + /usr/bin/xz -dc /tmp/B.eLUPXz/patch-4.14.59.xz + /usr/bin/patch -s -p1 + echo 'Patch #6 (linux-wistron-nx.patch):' Patch #6 (linux-wistron-nx.patch): + '[' -f /tmp/B.eLUPXz/linux-wistron-nx.patch ']' + /bin/cat /tmp/B.eLUPXz/linux-wistron-nx.patch + /usr/bin/patch -s -p1 + echo 'Patch #10 (kernel-pom-ng-IPV4OPTSSTRIP.patch):' Patch #10 (kernel-pom-ng-IPV4OPTSSTRIP.patch): + '[' -f /tmp/B.eLUPXz/kernel-pom-ng-IPV4OPTSSTRIP.patch ']' + /bin/cat /tmp/B.eLUPXz/kernel-pom-ng-IPV4OPTSSTRIP.patch + /usr/bin/patch -s -p1 + echo 'Patch #40 (kernel-layer7.patch):' Patch #40 (kernel-layer7.patch): + '[' -f /tmp/B.eLUPXz/kernel-layer7.patch ']' + /bin/cat /tmp/B.eLUPXz/kernel-layer7.patch + /usr/bin/patch -s -p1 + echo 'Patch #55 (kernel-atm-vbr.patch):' Patch #55 (kernel-atm-vbr.patch): + '[' -f /tmp/B.eLUPXz/kernel-atm-vbr.patch ']' + /bin/cat /tmp/B.eLUPXz/kernel-atm-vbr.patch + /usr/bin/patch -s -p1 + echo 'Patch #56 (kernel-atmdd.patch):' Patch #56 (kernel-atmdd.patch): + '[' -f /tmp/B.eLUPXz/kernel-atmdd.patch ']' + /bin/cat /tmp/B.eLUPXz/kernel-atmdd.patch + /usr/bin/patch -s -p1 + echo 'Patch #59 (kernel-rndis_host-wm5.patch):' Patch #59 (kernel-rndis_host-wm5.patch): + '[' -f /tmp/B.eLUPXz/kernel-rndis_host-wm5.patch ']' + /bin/cat /tmp/B.eLUPXz/kernel-rndis_host-wm5.patch + /usr/bin/patch -s -p1 + echo 'Patch #85 (kernel-hostap.patch):' Patch #85 (kernel-hostap.patch): + '[' -f /tmp/B.eLUPXz/kernel-hostap.patch ']' + /bin/cat /tmp/B.eLUPXz/kernel-hostap.patch + /usr/bin/patch -s -p1 + echo 'Patch #145 (kernel-aufs4.patch):' Patch #145 (kernel-aufs4.patch): + '[' -f /tmp/B.eLUPXz/kernel-aufs4.patch ']' + /bin/cat /tmp/B.eLUPXz/kernel-aufs4.patch + /usr/bin/patch -s -p1 + echo 'Patch #5001 (0012-apparmor-add-base-infastructure-for-socket-mediation.patch):' Patch #5001 (0012-apparmor-add-base-infastructure-for-socket-mediation.patch): + '[' -f /tmp/B.eLUPXz/0012-apparmor-add-base-infastructure-for-socket-mediation.patch ']' + /bin/cat /tmp/B.eLUPXz/0012-apparmor-add-base-infastructure-for-socket-mediation.patch + /usr/bin/patch -s -p1 + echo 'Patch #5002 (0001-UBUNTU-SAUCE-apparmor-af_unix-mediation.patch):' Patch #5002 (0001-UBUNTU-SAUCE-apparmor-af_unix-mediation.patch): + '[' -f /tmp/B.eLUPXz/0001-UBUNTU-SAUCE-apparmor-af_unix-mediation.patch ']' + /bin/cat /tmp/B.eLUPXz/0001-UBUNTU-SAUCE-apparmor-af_unix-mediation.patch + /usr/bin/patch -s -p1 + echo 'Patch #250 (kernel-fix_256colors_menuconfig.patch):' Patch #250 (kernel-fix_256colors_menuconfig.patch): + '[' -f /tmp/B.eLUPXz/kernel-fix_256colors_menuconfig.patch ']' + /bin/cat /tmp/B.eLUPXz/kernel-fix_256colors_menuconfig.patch + /usr/bin/patch -s -p1 + echo 'Patch #2000 (kernel-small_fixes.patch):' Patch #2000 (kernel-small_fixes.patch): + '[' -f /tmp/B.eLUPXz/kernel-small_fixes.patch ']' + /bin/cat /tmp/B.eLUPXz/kernel-small_fixes.patch + /usr/bin/patch -s -p1 + echo 'Patch #2001 (kernel-pwc-uncompress.patch):' Patch #2001 (kernel-pwc-uncompress.patch): + '[' -f /tmp/B.eLUPXz/kernel-pwc-uncompress.patch ']' + /bin/cat /tmp/B.eLUPXz/kernel-pwc-uncompress.patch + /usr/bin/patch -s -p1 + chmod 755 tools/objtool/sync-check.sh + sed -i 's#EXTRAVERSION =.*#EXTRAVERSION = #g' Makefile + find '(' -name '*~' -o -name '*.orig' -o -name .gitignore ')' -print0 + xargs -0 -r -l512 rm -f + exit 0 Executing(%build): /bin/sh -e /tmp/B.eLUPXz/BUILD/tmp/rpm-tmp.20572 TMP=/home/users/builder/tmp HOME=/home/users/builder PATH=/home/users/builder/GNUstep/Tools:/usr/local/bin:/usr/bin:/bin:/home/users/builder/bin TMPDIR=/tmp/B.eLUPXz/BUILD/tmp + umask 022 + cd /tmp/B.eLUPXz/BUILD + cd kernel-4.14-4.14.59 + install -d /tmp/B.eLUPXz/BUILD/kernel-4.14-4.14.59/x86_64-gcc-8.2.0 + >x86_64-gcc-8.2.0.mk + <<"EOF" + cat + cd /tmp/B.eLUPXz/BUILD/kernel-4.14-4.14.59/x86_64-gcc-8.2.0 + install -d arch/x86 + >arch/x86/defconfig + BuildConfig + set -e + Config=kernel-x86.config + >&2 + echo 'Building config file for x86_64 using kernel-x86.config et al.' Building config file for x86_64 using kernel-x86.config et al. + <<-EOCONFIG + >important.config + cat + mawk -v 'arch=all x86 x86_64 x86_64' -f /tmp/B.eLUPXz/kernel-config.awk important.config /tmp/B.eLUPXz/kernel-imq.config /tmp/B.eLUPXz/kernel-patches.config /tmp/B.eLUPXz/kernel-multiarch.config /tmp/B.eLUPXz/kernel-x86.config kernel-x86.config (287): Warning: CONFIG_VIDEO_IVTV_DEPRECATED_IOCTLS already defined in: kernel-multiarch.config (3473) kernel-x86.config (317): Warning: CONFIG_PCIEASPM_DEFAULT already defined in: kernel-multiarch.config (6401) kernel-x86.config (318): Warning: CONFIG_PCIEASPM_POWERSAVE already defined in: kernel-multiarch.config (6402) kernel-x86.config (319): Warning: CONFIG_PCIEASPM_POWER_SUPERSAVE already defined in: kernel-multiarch.config (6403) kernel-x86.config (320): Warning: CONFIG_PCIEASPM_PERFORMANCE already defined in: kernel-multiarch.config (6404) kernel-x86.config (325): Warning: CONFIG_INTEL_TURBO_MAX_3 already defined in: kernel-multiarch.config (6643) kernel-x86.config (344): Warning: CONFIG_PC104 already defined in: kernel-multiarch.config (9956) kernel-x86.config (369): Warning: CONFIG_KCOV already defined in: kernel-multiarch.config (10195) kernel-x86.config (370): Warning: CONFIG_WW_MUTEX_SELFTEST already defined in: kernel-multiarch.config (10223) kernel-x86.config (402): Warning: CONFIG_SND_X86 already defined in: kernel-multiarch.config (12159) kernel-x86.config (403): Warning: CONFIG_HDMI_LPE_AUDIO already defined in: kernel-multiarch.config (12160) + ln -sf arch/x86/defconfig .config + cd - /tmp/B.eLUPXz/BUILD/kernel-4.14-4.14.59 + /usr/bin/make -Otarget -j9 'TARGETOBJ=x86_64-gcc-8.2.0' oldconfig /usr/bin/make -C /tmp/B.eLUPXz/BUILD/kernel-4.14-4.14.59/linux-4.14 O=/tmp/B.eLUPXz/BUILD/kernel-4.14-4.14.59/x86_64-gcc-8.2.0 ARCH=x86_64 CC="x86_64-pld-linux-gcc" HOSTCC="x86_64-pld-linux-gcc -D_FILE_OFFSET_BITS=64" oldconfig make[2]: Entering directory '/tmp/B.eLUPXz/BUILD/kernel-4.14-4.14.59/x86_64-gcc-8.2.0' GEN ./Makefile make[2]: Leaving directory '/tmp/B.eLUPXz/BUILD/kernel-4.14-4.14.59/x86_64-gcc-8.2.0' HOSTCC scripts/basic/fixdep SHIPPED scripts/kconfig/zconf.tab.c SHIPPED scripts/kconfig/zconf.lex.c HOSTCC scripts/kconfig/conf.o HOSTCC scripts/kconfig/zconf.tab.o HOSTLD scripts/kconfig/conf scripts/kconfig/conf --oldconfig Kconfig # # configuration written to .config # + mawk -v 'infile=/tmp/B.eLUPXz/BUILD/kernel-4.14-4.14.59/x86_64-gcc-8.2.0/arch/x86/defconfig' -f /tmp/B.eLUPXz/kernel-track-config-change.awk /tmp/B.eLUPXz/BUILD/kernel-4.14-4.14.59/x86_64-gcc-8.2.0/.config ERROR (kernel-multiarch.config): CONFIG_MODVERSIONS redefined from `n' to `y' ERROR (kernel-multiarch.config): CONFIG_CRYPTO_AEAD redefined from `m' to `y' ERROR (kernel-multiarch.config): CONFIG_CRYPTO_GF128MUL redefined from `m' to `y' ERROR (kernel-multiarch.config): CONFIG_CRYPTO_NULL redefined from `m' to `y' ERROR (kernel-multiarch.config): CONFIG_CRYPTO_GCM redefined from `m' to `y' ERROR (kernel-multiarch.config): CONFIG_CRYPTO_SEQIV redefined from `m' to `y' ERROR (kernel-multiarch.config): CONFIG_CRYPTO_CTR redefined from `m' to `y' ERROR (kernel-multiarch.config): CONFIG_CRYPTO_GHASH redefined from `m' to `y' ERROR (kernel-multiarch.config): CONFIG_CRYPTO_DRBG_MENU redefined from `m' to `y' ERROR (kernel-multiarch.config): CONFIG_CRYPTO_JITTERENTROPY redefined from `m' to `y' There were 10 errors + /usr/bin/make -Otarget -j9 'TARGETOBJ=x86_64-gcc-8.2.0' all /usr/bin/make -C /tmp/B.eLUPXz/BUILD/kernel-4.14-4.14.59/linux-4.14 O=/tmp/B.eLUPXz/BUILD/kernel-4.14-4.14.59/x86_64-gcc-8.2.0 ARCH=x86_64 CC="x86_64-pld-linux-gcc" HOSTCC="x86_64-pld-linux-gcc -D_FILE_OFFSET_BITS=64" GEN ./Makefile scripts/kconfig/conf --silentoldconfig Kconfig make[2]: Entering directory '/tmp/B.eLUPXz/BUILD/kernel-4.14-4.14.59/x86_64-gcc-8.2.0' GEN ./Makefile make[2]: Leaving directory '/tmp/B.eLUPXz/BUILD/kernel-4.14-4.14.59/x86_64-gcc-8.2.0' make[2]: Entering directory '/tmp/B.eLUPXz/BUILD/kernel-4.14-4.14.59/x86_64-gcc-8.2.0' CHK include/generated/uapi/linux/version.h UPD include/generated/uapi/linux/version.h make[2]: Leaving directory '/tmp/B.eLUPXz/BUILD/kernel-4.14-4.14.59/x86_64-gcc-8.2.0' SYSHDR arch/x86/include/generated/asm/unistd_64_x32.h SYSHDR arch/x86/include/generated/asm/unistd_32_ia32.h SYSHDR arch/x86/include/generated/uapi/asm/unistd_64.h SYSHDR arch/x86/include/generated/uapi/asm/unistd_32.h make[2]: Entering directory '/tmp/B.eLUPXz/BUILD/kernel-4.14-4.14.59/x86_64-gcc-8.2.0' CHK include/config/kernel.release UPD include/config/kernel.release make[2]: Leaving directory '/tmp/B.eLUPXz/BUILD/kernel-4.14-4.14.59/x86_64-gcc-8.2.0' SYSHDR arch/x86/include/generated/uapi/asm/unistd_x32.h HYPERCALLS arch/x86/include/generated/asm/xen-hypercalls.h DESCEND objtool HOSTCC scripts/basic/bin2c HOSTCC /tmp/B.eLUPXz/BUILD/kernel-4.14-4.14.59/x86_64-gcc-8.2.0/tools/objtool/fixdep.o HOSTLD /tmp/B.eLUPXz/BUILD/kernel-4.14-4.14.59/x86_64-gcc-8.2.0/tools/objtool/fixdep-in.o LINK /tmp/B.eLUPXz/BUILD/kernel-4.14-4.14.59/x86_64-gcc-8.2.0/tools/objtool/fixdep CC /tmp/B.eLUPXz/BUILD/kernel-4.14-4.14.59/x86_64-gcc-8.2.0/tools/objtool/exec-cmd.o CC /tmp/B.eLUPXz/BUILD/kernel-4.14-4.14.59/x86_64-gcc-8.2.0/tools/objtool/help.o MKDIR /tmp/B.eLUPXz/BUILD/kernel-4.14-4.14.59/x86_64-gcc-8.2.0/tools/objtool/arch/x86/lib/ GEN /tmp/B.eLUPXz/BUILD/kernel-4.14-4.14.59/x86_64-gcc-8.2.0/tools/objtool/arch/x86/lib/inat-tables.c CC /tmp/B.eLUPXz/BUILD/kernel-4.14-4.14.59/x86_64-gcc-8.2.0/tools/objtool/arch/x86/decode.o CC /tmp/B.eLUPXz/BUILD/kernel-4.14-4.14.59/x86_64-gcc-8.2.0/tools/objtool/pager.o CC /tmp/B.eLUPXz/BUILD/kernel-4.14-4.14.59/x86_64-gcc-8.2.0/tools/objtool/builtin-check.o CC /tmp/B.eLUPXz/BUILD/kernel-4.14-4.14.59/x86_64-gcc-8.2.0/tools/objtool/builtin-orc.o CC /tmp/B.eLUPXz/BUILD/kernel-4.14-4.14.59/x86_64-gcc-8.2.0/tools/objtool/check.o CC /tmp/B.eLUPXz/BUILD/kernel-4.14-4.14.59/x86_64-gcc-8.2.0/tools/objtool/parse-options.o CC /tmp/B.eLUPXz/BUILD/kernel-4.14-4.14.59/x86_64-gcc-8.2.0/tools/objtool/run-command.o CC /tmp/B.eLUPXz/BUILD/kernel-4.14-4.14.59/x86_64-gcc-8.2.0/tools/objtool/sigchain.o LD /tmp/B.eLUPXz/BUILD/kernel-4.14-4.14.59/x86_64-gcc-8.2.0/tools/objtool/arch/x86/objtool-in.o CC /tmp/B.eLUPXz/BUILD/kernel-4.14-4.14.59/x86_64-gcc-8.2.0/tools/objtool/orc_gen.o CC /tmp/B.eLUPXz/BUILD/kernel-4.14-4.14.59/x86_64-gcc-8.2.0/tools/objtool/subcmd-config.o CC /tmp/B.eLUPXz/BUILD/kernel-4.14-4.14.59/x86_64-gcc-8.2.0/tools/objtool/orc_dump.o CC /tmp/B.eLUPXz/BUILD/kernel-4.14-4.14.59/x86_64-gcc-8.2.0/tools/objtool/elf.o LD /tmp/B.eLUPXz/BUILD/kernel-4.14-4.14.59/x86_64-gcc-8.2.0/tools/objtool/libsubcmd-in.o make[2]: Entering directory '/tmp/B.eLUPXz/BUILD/kernel-4.14-4.14.59/x86_64-gcc-8.2.0' In file included from /tmp/B.eLUPXz/BUILD/kernel-4.14-4.14.59/linux-4.14/scripts/gcc-plugins/gcc-common.h:101, from <stdin>:1: /usr/lib64/gcc/x86_64-pld-linux/8.2.0/plugin/include/attribs.h: In function 'tree_node* canonicalize_attr_name(tree)': /usr/lib64/gcc/x86_64-pld-linux/8.2.0/plugin/include/attribs.h:118:12: error: 'get_identifier_with_length' was not declared in this scope return get_identifier_with_length (s + 2, l - 4); ^~~~~~~~~~~~~~~~~~~~~~~~~~ /usr/lib64/gcc/x86_64-pld-linux/8.2.0/plugin/include/attribs.h:118:12: note: suggested alternative: 'get_attr_min_length' return get_identifier_with_length (s + 2, l - 4); ^~~~~~~~~~~~~~~~~~~~~~~~~~ get_attr_min_length Cannot use CONFIG_GCC_PLUGINS: your gcc installation does not support plugins, perhaps the necessary headers are missing? make[2]: *** [scripts/Makefile.gcc-plugins:70: gcc-plugins-check] Error 1 make[2]: Leaving directory '/tmp/B.eLUPXz/BUILD/kernel-4.14-4.14.59/x86_64-gcc-8.2.0' make[2]: *** Waiting for unfinished jobs.... CC /tmp/B.eLUPXz/BUILD/kernel-4.14-4.14.59/x86_64-gcc-8.2.0/tools/objtool/special.o AR /tmp/B.eLUPXz/BUILD/kernel-4.14-4.14.59/x86_64-gcc-8.2.0/tools/objtool/libsubcmd.a CC /tmp/B.eLUPXz/BUILD/kernel-4.14-4.14.59/x86_64-gcc-8.2.0/tools/objtool/objtool.o CC /tmp/B.eLUPXz/BUILD/kernel-4.14-4.14.59/x86_64-gcc-8.2.0/tools/objtool/libstring.o CC /tmp/B.eLUPXz/BUILD/kernel-4.14-4.14.59/x86_64-gcc-8.2.0/tools/objtool/str_error_r.o SYSTBL arch/x86/include/generated/asm/syscalls_64.h SYSTBL arch/x86/include/generated/asm/syscalls_32.h LD /tmp/B.eLUPXz/BUILD/kernel-4.14-4.14.59/x86_64-gcc-8.2.0/tools/objtool/objtool-in.o LINK /tmp/B.eLUPXz/BUILD/kernel-4.14-4.14.59/x86_64-gcc-8.2.0/tools/objtool/objtool make[1]: *** [Makefile:146: sub-make] Error 2 make: *** [Makefile:9: all] Error 2 error: Bad exit status from /tmp/B.eLUPXz/BUILD/tmp/rpm-tmp.20572 (%build) RPM build errors: Bad exit status from /tmp/B.eLUPXz/BUILD/tmp/rpm-tmp.20572 (%build) ended at: Sat Jul 28 11:56:33 2018, done in 0:00:22.116866 error: No files produced. mesg: ttyname failed: Inappropriate ioctl for device + chmod -R u+rwX /tmp/B.eLUPXz/BUILD + rm -rf /tmp/B.eLUPXz/tmp /tmp/B.eLUPXz/BUILD mesg: ttyname failed: Inappropriate ioctl for device + rm -rf /tmp/B.eLUPXz Begin-PLD-Builder-Info Build-Time: user:34.51s sys:13.09s real:60.65s (faults io:0 non-io:1915586) End-PLD-Builder-Info
[Back to list of logs] [View rpm -qa of builder]