FailedOk

th/SRPMS[OK]
th/x32[OK]
th/i686[OK]
th/x86_64[OK]

ac/SRPMS[OK]
ac/i386[OK]
ac/i586[OK]
ac/i686[OK]
ac/alpha[OK]
ac/amd64[OK]
ac/athlon[OK]
ac/ppc[OK]
ac/sparc[OK]
ac/sparc64[OK]

Advanced Search
main()
Powered by PLD Linux
(c) 2002-2018 PLD Team
$Revision: 1.37 $
Powered by Przewodniczacego Lepper-a.
Your IP: 54.164.198.240

kernel e76535c3-a779-4a62-962e-cd4b3fb9a696

Status:Failed
Source URL:ftp://buildlogs.pld-linux.org/th/x86_64/FAIL/kernel,e76535c3-a779-4a62-962e-cd4b3fb9a696.bz2
text/plain URL:View!
full text:View!
rpm -qa of builder:View!
Date:2018/07/28 13:02:20
Runtime:0:00:23.683657

Toc:

  • error 1
  • /tmp/B.KMHFoq/BUILD/kernel-4.14-4.14.59/linux-4.14/scripts/gcc-plugins/structleak_plugin.c:71:1: error: designator order for field 'attribute_spec::affects_type_identity' does not match declaration order in 'attribute_spec'
  • error 2
  • make[3]: *** [scripts/Makefile.host:153: scripts/gcc-plugins/structleak_plugin.o] Error 1
  • error 3
  • /tmp/B.KMHFoq/BUILD/kernel-4.14-4.14.59/linux-4.14/scripts/gcc-plugins/randomize_layout_plugin.c:596:1: error: designator order for field 'attribute_spec::affects_type_identity' does not match declaration order in 'attribute_spec'
  • error 4
  • /tmp/B.KMHFoq/BUILD/kernel-4.14-4.14.59/linux-4.14/scripts/gcc-plugins/randomize_layout_plugin.c:611:1: error: designator order for field 'attribute_spec::affects_type_identity' does not match declaration order in 'attribute_spec'
  • error 5
  • /tmp/B.KMHFoq/BUILD/kernel-4.14-4.14.59/linux-4.14/scripts/gcc-plugins/randomize_layout_plugin.c:626:1: error: designator order for field 'attribute_spec::affects_type_identity' does not match declaration order in 'attribute_spec'
  • error 6
  • /tmp/B.KMHFoq/BUILD/kernel-4.14-4.14.59/linux-4.14/scripts/gcc-plugins/randomize_layout_plugin.c:641:1: error: designator order for field 'attribute_spec::affects_type_identity' does not match declaration order in 'attribute_spec'
  • error 7
  • make[3]: *** [scripts/Makefile.host:153: scripts/gcc-plugins/randomize_layout_plugin.o] Error 1
  • error 8
  • make[2]: *** [scripts/Makefile.gcc-plugins:83: gcc-plugins] Error 2
  • error 9
  • make[1]: *** [Makefile:146: sub-make] Error 2
  • error 10
  • error: Bad exit status from /tmp/B.KMHFoq/BUILD/tmp/rpm-tmp.35500 (%build)
  • error 11
  • RPM build errors:
  • error 12
  • error: No files produced.

Content:

  SHIPPED scripts/kconfig/zconf.lex.c
  HOSTCC  scripts/kconfig/conf.o
  HOSTCC  scripts/kconfig/zconf.tab.o
  HOSTLD  scripts/kconfig/conf
scripts/kconfig/conf  --oldconfig Kconfig
#
# configuration written to .config
#
+ mawk -v 'infile=/tmp/B.KMHFoq/BUILD/kernel-4.14-4.14.59/x86_64-gcc-8.2.0/arch/x86/defconfig' -f /tmp/B.KMHFoq/kernel-track-config-change.awk /tmp/B.KMHFoq/BUILD/kernel-4.14-4.14.59/x86_64-gcc-8.2.0/.config
ERROR (kernel-multiarch.config): CONFIG_MODVERSIONS redefined from `n' to `y'
ERROR (kernel-multiarch.config): CONFIG_CRYPTO_AEAD redefined from `m' to `y'
ERROR (kernel-multiarch.config): CONFIG_CRYPTO_GF128MUL redefined from `m' to `y'
ERROR (kernel-multiarch.config): CONFIG_CRYPTO_NULL redefined from `m' to `y'
ERROR (kernel-multiarch.config): CONFIG_CRYPTO_GCM redefined from `m' to `y'
ERROR (kernel-multiarch.config): CONFIG_CRYPTO_SEQIV redefined from `m' to `y'
ERROR (kernel-multiarch.config): CONFIG_CRYPTO_CTR redefined from `m' to `y'
ERROR (kernel-multiarch.config): CONFIG_CRYPTO_GHASH redefined from `m' to `y'
ERROR (kernel-multiarch.config): CONFIG_CRYPTO_DRBG_MENU redefined from `m' to `y'
ERROR (kernel-multiarch.config): CONFIG_CRYPTO_JITTERENTROPY redefined from `m' to `y'
There were 10 errors
+ /usr/bin/make -Otarget -j9 'TARGETOBJ=x86_64-gcc-8.2.0' all
/usr/bin/make -C /tmp/B.KMHFoq/BUILD/kernel-4.14-4.14.59/linux-4.14 O=/tmp/B.KMHFoq/BUILD/kernel-4.14-4.14.59/x86_64-gcc-8.2.0 ARCH=x86_64 CC="x86_64-pld-linux-gcc" HOSTCC="x86_64-pld-linux-gcc -D_FILE_OFFSET_BITS=64" 
  GEN     ./Makefile
scripts/kconfig/conf  --silentoldconfig Kconfig
make[2]: Entering directory '/tmp/B.KMHFoq/BUILD/kernel-4.14-4.14.59/x86_64-gcc-8.2.0'
  GEN     ./Makefile
make[2]: Leaving directory '/tmp/B.KMHFoq/BUILD/kernel-4.14-4.14.59/x86_64-gcc-8.2.0'
make[2]: Entering directory '/tmp/B.KMHFoq/BUILD/kernel-4.14-4.14.59/x86_64-gcc-8.2.0'
  CHK     include/generated/uapi/linux/version.h
  UPD     include/generated/uapi/linux/version.h
make[2]: Leaving directory '/tmp/B.KMHFoq/BUILD/kernel-4.14-4.14.59/x86_64-gcc-8.2.0'
  SYSHDR  arch/x86/include/generated/asm/unistd_64_x32.h
make[2]: Entering directory '/tmp/B.KMHFoq/BUILD/kernel-4.14-4.14.59/x86_64-gcc-8.2.0'
  CHK     include/config/kernel.release
  UPD     include/config/kernel.release
make[2]: Leaving directory '/tmp/B.KMHFoq/BUILD/kernel-4.14-4.14.59/x86_64-gcc-8.2.0'
  DESCEND  objtool
  HOSTCC  scripts/basic/bin2c
  SYSHDR  arch/x86/include/generated/asm/unistd_32_ia32.h
  HYPERCALLS arch/x86/include/generated/asm/xen-hypercalls.h
  SYSHDR  arch/x86/include/generated/uapi/asm/unistd_32.h
  SYSHDR  arch/x86/include/generated/uapi/asm/unistd_64.h
  SYSHDR  arch/x86/include/generated/uapi/asm/unistd_x32.h
  HOSTCC   /tmp/B.KMHFoq/BUILD/kernel-4.14-4.14.59/x86_64-gcc-8.2.0/tools/objtool/fixdep.o
  HOSTLD   /tmp/B.KMHFoq/BUILD/kernel-4.14-4.14.59/x86_64-gcc-8.2.0/tools/objtool/fixdep-in.o
  LINK     /tmp/B.KMHFoq/BUILD/kernel-4.14-4.14.59/x86_64-gcc-8.2.0/tools/objtool/fixdep
  MKDIR    /tmp/B.KMHFoq/BUILD/kernel-4.14-4.14.59/x86_64-gcc-8.2.0/tools/objtool/arch/x86/lib/
  GEN      /tmp/B.KMHFoq/BUILD/kernel-4.14-4.14.59/x86_64-gcc-8.2.0/tools/objtool/arch/x86/lib/inat-tables.c
  CC       /tmp/B.KMHFoq/BUILD/kernel-4.14-4.14.59/x86_64-gcc-8.2.0/tools/objtool/arch/x86/decode.o
  CC       /tmp/B.KMHFoq/BUILD/kernel-4.14-4.14.59/x86_64-gcc-8.2.0/tools/objtool/builtin-check.o
  CC       /tmp/B.KMHFoq/BUILD/kernel-4.14-4.14.59/x86_64-gcc-8.2.0/tools/objtool/builtin-orc.o
  CC       /tmp/B.KMHFoq/BUILD/kernel-4.14-4.14.59/x86_64-gcc-8.2.0/tools/objtool/check.o
  CC       /tmp/B.KMHFoq/BUILD/kernel-4.14-4.14.59/x86_64-gcc-8.2.0/tools/objtool/orc_gen.o
  CC       /tmp/B.KMHFoq/BUILD/kernel-4.14-4.14.59/x86_64-gcc-8.2.0/tools/objtool/exec-cmd.o
  CC       /tmp/B.KMHFoq/BUILD/kernel-4.14-4.14.59/x86_64-gcc-8.2.0/tools/objtool/help.o
  LD       /tmp/B.KMHFoq/BUILD/kernel-4.14-4.14.59/x86_64-gcc-8.2.0/tools/objtool/arch/x86/objtool-in.o
  CC       /tmp/B.KMHFoq/BUILD/kernel-4.14-4.14.59/x86_64-gcc-8.2.0/tools/objtool/pager.o
  CC       /tmp/B.KMHFoq/BUILD/kernel-4.14-4.14.59/x86_64-gcc-8.2.0/tools/objtool/parse-options.o
  CC       /tmp/B.KMHFoq/BUILD/kernel-4.14-4.14.59/x86_64-gcc-8.2.0/tools/objtool/run-command.o
  CC       /tmp/B.KMHFoq/BUILD/kernel-4.14-4.14.59/x86_64-gcc-8.2.0/tools/objtool/sigchain.o
  CC       /tmp/B.KMHFoq/BUILD/kernel-4.14-4.14.59/x86_64-gcc-8.2.0/tools/objtool/subcmd-config.o
  CC       /tmp/B.KMHFoq/BUILD/kernel-4.14-4.14.59/x86_64-gcc-8.2.0/tools/objtool/orc_dump.o
  CC       /tmp/B.KMHFoq/BUILD/kernel-4.14-4.14.59/x86_64-gcc-8.2.0/tools/objtool/elf.o
  CC       /tmp/B.KMHFoq/BUILD/kernel-4.14-4.14.59/x86_64-gcc-8.2.0/tools/objtool/special.o
  CC       /tmp/B.KMHFoq/BUILD/kernel-4.14-4.14.59/x86_64-gcc-8.2.0/tools/objtool/objtool.o
  CC       /tmp/B.KMHFoq/BUILD/kernel-4.14-4.14.59/x86_64-gcc-8.2.0/tools/objtool/libstring.o
  SYSTBL  arch/x86/include/generated/asm/syscalls_64.h
  CC       /tmp/B.KMHFoq/BUILD/kernel-4.14-4.14.59/x86_64-gcc-8.2.0/tools/objtool/str_error_r.o
  LD       /tmp/B.KMHFoq/BUILD/kernel-4.14-4.14.59/x86_64-gcc-8.2.0/tools/objtool/libsubcmd-in.o
  SYSTBL  arch/x86/include/generated/asm/syscalls_32.h
  AR       /tmp/B.KMHFoq/BUILD/kernel-4.14-4.14.59/x86_64-gcc-8.2.0/tools/objtool/libsubcmd.a
make[2]: Entering directory '/tmp/B.KMHFoq/BUILD/kernel-4.14-4.14.59/x86_64-gcc-8.2.0'
  Using /tmp/B.KMHFoq/BUILD/kernel-4.14-4.14.59/linux-4.14 as source for kernel
make[2]: Leaving directory '/tmp/B.KMHFoq/BUILD/kernel-4.14-4.14.59/x86_64-gcc-8.2.0'
  WRAP    arch/x86/include/generated/asm/clkdev.h
  WRAP    arch/x86/include/generated/asm/dma-contiguous.h
  WRAP    arch/x86/include/generated/asm/early_ioremap.h
  WRAP    arch/x86/include/generated/asm/mcs_spinlock.h
  WRAP    arch/x86/include/generated/asm/mm-arch-hooks.h
  LD       /tmp/B.KMHFoq/BUILD/kernel-4.14-4.14.59/x86_64-gcc-8.2.0/tools/objtool/objtool-in.o
make[2]: Entering directory '/tmp/B.KMHFoq/BUILD/kernel-4.14-4.14.59/x86_64-gcc-8.2.0'
  CHK     include/generated/utsrelease.h
  UPD     include/generated/utsrelease.h
make[2]: Leaving directory '/tmp/B.KMHFoq/BUILD/kernel-4.14-4.14.59/x86_64-gcc-8.2.0'
  LINK     /tmp/B.KMHFoq/BUILD/kernel-4.14-4.14.59/x86_64-gcc-8.2.0/tools/objtool/objtool
  HOSTCC  arch/x86/tools/relocs_common.o
  HOSTCC  arch/x86/tools/relocs_32.o
  GENSEED scripts/gcc-plugins/randomize_layout_seed.h
  HOSTCC  arch/x86/tools/relocs_64.o
  HOSTLD  arch/x86/tools/relocs
  AS      arch/x86/purgatory/stack.o
  CC      arch/x86/purgatory/purgatory.o
  AS      arch/x86/purgatory/setup-x86_64.o
  AS      arch/x86/purgatory/entry64.o
  CC      arch/x86/purgatory/string.o
  CC      arch/x86/purgatory/sha256.o
  LD      arch/x86/purgatory/purgatory.ro
  BIN2C   arch/x86/purgatory/kexec-purgatory.c
  HOSTCXX -fPIC scripts/gcc-plugins/structleak_plugin.o
/tmp/B.KMHFoq/BUILD/kernel-4.14-4.14.59/linux-4.14/scripts/gcc-plugins/structleak_plugin.c:71:1: error: designator order for field 'attribute_spec::affects_type_identity' does not match declaration order in 'attribute_spec'
 };
 ^
make[3]: *** [scripts/Makefile.host:153: scripts/gcc-plugins/structleak_plugin.o] Error 1
make[3]: *** Waiting for unfinished jobs....
  HOSTCXX -fPIC scripts/gcc-plugins/randomize_layout_plugin.o
/tmp/B.KMHFoq/BUILD/kernel-4.14-4.14.59/linux-4.14/scripts/gcc-plugins/randomize_layout_plugin.c:596:1: error: designator order for field 'attribute_spec::affects_type_identity' does not match declaration order in 'attribute_spec'
 };
 ^
/tmp/B.KMHFoq/BUILD/kernel-4.14-4.14.59/linux-4.14/scripts/gcc-plugins/randomize_layout_plugin.c:611:1: error: designator order for field 'attribute_spec::affects_type_identity' does not match declaration order in 'attribute_spec'
 };
 ^
/tmp/B.KMHFoq/BUILD/kernel-4.14-4.14.59/linux-4.14/scripts/gcc-plugins/randomize_layout_plugin.c:626:1: error: designator order for field 'attribute_spec::affects_type_identity' does not match declaration order in 'attribute_spec'
 };
 ^
/tmp/B.KMHFoq/BUILD/kernel-4.14-4.14.59/linux-4.14/scripts/gcc-plugins/randomize_layout_plugin.c:641:1: error: designator order for field 'attribute_spec::affects_type_identity' does not match declaration order in 'attribute_spec'
 };
 ^
make[3]: *** [scripts/Makefile.host:153: scripts/gcc-plugins/randomize_layout_plugin.o] Error 1
make[2]: *** [scripts/Makefile.gcc-plugins:83: gcc-plugins] Error 2
make[2]: *** Waiting for unfinished jobs....
make[1]: *** [Makefile:146: sub-make] Error 2
make: *** [Makefile:9: all] Error 2
error: Bad exit status from /tmp/B.KMHFoq/BUILD/tmp/rpm-tmp.35500 (%build)


RPM build errors:
    Bad exit status from /tmp/B.KMHFoq/BUILD/tmp/rpm-tmp.35500 (%build)
ended at: Sat Jul 28 13:02:16 2018, done in 0:00:23.683657
error: No files produced.
mesg: ttyname failed: Inappropriate ioctl for device
+ chmod -R u+rwX /tmp/B.KMHFoq/BUILD
+ rm -rf /tmp/B.KMHFoq/tmp /tmp/B.KMHFoq/BUILD
mesg: ttyname failed: Inappropriate ioctl for device
+ rm -rf /tmp/B.KMHFoq
Begin-PLD-Builder-Info
Build-Time: user:29.10s sys:12.57s real:38.96s (faults io:0 non-io:1739631)

End-PLD-Builder-Info
[Back to list of logs] [View rpm -qa of builder]