FailedOk

th/SRPMS[OK]
th/x32[OK]
th/i686[OK]
th/x86_64[OK]

ac/SRPMS[OK]
ac/i386[OK]
ac/i586[OK]
ac/i686[OK]
ac/alpha[OK]
ac/amd64[OK]
ac/athlon[OK]
ac/ppc[OK]
ac/sparc[OK]
ac/sparc64[OK]

Advanced Search
main()
Powered by PLD Linux
(c) 2002-2020 PLD Team
$Revision: 1.37 $
Powered by six Cray XMT Supercomputers.
Your IP: 34.204.187.106

kernel-tools aaac9113-6065-4027-a7d3-20943ce3cfab

Status:Failed
Source URL:https://buildlogs.pld-linux.org/pld/th/x86_64/FAIL/kernel-tools,aaac9113-6065-4027-a7d3-20943ce3cfab.bz2
text/plain URL:View!
full text:View!
rpm -qa of builder:View!
Date:2020/06/21 15:52:02
Runtime:0:01:17.606434

Toc:

  • error 1
  • collect2: error: ld returned 1 exit status
  • error 2
  • make[2]: *** [Makefile:413: libusbip.la] Error 1
  • error 3
  • make[1]: *** [Makefile:497: all-recursive] Error 1
  • error 4
  • error: Bad exit status from /tmp/B.qk2zo_/BUILD/tmp/rpm-tmp.17600 (%build)
  • error 5
  • RPM build errors:
  • error 6
  • error: No files produced.

Content:

checking fcntl.h usability... yes
checking fcntl.h presence... yes
checking for fcntl.h... yes
checking netdb.h usability... yes
checking netdb.h presence... yes
checking for netdb.h... yes
checking netinet/in.h usability... yes
checking netinet/in.h presence... yes
checking for netinet/in.h... yes
checking for stdint.h... (cached) yes
checking for stdlib.h... (cached) yes
checking for string.h... (cached) yes
checking sys/socket.h usability... yes
checking sys/socket.h presence... yes
checking for sys/socket.h... yes
checking syslog.h usability... yes
checking syslog.h presence... yes
checking for syslog.h... yes
checking for unistd.h... (cached) yes
checking for int32_t... yes
checking for size_t... yes
checking for ssize_t... yes
checking for uint16_t... yes
checking for uint32_t... yes
checking for uint8_t... yes
checking for stdlib.h... (cached) yes
checking for GNU libc compatible realloc... yes
checking for memset... yes
checking for mkdir... yes
checking for regcomp... yes
checking for socket... yes
checking for strchr... yes
checking for strerror... yes
checking for strstr... yes
checking for strtoul... yes
checking libudev.h usability... yes
checking libudev.h presence... yes
checking for libudev.h... yes
checking for udev_new in -ludev... yes
checking whether to use the libwrap (TCP wrappers) library... (default)
checking for hosts_access in -lwrap... yes
checking whether to use fortify... default
checking that generated files are newer than configure... done
configure: creating ./config.status
config.status: creating Makefile
config.status: creating libsrc/Makefile
config.status: creating src/Makefile
config.status: creating config.h
config.status: executing depfiles commands
config.status: executing libtool commands
+ /usr/bin/make -Otarget -j9
/usr/bin/make  all-recursive
Making all in libsrc
make[2]: Entering directory '/tmp/B.qk2zo_/BUILD/kernel-tools-5.7.0/linux-5.7/tools/usb/usbip/libsrc'
/bin/sh ../libtool  --tag=CC   --mode=compile x86_64-pld-linux-gcc -DHAVE_CONFIG_H -I. -I..  -DUSBIDS_FILE='"/lib/hwdata/usb.ids"'  -Wall -Werror -Wextra -std=gnu99 -O2 -fwrapv -pipe -Wformat -Werror=format-security -Wp,-D_FORTIFY_SOURCE=2 -fstack-protector-strong --param=ssp-buffer-size=4 -Werror=trampolines -fPIC -march=x86-64    -MT libusbip_la-usbip_host_driver.lo -MD -MP -MF .deps/libusbip_la-usbip_host_driver.Tpo -c -o libusbip_la-usbip_host_driver.lo `test -f 'usbip_host_driver.c' || echo './'`usbip_host_driver.c
libtool: compile:  x86_64-pld-linux-gcc -DHAVE_CONFIG_H -I. -I.. -DUSBIDS_FILE=\"/lib/hwdata/usb.ids\" -Wall -Werror -Wextra -std=gnu99 -O2 -fwrapv -pipe -Wformat -Werror=format-security -Wp,-D_FORTIFY_SOURCE=2 -fstack-protector-strong --param=ssp-buffer-size=4 -Werror=trampolines -fPIC -march=x86-64 -MT libusbip_la-usbip_host_driver.lo -MD -MP -MF .deps/libusbip_la-usbip_host_driver.Tpo -c usbip_host_driver.c  -fPIC -DPIC -o .libs/libusbip_la-usbip_host_driver.o
libtool: compile:  x86_64-pld-linux-gcc -DHAVE_CONFIG_H -I. -I.. -DUSBIDS_FILE=\"/lib/hwdata/usb.ids\" -Wall -Werror -Wextra -std=gnu99 -O2 -fwrapv -pipe -Wformat -Werror=format-security -Wp,-D_FORTIFY_SOURCE=2 -fstack-protector-strong --param=ssp-buffer-size=4 -Werror=trampolines -fPIC -march=x86-64 -MT libusbip_la-usbip_host_driver.lo -MD -MP -MF .deps/libusbip_la-usbip_host_driver.Tpo -c usbip_host_driver.c -o libusbip_la-usbip_host_driver.o >/dev/null 2>&1
mv -f .deps/libusbip_la-usbip_host_driver.Tpo .deps/libusbip_la-usbip_host_driver.Plo
make[2]: Leaving directory '/tmp/B.qk2zo_/BUILD/kernel-tools-5.7.0/linux-5.7/tools/usb/usbip/libsrc'
make[2]: Entering directory '/tmp/B.qk2zo_/BUILD/kernel-tools-5.7.0/linux-5.7/tools/usb/usbip/libsrc'
/bin/sh ../libtool  --tag=CC   --mode=compile x86_64-pld-linux-gcc -DHAVE_CONFIG_H -I. -I..  -DUSBIDS_FILE='"/lib/hwdata/usb.ids"'  -Wall -Werror -Wextra -std=gnu99 -O2 -fwrapv -pipe -Wformat -Werror=format-security -Wp,-D_FORTIFY_SOURCE=2 -fstack-protector-strong --param=ssp-buffer-size=4 -Werror=trampolines -fPIC -march=x86-64    -MT libusbip_la-sysfs_utils.lo -MD -MP -MF .deps/libusbip_la-sysfs_utils.Tpo -c -o libusbip_la-sysfs_utils.lo `test -f 'sysfs_utils.c' || echo './'`sysfs_utils.c
libtool: compile:  x86_64-pld-linux-gcc -DHAVE_CONFIG_H -I. -I.. -DUSBIDS_FILE=\"/lib/hwdata/usb.ids\" -Wall -Werror -Wextra -std=gnu99 -O2 -fwrapv -pipe -Wformat -Werror=format-security -Wp,-D_FORTIFY_SOURCE=2 -fstack-protector-strong --param=ssp-buffer-size=4 -Werror=trampolines -fPIC -march=x86-64 -MT libusbip_la-sysfs_utils.lo -MD -MP -MF .deps/libusbip_la-sysfs_utils.Tpo -c sysfs_utils.c  -fPIC -DPIC -o .libs/libusbip_la-sysfs_utils.o
libtool: compile:  x86_64-pld-linux-gcc -DHAVE_CONFIG_H -I. -I.. -DUSBIDS_FILE=\"/lib/hwdata/usb.ids\" -Wall -Werror -Wextra -std=gnu99 -O2 -fwrapv -pipe -Wformat -Werror=format-security -Wp,-D_FORTIFY_SOURCE=2 -fstack-protector-strong --param=ssp-buffer-size=4 -Werror=trampolines -fPIC -march=x86-64 -MT libusbip_la-sysfs_utils.lo -MD -MP -MF .deps/libusbip_la-sysfs_utils.Tpo -c sysfs_utils.c -o libusbip_la-sysfs_utils.o >/dev/null 2>&1
mv -f .deps/libusbip_la-sysfs_utils.Tpo .deps/libusbip_la-sysfs_utils.Plo
make[2]: Leaving directory '/tmp/B.qk2zo_/BUILD/kernel-tools-5.7.0/linux-5.7/tools/usb/usbip/libsrc'
make[2]: Entering directory '/tmp/B.qk2zo_/BUILD/kernel-tools-5.7.0/linux-5.7/tools/usb/usbip/libsrc'
/bin/sh ../libtool  --tag=CC   --mode=compile x86_64-pld-linux-gcc -DHAVE_CONFIG_H -I. -I..  -DUSBIDS_FILE='"/lib/hwdata/usb.ids"'  -Wall -Werror -Wextra -std=gnu99 -O2 -fwrapv -pipe -Wformat -Werror=format-security -Wp,-D_FORTIFY_SOURCE=2 -fstack-protector-strong --param=ssp-buffer-size=4 -Werror=trampolines -fPIC -march=x86-64    -MT libusbip_la-usbip_device_driver.lo -MD -MP -MF .deps/libusbip_la-usbip_device_driver.Tpo -c -o libusbip_la-usbip_device_driver.lo `test -f 'usbip_device_driver.c' || echo './'`usbip_device_driver.c
libtool: compile:  x86_64-pld-linux-gcc -DHAVE_CONFIG_H -I. -I.. -DUSBIDS_FILE=\"/lib/hwdata/usb.ids\" -Wall -Werror -Wextra -std=gnu99 -O2 -fwrapv -pipe -Wformat -Werror=format-security -Wp,-D_FORTIFY_SOURCE=2 -fstack-protector-strong --param=ssp-buffer-size=4 -Werror=trampolines -fPIC -march=x86-64 -MT libusbip_la-usbip_device_driver.lo -MD -MP -MF .deps/libusbip_la-usbip_device_driver.Tpo -c usbip_device_driver.c  -fPIC -DPIC -o .libs/libusbip_la-usbip_device_driver.o
libtool: compile:  x86_64-pld-linux-gcc -DHAVE_CONFIG_H -I. -I.. -DUSBIDS_FILE=\"/lib/hwdata/usb.ids\" -Wall -Werror -Wextra -std=gnu99 -O2 -fwrapv -pipe -Wformat -Werror=format-security -Wp,-D_FORTIFY_SOURCE=2 -fstack-protector-strong --param=ssp-buffer-size=4 -Werror=trampolines -fPIC -march=x86-64 -MT libusbip_la-usbip_device_driver.lo -MD -MP -MF .deps/libusbip_la-usbip_device_driver.Tpo -c usbip_device_driver.c -o libusbip_la-usbip_device_driver.o >/dev/null 2>&1
mv -f .deps/libusbip_la-usbip_device_driver.Tpo .deps/libusbip_la-usbip_device_driver.Plo
make[2]: Leaving directory '/tmp/B.qk2zo_/BUILD/kernel-tools-5.7.0/linux-5.7/tools/usb/usbip/libsrc'
make[2]: Entering directory '/tmp/B.qk2zo_/BUILD/kernel-tools-5.7.0/linux-5.7/tools/usb/usbip/libsrc'
/bin/sh ../libtool  --tag=CC   --mode=compile x86_64-pld-linux-gcc -DHAVE_CONFIG_H -I. -I..  -DUSBIDS_FILE='"/lib/hwdata/usb.ids"'  -Wall -Werror -Wextra -std=gnu99 -O2 -fwrapv -pipe -Wformat -Werror=format-security -Wp,-D_FORTIFY_SOURCE=2 -fstack-protector-strong --param=ssp-buffer-size=4 -Werror=trampolines -fPIC -march=x86-64    -MT libusbip_la-usbip_host_common.lo -MD -MP -MF .deps/libusbip_la-usbip_host_common.Tpo -c -o libusbip_la-usbip_host_common.lo `test -f 'usbip_host_common.c' || echo './'`usbip_host_common.c
libtool: compile:  x86_64-pld-linux-gcc -DHAVE_CONFIG_H -I. -I.. -DUSBIDS_FILE=\"/lib/hwdata/usb.ids\" -Wall -Werror -Wextra -std=gnu99 -O2 -fwrapv -pipe -Wformat -Werror=format-security -Wp,-D_FORTIFY_SOURCE=2 -fstack-protector-strong --param=ssp-buffer-size=4 -Werror=trampolines -fPIC -march=x86-64 -MT libusbip_la-usbip_host_common.lo -MD -MP -MF .deps/libusbip_la-usbip_host_common.Tpo -c usbip_host_common.c  -fPIC -DPIC -o .libs/libusbip_la-usbip_host_common.o
libtool: compile:  x86_64-pld-linux-gcc -DHAVE_CONFIG_H -I. -I.. -DUSBIDS_FILE=\"/lib/hwdata/usb.ids\" -Wall -Werror -Wextra -std=gnu99 -O2 -fwrapv -pipe -Wformat -Werror=format-security -Wp,-D_FORTIFY_SOURCE=2 -fstack-protector-strong --param=ssp-buffer-size=4 -Werror=trampolines -fPIC -march=x86-64 -MT libusbip_la-usbip_host_common.lo -MD -MP -MF .deps/libusbip_la-usbip_host_common.Tpo -c usbip_host_common.c -o libusbip_la-usbip_host_common.o >/dev/null 2>&1
mv -f .deps/libusbip_la-usbip_host_common.Tpo .deps/libusbip_la-usbip_host_common.Plo
make[2]: Leaving directory '/tmp/B.qk2zo_/BUILD/kernel-tools-5.7.0/linux-5.7/tools/usb/usbip/libsrc'
make[2]: Entering directory '/tmp/B.qk2zo_/BUILD/kernel-tools-5.7.0/linux-5.7/tools/usb/usbip/libsrc'
/bin/sh ../libtool  --tag=CC   --mode=compile x86_64-pld-linux-gcc -DHAVE_CONFIG_H -I. -I..  -DUSBIDS_FILE='"/lib/hwdata/usb.ids"'  -Wall -Werror -Wextra -std=gnu99 -O2 -fwrapv -pipe -Wformat -Werror=format-security -Wp,-D_FORTIFY_SOURCE=2 -fstack-protector-strong --param=ssp-buffer-size=4 -Werror=trampolines -fPIC -march=x86-64    -MT libusbip_la-usbip_common.lo -MD -MP -MF .deps/libusbip_la-usbip_common.Tpo -c -o libusbip_la-usbip_common.lo `test -f 'usbip_common.c' || echo './'`usbip_common.c
libtool: compile:  x86_64-pld-linux-gcc -DHAVE_CONFIG_H -I. -I.. -DUSBIDS_FILE=\"/lib/hwdata/usb.ids\" -Wall -Werror -Wextra -std=gnu99 -O2 -fwrapv -pipe -Wformat -Werror=format-security -Wp,-D_FORTIFY_SOURCE=2 -fstack-protector-strong --param=ssp-buffer-size=4 -Werror=trampolines -fPIC -march=x86-64 -MT libusbip_la-usbip_common.lo -MD -MP -MF .deps/libusbip_la-usbip_common.Tpo -c usbip_common.c  -fPIC -DPIC -o .libs/libusbip_la-usbip_common.o
libtool: compile:  x86_64-pld-linux-gcc -DHAVE_CONFIG_H -I. -I.. -DUSBIDS_FILE=\"/lib/hwdata/usb.ids\" -Wall -Werror -Wextra -std=gnu99 -O2 -fwrapv -pipe -Wformat -Werror=format-security -Wp,-D_FORTIFY_SOURCE=2 -fstack-protector-strong --param=ssp-buffer-size=4 -Werror=trampolines -fPIC -march=x86-64 -MT libusbip_la-usbip_common.lo -MD -MP -MF .deps/libusbip_la-usbip_common.Tpo -c usbip_common.c -o libusbip_la-usbip_common.o >/dev/null 2>&1
mv -f .deps/libusbip_la-usbip_common.Tpo .deps/libusbip_la-usbip_common.Plo
make[2]: Leaving directory '/tmp/B.qk2zo_/BUILD/kernel-tools-5.7.0/linux-5.7/tools/usb/usbip/libsrc'
make[2]: Entering directory '/tmp/B.qk2zo_/BUILD/kernel-tools-5.7.0/linux-5.7/tools/usb/usbip/libsrc'
/bin/sh ../libtool  --tag=CC   --mode=compile x86_64-pld-linux-gcc -DHAVE_CONFIG_H -I. -I..  -DUSBIDS_FILE='"/lib/hwdata/usb.ids"'  -Wall -Werror -Wextra -std=gnu99 -O2 -fwrapv -pipe -Wformat -Werror=format-security -Wp,-D_FORTIFY_SOURCE=2 -fstack-protector-strong --param=ssp-buffer-size=4 -Werror=trampolines -fPIC -march=x86-64    -MT libusbip_la-vhci_driver.lo -MD -MP -MF .deps/libusbip_la-vhci_driver.Tpo -c -o libusbip_la-vhci_driver.lo `test -f 'vhci_driver.c' || echo './'`vhci_driver.c
libtool: compile:  x86_64-pld-linux-gcc -DHAVE_CONFIG_H -I. -I.. -DUSBIDS_FILE=\"/lib/hwdata/usb.ids\" -Wall -Werror -Wextra -std=gnu99 -O2 -fwrapv -pipe -Wformat -Werror=format-security -Wp,-D_FORTIFY_SOURCE=2 -fstack-protector-strong --param=ssp-buffer-size=4 -Werror=trampolines -fPIC -march=x86-64 -MT libusbip_la-vhci_driver.lo -MD -MP -MF .deps/libusbip_la-vhci_driver.Tpo -c vhci_driver.c  -fPIC -DPIC -o .libs/libusbip_la-vhci_driver.o
libtool: compile:  x86_64-pld-linux-gcc -DHAVE_CONFIG_H -I. -I.. -DUSBIDS_FILE=\"/lib/hwdata/usb.ids\" -Wall -Werror -Wextra -std=gnu99 -O2 -fwrapv -pipe -Wformat -Werror=format-security -Wp,-D_FORTIFY_SOURCE=2 -fstack-protector-strong --param=ssp-buffer-size=4 -Werror=trampolines -fPIC -march=x86-64 -MT libusbip_la-vhci_driver.lo -MD -MP -MF .deps/libusbip_la-vhci_driver.Tpo -c vhci_driver.c -o libusbip_la-vhci_driver.o >/dev/null 2>&1
mv -f .deps/libusbip_la-vhci_driver.Tpo .deps/libusbip_la-vhci_driver.Plo
make[2]: Leaving directory '/tmp/B.qk2zo_/BUILD/kernel-tools-5.7.0/linux-5.7/tools/usb/usbip/libsrc'
make[2]: Entering directory '/tmp/B.qk2zo_/BUILD/kernel-tools-5.7.0/linux-5.7/tools/usb/usbip/libsrc'
/bin/sh ../libtool  --tag=CC   --mode=compile x86_64-pld-linux-gcc -DHAVE_CONFIG_H -I. -I..  -DUSBIDS_FILE='"/lib/hwdata/usb.ids"'  -Wall -Werror -Wextra -std=gnu99 -O2 -fwrapv -pipe -Wformat -Werror=format-security -Wp,-D_FORTIFY_SOURCE=2 -fstack-protector-strong --param=ssp-buffer-size=4 -Werror=trampolines -fPIC -march=x86-64    -MT libusbip_la-names.lo -MD -MP -MF .deps/libusbip_la-names.Tpo -c -o libusbip_la-names.lo `test -f 'names.c' || echo './'`names.c
libtool: compile:  x86_64-pld-linux-gcc -DHAVE_CONFIG_H -I. -I.. -DUSBIDS_FILE=\"/lib/hwdata/usb.ids\" -Wall -Werror -Wextra -std=gnu99 -O2 -fwrapv -pipe -Wformat -Werror=format-security -Wp,-D_FORTIFY_SOURCE=2 -fstack-protector-strong --param=ssp-buffer-size=4 -Werror=trampolines -fPIC -march=x86-64 -MT libusbip_la-names.lo -MD -MP -MF .deps/libusbip_la-names.Tpo -c names.c  -fPIC -DPIC -o .libs/libusbip_la-names.o
libtool: compile:  x86_64-pld-linux-gcc -DHAVE_CONFIG_H -I. -I.. -DUSBIDS_FILE=\"/lib/hwdata/usb.ids\" -Wall -Werror -Wextra -std=gnu99 -O2 -fwrapv -pipe -Wformat -Werror=format-security -Wp,-D_FORTIFY_SOURCE=2 -fstack-protector-strong --param=ssp-buffer-size=4 -Werror=trampolines -fPIC -march=x86-64 -MT libusbip_la-names.lo -MD -MP -MF .deps/libusbip_la-names.Tpo -c names.c -o libusbip_la-names.o >/dev/null 2>&1
mv -f .deps/libusbip_la-names.Tpo .deps/libusbip_la-names.Plo
make[2]: Leaving directory '/tmp/B.qk2zo_/BUILD/kernel-tools-5.7.0/linux-5.7/tools/usb/usbip/libsrc'
make[2]: Entering directory '/tmp/B.qk2zo_/BUILD/kernel-tools-5.7.0/linux-5.7/tools/usb/usbip/libsrc'
/bin/sh ../libtool  --tag=CC   --mode=link x86_64-pld-linux-gcc -Wall -Werror -Wextra -std=gnu99 -O2 -fwrapv -pipe -Wformat -Werror=format-security -Wp,-D_FORTIFY_SOURCE=2 -fstack-protector-strong --param=ssp-buffer-size=4 -Werror=trampolines -fPIC -march=x86-64    -version-info 0:1:0 -Wl,--as-needed -Wl,--no-copy-dt-needed-entries -Wl,-z,relro -Wl,-z,combreloc  -o libusbip.la -rpath /usr/lib64 libusbip_la-names.lo libusbip_la-usbip_host_driver.lo libusbip_la-usbip_device_driver.lo libusbip_la-usbip_common.lo libusbip_la-usbip_host_common.lo libusbip_la-vhci_driver.lo libusbip_la-sysfs_utils.lo  -lwrap  -ludev
libtool: link: x86_64-pld-linux-gcc -shared  -fPIC -DPIC  -O2 -fstack-protector-strong -march=x86-64 -Wl,--as-needed -Wl,--no-copy-dt-needed-entries -Wl,-z -Wl,relro -Wl,-z -Wl,combreloc    .libs/libusbip_la-names.o .libs/libusbip_la-usbip_host_driver.o .libs/libusbip_la-usbip_device_driver.o .libs/libusbip_la-usbip_common.o .libs/libusbip_la-usbip_host_common.o .libs/libusbip_la-vhci_driver.o .libs/libusbip_la-sysfs_utils.o   /usr/lib64/libwrap.so -ludev -Wl,-soname -Wl,libusbip.so.0 -o .libs/libusbip.so.0.0.1
/usr/bin/ld: .libs/libusbip_la-vhci_driver.o:(.bss+0x0): multiple definition of `udev_context'; .libs/libusbip_la-usbip_host_common.o:(.bss+0x0): first defined here
collect2: error: ld returned 1 exit status
make[2]: *** [Makefile:413: libusbip.la] Error 1
make[2]: Leaving directory '/tmp/B.qk2zo_/BUILD/kernel-tools-5.7.0/linux-5.7/tools/usb/usbip/libsrc'
make[1]: *** [Makefile:497: all-recursive] Error 1
make: *** [Makefile:365: all] Error 2
error: Bad exit status from /tmp/B.qk2zo_/BUILD/tmp/rpm-tmp.17600 (%build)


RPM build errors:
    Bad exit status from /tmp/B.qk2zo_/BUILD/tmp/rpm-tmp.17600 (%build)
ended at: Sun Jun 21 15:51:58 2020, done in 0:01:17.606434
error: No files produced.
+ chmod -R u+rwX /tmp/B.qk2zo_/BUILD
+ rm -rf /tmp/B.qk2zo_/tmp /tmp/B.qk2zo_/BUILD
+ rm -rf /tmp/B.qk2zo_
Begin-PLD-Builder-Info
Build-Time: user:230.85s sys:33.52s real:115.59s (faults io:773 non-io:6972781)

End-PLD-Builder-Info
[Back to list of logs] [View rpm -qa of builder]