FailedOk

th/SRPMS[OK]
th/x32[OK]
th/i686[OK]
th/x86_64[OK]

ac/SRPMS[OK]
ac/i386[OK]
ac/i586[OK]
ac/i686[OK]
ac/alpha[OK]
ac/amd64[OK]
ac/athlon[OK]
ac/ppc[OK]
ac/sparc[OK]
ac/sparc64[OK]

Advanced Search
main()
Powered by PLD Linux
(c) 2002-2018 PLD Team
$Revision: 1.37 $
Powered by power.
Your IP: 54.235.57.105

kf5-kcoreaddons 06eb3066-166b-4b2e-9c32-8d6f246ae075

Status:Failed
Source URL:ftp://buildlogs.pld-linux.org/th/x86_64/FAIL/kf5-kcoreaddons,06eb3066-166b-4b2e-9c32-8d6f246ae075.bz2
text/plain URL:View!
full text:View!
rpm -qa of builder:View!
Date:2018/02/13 22:15:00
Runtime:0:08:20.758194

Toc:

  • error 1
  • error: Bad exit status from /tmp/B.TxXuhC/BUILD/tmp/rpm-tmp.3732 (%build)
  • error 2
  • RPM build errors:
  • error 3
  • error: No files produced.

Content:

cd /tmp/B.TxXuhC/BUILD/kcoreaddons-5.43.0/build/tests && /usr/bin/x86_64-pld-linux-g++  -DQT_CORE_LIB -DQT_GUI_LIB -DQT_NO_CAST_FROM_BYTEARRAY -DQT_NO_CAST_TO_ASCII -DQT_NO_DEBUG -DQT_NO_SIGNALS_SLOTS_KEYWORDS -DQT_NO_URL_CAST_FROM_STRING -DQT_USE_FAST_OPERATOR_PLUS -DQT_USE_QSTRINGBUILDER -DQT_WIDGETS_LIB -D_GNU_SOURCE -D_LARGEFILE64_SOURCE -I/tmp/B.TxXuhC/BUILD/kcoreaddons-5.43.0/build/tests -I/tmp/B.TxXuhC/BUILD/kcoreaddons-5.43.0/tests -I/tmp/B.TxXuhC/BUILD/kcoreaddons-5.43.0/build/tests/faceicontest_autogen/include -I/tmp/B.TxXuhC/BUILD/kcoreaddons-5.43.0/build/src/lib/../.. -I/tmp/B.TxXuhC/BUILD/kcoreaddons-5.43.0/src/lib/caching -I/tmp/B.TxXuhC/BUILD/kcoreaddons-5.43.0/build/src/lib/io -I/tmp/B.TxXuhC/BUILD/kcoreaddons-5.43.0/src/lib/io -I/tmp/B.TxXuhC/BUILD/kcoreaddons-5.43.0/src/lib/jobs -I/tmp/B.TxXuhC/BUILD/kcoreaddons-5.43.0/src/lib/plugin -I/tmp/B.TxXuhC/BUILD/kcoreaddons-5.43.0/src/lib/randomness -I/tmp/B.TxXuhC/BUILD/kcoreaddons-5.43.0/src/lib/text -I/tmp/B.TxXuhC/BUILD/kcoreaddons-5.43.0/src/lib/util -I/tmp/B.TxXuhC/BUILD/kcoreaddons-5.43.0/build/src/lib -I/tmp/B.TxXuhC/BUILD/kcoreaddons-5.43.0/src/lib -isystem /usr/include/qt5 -isystem /usr/include/qt5/QtWidgets -isystem /usr/include/qt5/QtGui -isystem /usr/include/qt5/QtCore -isystem /usr/lib64/qt5/./mkspecs/linux-g++  -std=c++0x -fno-operator-names -Wall -Wextra -Wcast-align -Wchar-subscripts -Wformat-security -Wno-long-long -Wpointer-arith -Wundef -Wnon-virtual-dtor -Woverloaded-virtual -Werror=return-type -Wvla -Wdate-time -pedantic -Wsuggest-override -fexceptions -O2 -fwrapv -pipe -Wformat -Werror=format-security -gdwarf-4 -fno-debug-types-section -fvar-tracking-assignments -g2 -Wp,-D_FORTIFY_SOURCE=2 -fstack-protector-strong --param=ssp-buffer-size=4 -fPIC -march=x86-64 -gdwarf-4 -fno-debug-types-section -fvar-tracking-assignments -g2  -DNDEBUG -DQT_NO_DEBUG -fvisibility=hidden -fvisibility-inlines-hidden   -fPIC -std=gnu++11 -o CMakeFiles/faceicontest.dir/faceicontest.cpp.o -c /tmp/B.TxXuhC/BUILD/kcoreaddons-5.43.0/tests/faceicontest.cpp
make[2]: Leaving directory '/tmp/B.TxXuhC/BUILD/kcoreaddons-5.43.0/build'
make[2]: Entering directory '/tmp/B.TxXuhC/BUILD/kcoreaddons-5.43.0/build'
[ 98%] Building CXX object tests/CMakeFiles/kdirwatchtest_gui.dir/kdirwatchtest_gui_autogen/mocs_compilation.cpp.o
cd /tmp/B.TxXuhC/BUILD/kcoreaddons-5.43.0/build/tests && /usr/bin/x86_64-pld-linux-g++  -DQT_CORE_LIB -DQT_GUI_LIB -DQT_NO_CAST_FROM_BYTEARRAY -DQT_NO_CAST_TO_ASCII -DQT_NO_DEBUG -DQT_NO_SIGNALS_SLOTS_KEYWORDS -DQT_NO_URL_CAST_FROM_STRING -DQT_USE_FAST_OPERATOR_PLUS -DQT_USE_QSTRINGBUILDER -DQT_WIDGETS_LIB -D_GNU_SOURCE -D_LARGEFILE64_SOURCE -I/tmp/B.TxXuhC/BUILD/kcoreaddons-5.43.0/build/tests -I/tmp/B.TxXuhC/BUILD/kcoreaddons-5.43.0/tests -I/tmp/B.TxXuhC/BUILD/kcoreaddons-5.43.0/build/tests/kdirwatchtest_gui_autogen/include -I/tmp/B.TxXuhC/BUILD/kcoreaddons-5.43.0/build/src/lib/../.. -I/tmp/B.TxXuhC/BUILD/kcoreaddons-5.43.0/src/lib/caching -I/tmp/B.TxXuhC/BUILD/kcoreaddons-5.43.0/build/src/lib/io -I/tmp/B.TxXuhC/BUILD/kcoreaddons-5.43.0/src/lib/io -I/tmp/B.TxXuhC/BUILD/kcoreaddons-5.43.0/src/lib/jobs -I/tmp/B.TxXuhC/BUILD/kcoreaddons-5.43.0/src/lib/plugin -I/tmp/B.TxXuhC/BUILD/kcoreaddons-5.43.0/src/lib/randomness -I/tmp/B.TxXuhC/BUILD/kcoreaddons-5.43.0/src/lib/text -I/tmp/B.TxXuhC/BUILD/kcoreaddons-5.43.0/src/lib/util -I/tmp/B.TxXuhC/BUILD/kcoreaddons-5.43.0/build/src/lib -I/tmp/B.TxXuhC/BUILD/kcoreaddons-5.43.0/src/lib -isystem /usr/include/qt5 -isystem /usr/include/qt5/QtWidgets -isystem /usr/include/qt5/QtGui -isystem /usr/include/qt5/QtCore -isystem /usr/lib64/qt5/./mkspecs/linux-g++  -std=c++0x -fno-operator-names -Wall -Wextra -Wcast-align -Wchar-subscripts -Wformat-security -Wno-long-long -Wpointer-arith -Wundef -Wnon-virtual-dtor -Woverloaded-virtual -Werror=return-type -Wvla -Wdate-time -pedantic -Wsuggest-override -fexceptions -O2 -fwrapv -pipe -Wformat -Werror=format-security -gdwarf-4 -fno-debug-types-section -fvar-tracking-assignments -g2 -Wp,-D_FORTIFY_SOURCE=2 -fstack-protector-strong --param=ssp-buffer-size=4 -fPIC -march=x86-64 -gdwarf-4 -fno-debug-types-section -fvar-tracking-assignments -g2  -DNDEBUG -DQT_NO_DEBUG -fvisibility=hidden -fvisibility-inlines-hidden   -fPIC -std=gnu++11 -o CMakeFiles/kdirwatchtest_gui.dir/kdirwatchtest_gui_autogen/mocs_compilation.cpp.o -c /tmp/B.TxXuhC/BUILD/kcoreaddons-5.43.0/build/tests/kdirwatchtest_gui_autogen/mocs_compilation.cpp
make[2]: Leaving directory '/tmp/B.TxXuhC/BUILD/kcoreaddons-5.43.0/build'
make[2]: Entering directory '/tmp/B.TxXuhC/BUILD/kcoreaddons-5.43.0/build'
[100%] Building CXX object tests/CMakeFiles/faceicontest.dir/faceicontest_autogen/mocs_compilation.cpp.o
cd /tmp/B.TxXuhC/BUILD/kcoreaddons-5.43.0/build/tests && /usr/bin/x86_64-pld-linux-g++  -DQT_CORE_LIB -DQT_GUI_LIB -DQT_NO_CAST_FROM_BYTEARRAY -DQT_NO_CAST_TO_ASCII -DQT_NO_DEBUG -DQT_NO_SIGNALS_SLOTS_KEYWORDS -DQT_NO_URL_CAST_FROM_STRING -DQT_USE_FAST_OPERATOR_PLUS -DQT_USE_QSTRINGBUILDER -DQT_WIDGETS_LIB -D_GNU_SOURCE -D_LARGEFILE64_SOURCE -I/tmp/B.TxXuhC/BUILD/kcoreaddons-5.43.0/build/tests -I/tmp/B.TxXuhC/BUILD/kcoreaddons-5.43.0/tests -I/tmp/B.TxXuhC/BUILD/kcoreaddons-5.43.0/build/tests/faceicontest_autogen/include -I/tmp/B.TxXuhC/BUILD/kcoreaddons-5.43.0/build/src/lib/../.. -I/tmp/B.TxXuhC/BUILD/kcoreaddons-5.43.0/src/lib/caching -I/tmp/B.TxXuhC/BUILD/kcoreaddons-5.43.0/build/src/lib/io -I/tmp/B.TxXuhC/BUILD/kcoreaddons-5.43.0/src/lib/io -I/tmp/B.TxXuhC/BUILD/kcoreaddons-5.43.0/src/lib/jobs -I/tmp/B.TxXuhC/BUILD/kcoreaddons-5.43.0/src/lib/plugin -I/tmp/B.TxXuhC/BUILD/kcoreaddons-5.43.0/src/lib/randomness -I/tmp/B.TxXuhC/BUILD/kcoreaddons-5.43.0/src/lib/text -I/tmp/B.TxXuhC/BUILD/kcoreaddons-5.43.0/src/lib/util -I/tmp/B.TxXuhC/BUILD/kcoreaddons-5.43.0/build/src/lib -I/tmp/B.TxXuhC/BUILD/kcoreaddons-5.43.0/src/lib -isystem /usr/include/qt5 -isystem /usr/include/qt5/QtWidgets -isystem /usr/include/qt5/QtGui -isystem /usr/include/qt5/QtCore -isystem /usr/lib64/qt5/./mkspecs/linux-g++  -std=c++0x -fno-operator-names -Wall -Wextra -Wcast-align -Wchar-subscripts -Wformat-security -Wno-long-long -Wpointer-arith -Wundef -Wnon-virtual-dtor -Woverloaded-virtual -Werror=return-type -Wvla -Wdate-time -pedantic -Wsuggest-override -fexceptions -O2 -fwrapv -pipe -Wformat -Werror=format-security -gdwarf-4 -fno-debug-types-section -fvar-tracking-assignments -g2 -Wp,-D_FORTIFY_SOURCE=2 -fstack-protector-strong --param=ssp-buffer-size=4 -fPIC -march=x86-64 -gdwarf-4 -fno-debug-types-section -fvar-tracking-assignments -g2  -DNDEBUG -DQT_NO_DEBUG -fvisibility=hidden -fvisibility-inlines-hidden   -fPIC -std=gnu++11 -o CMakeFiles/faceicontest.dir/faceicontest_autogen/mocs_compilation.cpp.o -c /tmp/B.TxXuhC/BUILD/kcoreaddons-5.43.0/build/tests/faceicontest_autogen/mocs_compilation.cpp
make[2]: Leaving directory '/tmp/B.TxXuhC/BUILD/kcoreaddons-5.43.0/build'
make[2]: Entering directory '/tmp/B.TxXuhC/BUILD/kcoreaddons-5.43.0/build'
[ 96%] Building CXX object tests/CMakeFiles/kdirwatchtest_gui.dir/kdirwatchtest_gui.cpp.o
cd /tmp/B.TxXuhC/BUILD/kcoreaddons-5.43.0/build/tests && /usr/bin/x86_64-pld-linux-g++  -DQT_CORE_LIB -DQT_GUI_LIB -DQT_NO_CAST_FROM_BYTEARRAY -DQT_NO_CAST_TO_ASCII -DQT_NO_DEBUG -DQT_NO_SIGNALS_SLOTS_KEYWORDS -DQT_NO_URL_CAST_FROM_STRING -DQT_USE_FAST_OPERATOR_PLUS -DQT_USE_QSTRINGBUILDER -DQT_WIDGETS_LIB -D_GNU_SOURCE -D_LARGEFILE64_SOURCE -I/tmp/B.TxXuhC/BUILD/kcoreaddons-5.43.0/build/tests -I/tmp/B.TxXuhC/BUILD/kcoreaddons-5.43.0/tests -I/tmp/B.TxXuhC/BUILD/kcoreaddons-5.43.0/build/tests/kdirwatchtest_gui_autogen/include -I/tmp/B.TxXuhC/BUILD/kcoreaddons-5.43.0/build/src/lib/../.. -I/tmp/B.TxXuhC/BUILD/kcoreaddons-5.43.0/src/lib/caching -I/tmp/B.TxXuhC/BUILD/kcoreaddons-5.43.0/build/src/lib/io -I/tmp/B.TxXuhC/BUILD/kcoreaddons-5.43.0/src/lib/io -I/tmp/B.TxXuhC/BUILD/kcoreaddons-5.43.0/src/lib/jobs -I/tmp/B.TxXuhC/BUILD/kcoreaddons-5.43.0/src/lib/plugin -I/tmp/B.TxXuhC/BUILD/kcoreaddons-5.43.0/src/lib/randomness -I/tmp/B.TxXuhC/BUILD/kcoreaddons-5.43.0/src/lib/text -I/tmp/B.TxXuhC/BUILD/kcoreaddons-5.43.0/src/lib/util -I/tmp/B.TxXuhC/BUILD/kcoreaddons-5.43.0/build/src/lib -I/tmp/B.TxXuhC/BUILD/kcoreaddons-5.43.0/src/lib -isystem /usr/include/qt5 -isystem /usr/include/qt5/QtWidgets -isystem /usr/include/qt5/QtGui -isystem /usr/include/qt5/QtCore -isystem /usr/lib64/qt5/./mkspecs/linux-g++  -std=c++0x -fno-operator-names -Wall -Wextra -Wcast-align -Wchar-subscripts -Wformat-security -Wno-long-long -Wpointer-arith -Wundef -Wnon-virtual-dtor -Woverloaded-virtual -Werror=return-type -Wvla -Wdate-time -pedantic -Wsuggest-override -fexceptions -O2 -fwrapv -pipe -Wformat -Werror=format-security -gdwarf-4 -fno-debug-types-section -fvar-tracking-assignments -g2 -Wp,-D_FORTIFY_SOURCE=2 -fstack-protector-strong --param=ssp-buffer-size=4 -fPIC -march=x86-64 -gdwarf-4 -fno-debug-types-section -fvar-tracking-assignments -g2  -DNDEBUG -DQT_NO_DEBUG -fvisibility=hidden -fvisibility-inlines-hidden   -fPIC -std=gnu++11 -o CMakeFiles/kdirwatchtest_gui.dir/kdirwatchtest_gui.cpp.o -c /tmp/B.TxXuhC/BUILD/kcoreaddons-5.43.0/tests/kdirwatchtest_gui.cpp
make[2]: Leaving directory '/tmp/B.TxXuhC/BUILD/kcoreaddons-5.43.0/build'
make[2]: Entering directory '/tmp/B.TxXuhC/BUILD/kcoreaddons-5.43.0/build'
[100%] Linking CXX executable ../bin/faceicontest
cd /tmp/B.TxXuhC/BUILD/kcoreaddons-5.43.0/build/tests && /usr/bin/cmake -E cmake_link_script CMakeFiles/faceicontest.dir/link.txt --verbose=1
/usr/bin/x86_64-pld-linux-g++  -std=c++0x -fno-operator-names -Wall -Wextra -Wcast-align -Wchar-subscripts -Wformat-security -Wno-long-long -Wpointer-arith -Wundef -Wnon-virtual-dtor -Woverloaded-virtual -Werror=return-type -Wvla -Wdate-time -pedantic -Wsuggest-override -fexceptions -O2 -fwrapv -pipe -Wformat -Werror=format-security -gdwarf-4 -fno-debug-types-section -fvar-tracking-assignments -g2 -Wp,-D_FORTIFY_SOURCE=2 -fstack-protector-strong --param=ssp-buffer-size=4 -fPIC -march=x86-64 -gdwarf-4 -fno-debug-types-section -fvar-tracking-assignments -g2  -DNDEBUG -DQT_NO_DEBUG  -Wl,--enable-new-dtags  -Wl,--as-needed -Wl,--no-copy-dt-needed-entries -Wl,-z,relro -Wl,-z,combreloc -rdynamic CMakeFiles/faceicontest.dir/faceicontest.cpp.o CMakeFiles/faceicontest.dir/faceicontest_autogen/mocs_compilation.cpp.o  -o ../bin/faceicontest -Wl,-rpath,/tmp/B.TxXuhC/BUILD/kcoreaddons-5.43.0/build/bin /usr/lib64/libQt5Widgets.so.5.8.0 ../bin/libKF5CoreAddons.so.5.43.0 /usr/lib64/libQt5Gui.so.5.8.0 /usr/lib64/libQt5Core.so.5.8.0 
make[2]: Leaving directory '/tmp/B.TxXuhC/BUILD/kcoreaddons-5.43.0/build'
make[1]: Entering directory '/tmp/B.TxXuhC/BUILD/kcoreaddons-5.43.0/build'
[100%] Built target faceicontest
make[1]: Leaving directory '/tmp/B.TxXuhC/BUILD/kcoreaddons-5.43.0/build'
make[2]: Entering directory '/tmp/B.TxXuhC/BUILD/kcoreaddons-5.43.0/build'
[100%] Linking CXX executable ../bin/kdirwatchtest_gui
cd /tmp/B.TxXuhC/BUILD/kcoreaddons-5.43.0/build/tests && /usr/bin/cmake -E cmake_link_script CMakeFiles/kdirwatchtest_gui.dir/link.txt --verbose=1
/usr/bin/x86_64-pld-linux-g++  -std=c++0x -fno-operator-names -Wall -Wextra -Wcast-align -Wchar-subscripts -Wformat-security -Wno-long-long -Wpointer-arith -Wundef -Wnon-virtual-dtor -Woverloaded-virtual -Werror=return-type -Wvla -Wdate-time -pedantic -Wsuggest-override -fexceptions -O2 -fwrapv -pipe -Wformat -Werror=format-security -gdwarf-4 -fno-debug-types-section -fvar-tracking-assignments -g2 -Wp,-D_FORTIFY_SOURCE=2 -fstack-protector-strong --param=ssp-buffer-size=4 -fPIC -march=x86-64 -gdwarf-4 -fno-debug-types-section -fvar-tracking-assignments -g2  -DNDEBUG -DQT_NO_DEBUG  -Wl,--enable-new-dtags  -Wl,--as-needed -Wl,--no-copy-dt-needed-entries -Wl,-z,relro -Wl,-z,combreloc -rdynamic CMakeFiles/kdirwatchtest_gui.dir/kdirwatchtest_gui.cpp.o CMakeFiles/kdirwatchtest_gui.dir/kdirwatchtest_gui_autogen/mocs_compilation.cpp.o  -o ../bin/kdirwatchtest_gui -Wl,-rpath,/tmp/B.TxXuhC/BUILD/kcoreaddons-5.43.0/build/bin /usr/lib64/libQt5Widgets.so.5.8.0 ../bin/libKF5CoreAddons.so.5.43.0 /usr/lib64/libQt5Gui.so.5.8.0 /usr/lib64/libQt5Core.so.5.8.0 
make[2]: Leaving directory '/tmp/B.TxXuhC/BUILD/kcoreaddons-5.43.0/build'
make[1]: Entering directory '/tmp/B.TxXuhC/BUILD/kcoreaddons-5.43.0/build'
[100%] Built target kdirwatchtest_gui
make[1]: Leaving directory '/tmp/B.TxXuhC/BUILD/kcoreaddons-5.43.0/build'
/usr/bin/cmake -E cmake_progress_start /tmp/B.TxXuhC/BUILD/kcoreaddons-5.43.0/build/CMakeFiles 0
+ /usr/bin/make -Otarget -j5 test
Running tests...
/usr/bin/ctest --force-new-ctest-process 
Test project /tmp/B.TxXuhC/BUILD/kcoreaddons-5.43.0/build
      Start  1: appstreamtest
 1/25 Test  #1: appstreamtest ....................   Passed    0.01 sec
      Start  2: kaboutdatatest
 2/25 Test  #2: kaboutdatatest ...................***Failed    0.03 sec
      Start  3: kaboutdataapplicationdatatest
 3/25 Test  #3: kaboutdataapplicationdatatest ....   Passed    0.01 sec
      Start  4: kautosavefiletest
 4/25 Test  #4: kautosavefiletest ................***Failed    0.32 sec
      Start  5: kcompositejobtest
 5/25 Test  #5: kcompositejobtest ................   Passed    0.01 sec
      Start  6: kformattest
 6/25 Test  #6: kformattest ......................   Passed    0.02 sec
      Start  7: kjobtest
 7/25 Test  #7: kjobtest .........................   Passed    0.31 sec
      Start  8: kpluginfactorytest
 8/25 Test  #8: kpluginfactorytest ...............   Passed    0.01 sec
      Start  9: kpluginloadertest
 9/25 Test  #9: kpluginloadertest ................   Passed    0.02 sec
      Start 10: kpluginmetadatatest
10/25 Test #10: kpluginmetadatatest ..............   Passed    0.03 sec
      Start 11: kprocesstest
11/25 Test #11: kprocesstest .....................   Passed    0.04 sec
      Start 12: krandomtest
12/25 Test #12: krandomtest ......................   Passed    0.01 sec
      Start 13: kshareddatacachetest
13/25 Test #13: kshareddatacachetest .............   Passed    0.02 sec
      Start 14: kshelltest
14/25 Test #14: kshelltest .......................   Passed    0.01 sec
      Start 15: kurlmimedatatest
15/25 Test #15: kurlmimedatatest .................   Passed    0.01 sec
      Start 16: kstringhandlertest
16/25 Test #16: kstringhandlertest ...............***Failed    0.01 sec
      Start 17: kusertest
17/25 Test #17: kusertest ........................   Passed    0.01 sec
      Start 18: kdelibs4migrationtest
18/25 Test #18: kdelibs4migrationtest ............   Passed    0.01 sec
      Start 19: kdelibs4configmigratortest
19/25 Test #19: kdelibs4configmigratortest .......   Passed    0.05 sec
      Start 20: desktoptojsontest
20/25 Test #20: desktoptojsontest ................   Passed    0.05 sec
      Start 21: ktexttohtmltest
21/25 Test #21: ktexttohtmltest ..................   Passed    1.94 sec
      Start 22: kdirwatch_stat_unittest
22/25 Test #22: kdirwatch_stat_unittest ..........***Failed   40.65 sec
      Start 23: kdirwatch_inotify_unittest
23/25 Test #23: kdirwatch_inotify_unittest .......   Passed   18.90 sec
      Start 24: kdirwatch_fam_unittest
24/25 Test #24: kdirwatch_fam_unittest ...........***Exception: Child aborted338.34 sec
      Start 25: kdirwatch_qfswatch_unittest
25/25 Test #25: kdirwatch_qfswatch_unittest ......***Failed   43.49 sec

76% tests passed, 6 tests failed out of 25

Total Test time (real) = 444.30 sec

The following tests FAILED:
	  2 - kaboutdatatest (Failed)
	  4 - kautosavefiletest (Failed)
	 16 - kstringhandlertest (Failed)
	 22 - kdirwatch_stat_unittest (Failed)
	 24 - kdirwatch_fam_unittest (Child aborted)
	 25 - kdirwatch_qfswatch_unittest (Failed)
Errors while running CTest
make: *** [Makefile:110: test] Error 8
error: Bad exit status from /tmp/B.TxXuhC/BUILD/tmp/rpm-tmp.3732 (%build)


RPM build errors:
    Bad exit status from /tmp/B.TxXuhC/BUILD/tmp/rpm-tmp.3732 (%build)
ended at: Tue Feb 13 22:15:00 2018, done in 0:08:20.758194
error: No files produced.
mesg: ttyname failed: Inappropriate ioctl for device
+ chmod -R u+rwX /tmp/B.TxXuhC/BUILD
+ rm -rf /tmp/B.TxXuhC/tmp /tmp/B.TxXuhC/BUILD
mesg: ttyname failed: Inappropriate ioctl for device
+ rm -rf /tmp/B.TxXuhC
Begin-PLD-Builder-Info
Build-Time: user:190.07s sys:31.79s real:504.27s (faults io:10 non-io:4869611)

End-PLD-Builder-Info
[Back to list of logs] [View rpm -qa of builder]