FailedOk

th/SRPMS[OK]
th/x32[OK]
th/i686[OK]
th/x86_64[OK]

ac/SRPMS[OK]
ac/i386[OK]
ac/i586[OK]
ac/i686[OK]
ac/alpha[OK]
ac/amd64[OK]
ac/athlon[OK]
ac/ppc[OK]
ac/sparc[OK]
ac/sparc64[OK]

Advanced Search
main()
Powered by PLD Linux
(c) 2002-2019 PLD Team
$Revision: 1.37 $
Powered by Unix conspiracy.
Your IP: 3.226.251.205

lib7zip a6e125f2-75ac-49a8-8d84-da2830ecdd73

Status:Failed
Source URL:ftp://buildlogs.pld-linux.org/th/x86_64/FAIL/lib7zip,a6e125f2-75ac-49a8-8d84-da2830ecdd73.bz2
text/plain URL:View!
rpm -qa of builder:View!
Date:2018/12/31 18:13:32
Runtime:0:00:07.049258

Toc:

  • prep
  • Executing(%prep): /bin/sh -e /tmp/B.92el_X/BUILD/tmp/rpm-tmp.28638
  • build
  • Executing(%build): /bin/sh -e /tmp/B.92el_X/BUILD/tmp/rpm-tmp.91972
  • error 1
  • /tmp/B.92el_X/BUILD/lib7zip-3.0.0/p7zip_16.02/CPP/Windows/PropVariant.cpp:281:41: error: 'void* memcpy(void*, const void*, size_t)' writing to an object of type 'class NWindows::NCOM::CPropVariant' with no trivial copy-assignment; use copy-assignment or copy-initialization instead [-Werror=class-memaccess]
  • error 2
  • make[2]: *** [src/CMakeFiles/lib7zip_shared.dir/build.make:274: src/CMakeFiles/lib7zip_shared.dir/__/p7zip_16.02/CPP/Windows/PropVariant.cpp.o] Error 1
  • error 3
  • make[1]: *** [CMakeFiles/Makefile2:96: src/CMakeFiles/lib7zip_shared.dir/all] Error 2
  • error 4
  • /tmp/B.92el_X/BUILD/lib7zip-3.0.0/p7zip_16.02/CPP/Windows/PropVariant.cpp:281:41: error: 'void* memcpy(void*, const void*, size_t)' writing to an object of type 'class NWindows::NCOM::CPropVariant' with no trivial copy-assignment; use copy-assignment or copy-initialization instead [-Werror=class-memaccess]
  • error 5
  • make[2]: *** [src/CMakeFiles/lib7zip.dir/build.make:274: src/CMakeFiles/lib7zip.dir/__/p7zip_16.02/CPP/Windows/PropVariant.cpp.o] Error 1
  • error 6
  • make[1]: *** [CMakeFiles/Makefile2:133: src/CMakeFiles/lib7zip.dir/all] Error 2
  • error 7
  • error: Bad exit status from /tmp/B.92el_X/BUILD/tmp/rpm-tmp.91972 (%build)
  • error 8
  • RPM build errors:
  • error 9
  • error: No files produced.

Content:

request from: qboosh
checking if we should skip the build
started at: Mon Dec 31 18:13:21 2018
killing old processes on a builder
sending signal 9 to pid -1
Killed
cleaning up /tmp
fetching https://srcbuilder.pld-linux.org/th//srpms/a6e125f2-75ac-49a8-8d84-da2830ecdd73/lib7zip-3.0.0-1.src.rpm
fetched 4288393 bytes, 3639.0 K/s
installing srpm: lib7zip-3.0.0-1.src.rpm
+ install -d /tmp/B.92el_X/BUILD /tmp/B.92el_X/RPMS
+ LC_ALL=en_US.UTF-8
+ rpm -qp --changelog lib7zip-3.0.0-1.src.rpm
* Mon Dec 31 2018 PLD Linux Team <feedback@pld-linux.org>
- For complete changelog see: http://git.pld-linux.org/?p=packages/lib7zip.git;a=log;h=master
* Mon Dec 31 2018 Jakub Bogusz <qboosh@pld-linux.org> eff01e2
- updated to 3.0.0 release - removed outdated link,ac patches - added warnings patch (adjust gcc options) - added install patch (set soname and install libraries) + rpm -Uhv --nodeps --define '_topdir /tmp/B.92el_X' --define '_specdir %{_topdir}' --define '_sourcedir %{_specdir}' --define '_rpmdir %{_topdir}/RPMS' --define '_builddir %{_topdir}/BUILD' lib7zip-3.0.0-1.src.rpm Preparing... ################################################## lib7zip ################################################## + rm -f lib7zip-3.0.0-1.src.rpm + install -m 700 -d /tmp/B.92el_X/BUILD/tmp + TMPDIR=/tmp/B.92el_X/BUILD/tmp + exec nice -n 0 rpmbuild -bp --short-circuit --nodeps --define '_topdir /tmp/B.92el_X' --define '_specdir %{_topdir}' --define '_sourcedir %{_specdir}' --define '_rpmdir %{_topdir}/RPMS' --define '_builddir %{_topdir}/BUILD' --target x86_64-pld-linux --define 'prep exit 0' /tmp/B.92el_X/lib7zip.spec Building target platforms: x86_64-pld-linux checking BuildConflict-ing packages no BuildConflicts found checking BR rpm: Building target platforms: x86_64-pld-linux no BR needed building RPM using: set -ex; : build-id: a6e125f2-75ac-49a8-8d84-da2830ecdd73; TMPDIR=/tmp/B.92el_X/BUILD/tmp exec nice -n 0 rpmbuild -bb --define '_smp_mflags -j9' --define '_make_opts -Otarget' --define '_pld_builder 1' --define '_topdir /tmp/B.92el_X' --define '_specdir %{_topdir}' --define '_sourcedir %{_specdir}' --define '_rpmdir %{_topdir}/RPMS' --define '_builddir %{_topdir}/BUILD' --target x86_64-pld-linux /tmp/B.92el_X/lib7zip.spec + : build-id: a6e125f2-75ac-49a8-8d84-da2830ecdd73 + TMPDIR=/tmp/B.92el_X/BUILD/tmp + exec nice -n 0 rpmbuild -bb --define '_smp_mflags -j9' --define '_make_opts -Otarget' --define '_pld_builder 1' --define '_topdir /tmp/B.92el_X' --define '_specdir %{_topdir}' --define '_sourcedir %{_specdir}' --define '_rpmdir %{_topdir}/RPMS' --define '_builddir %{_topdir}/BUILD' --target x86_64-pld-linux /tmp/B.92el_X/lib7zip.spec Building target platforms: x86_64-pld-linux Executing(%prep): /bin/sh -e /tmp/B.92el_X/BUILD/tmp/rpm-tmp.28638 + umask 022 + cd /tmp/B.92el_X/BUILD + cd /tmp/B.92el_X/BUILD + rm -rf lib7zip-3.0.0 + /usr/bin/gzip -dc /tmp/B.92el_X/lib7zip-3.0.0.tar.gz + /bin/tar -xf - + STATUS=0 + '[' 0 -ne 0 ']' + cd lib7zip-3.0.0 + /usr/bin/bzip2 -dc /tmp/B.92el_X/p7zip_16.02_src_all.tar.bz2 + /bin/tar -xf - + STATUS=0 + '[' 0 -ne 0 ']' + /bin/id -u + '[' 1000 '=' 0 ']' + /bin/id -u + '[' 1000 '=' 0 ']' + /bin/chmod -Rf a+rX,u+w,g-w,o-w . + echo 'Patch #0 (lib7zip-warnings.patch):' Patch #0 (lib7zip-warnings.patch): + '[' -f /tmp/B.92el_X/lib7zip-warnings.patch ']' + /bin/cat /tmp/B.92el_X/lib7zip-warnings.patch + /usr/bin/patch -s -p1 + echo 'Patch #1 (lib7zip-install.patch):' Patch #1 (lib7zip-install.patch): + '[' -f /tmp/B.92el_X/lib7zip-install.patch ']' + /bin/cat /tmp/B.92el_X/lib7zip-install.patch + /usr/bin/patch -s -p1 + exit 0 Executing(%build): /bin/sh -e /tmp/B.92el_X/BUILD/tmp/rpm-tmp.91972 TMP=/home/users/builder/tmp HOME=/home/users/builder PATH=/home/users/builder/GNUstep/Tools:/usr/local/bin:/usr/bin:/bin:/home/users/builder/bin TMPDIR=/tmp/B.92el_X/BUILD/tmp + umask 022 + cd /tmp/B.92el_X/BUILD + cd lib7zip-3.0.0 + pwd + TOPDIR=/tmp/B.92el_X/BUILD/lib7zip-3.0.0 + install -d build + cd build + CXXFLAGS='-O2 -fwrapv -pipe -Wformat -Werror=format-security -gdwarf-4 -fno-debug-types-section -fvar-tracking-assignments -g2 -Wp,-D_FORTIFY_SOURCE=2 -fstack-protector-strong --param=ssp-buffer-size=4 -fPIC -march=x86-64 -gdwarf-4 -fno-debug-types-section -fvar-tracking-assignments -g2 -Wno-error=unused-result' + CC=x86_64-pld-linux-gcc CXX=x86_64-pld-linux-g++ CPPFLAGS= /usr/bin/cmake '-DCMAKE_VERBOSE_MAKEFILE=ON' '-DCMAKE_BUILD_TYPE=PLD' '-DCMAKE_INSTALL_BINDIR:PATH=/usr/bin' '-DCMAKE_INSTALL_SBINDIR:PATH=/usr/sbin' '-DCMAKE_INSTALL_LIBEXECDIR:PATH=/usr/libexec' '-DCMAKE_INSTALL_SYSCONFDIR:PATH=/etc' '-DCMAKE_INSTALL_SHAREDSTATEDIRPATH:PATH=/var/lib' '-DCMAKE_INSTALL_LOCALSTATEDIRPATH:PATH=/var' '-DCMAKE_INSTALL_LIBDIR:PATH=/usr/lib64' '-DCMAKE_INSTALL_INCLUDEDIR:PATH=/usr/include' '-DCMAKE_INSTALL_OLDINCLUDEDIR:PATH=/usr/include' '-DCMAKE_INSTALL_DATAROOTDIR:PATH=/usr/share' '-DCMAKE_INSTALL_DATADIR:PATH=/usr/share' '-DCMAKE_INSTALL_INFODIR:PATH=/usr/share/info' '-DCMAKE_INSTALL_LOCALEDIR:PATH=/usr/share/locale' '-DCMAKE_INSTALL_MANDIR:PATH=/usr/share/man' '-DCMAKE_INSTALL_DOCDIR:PATH=/usr/share/doc' '-DCMAKE_INSTALL_PREFIX:PATH=/usr' '-DSYSCONF_INSTALL_DIR:PATH=/etc' '-DCMAKE_CXX_FLAGS_PLD=-O2 -fwrapv -pipe -Wformat -Werror=format-security -gdwarf-4 -fno-debug-types-section -fvar-tracking-assignments -g2 -Wp,-D_FORTIFY_SOURCE=2 -fstack-protector-strong --param=ssp-buffer-size=4 -fPIC -march=x86-64 -gdwarf-4 -fno-debug-types-section -fvar-tracking-assignments -g2 -Wno-error=unused-result' '-DCMAKE_C_FLAGS_PLD=-O2 -fwrapv -pipe -Wformat -Werror=format-security -gdwarf-4 -fno-debug-types-section -fvar-tracking-assignments -g2 -Wp,-D_FORTIFY_SOURCE=2 -fstack-protector-strong --param=ssp-buffer-size=4 -fPIC -march=x86-64 -gdwarf-4 -fno-debug-types-section -fvar-tracking-assignments -g2 -DNDEBUG -DQT_NO_DEBUG' '-DCMAKE_Fortran_FLAGS_PLD=-O2 -fwrapv -pipe -Wformat -Werror=format-security -gdwarf-4 -fno-debug-types-section -fvar-tracking-assignments -g2 -Wp,-D_FORTIFY_SOURCE=2 -fstack-protector-strong --param=ssp-buffer-size=4 -fPIC -march=x86-64 -gdwarf-4 -fno-debug-types-section -fvar-tracking-assignments -g2 -DNDEBUG -DQT_NO_DEBUG' '-DCMAKE_EXE_LINKER_FLAGS_PLD=-Wl,--as-needed -Wl,--no-copy-dt-needed-entries -Wl,-z,relro -Wl,-z,combreloc ' '-DCMAKE_SHARED_LINKER_FLAGS_PLD=-Wl,--as-needed -Wl,--no-copy-dt-needed-entries -Wl,-z,relro -Wl,-z,combreloc ' '-DCMAKE_MODULE_LINKER_FLAGS_PLD=-Wl,--as-needed -Wl,--no-copy-dt-needed-entries -Wl,-z,relro -Wl,-z,combreloc ' '-DLIB_SUFFIX=64' '-DBUILD_SHARED_LIBS:BOOL=ON' .. '-DBUILD_SHARED_LIB=ON' '-DP7ZIP_SOURCE_DIR=/tmp/B.92el_X/BUILD/lib7zip-3.0.0/p7zip_16.02' -- The C compiler identification is GNU 8.2.0 -- The CXX compiler identification is GNU 8.2.0 -- Check for working C compiler: /usr/bin/x86_64-pld-linux-gcc -- Check for working C compiler: /usr/bin/x86_64-pld-linux-gcc -- works -- Detecting C compiler ABI info -- Detecting C compiler ABI info - done -- Detecting C compile features -- Detecting C compile features - done -- Check for working CXX compiler: /usr/bin/x86_64-pld-linux-g++ -- Check for working CXX compiler: /usr/bin/x86_64-pld-linux-g++ -- works -- Detecting CXX compiler ABI info -- Detecting CXX compiler ABI info - done -- Detecting CXX compile features -- Detecting CXX compile features - done generate target Test7Zip for Test7Zip.cpp generate target Test7ZipCryptFileName for Test7ZipCryptFileName.cpp generate target Test7ZipMulti for Test7ZipMulti.cpp generate target Test7ZipSignature for Test7ZipSignature.cpp generate target Test7Zip2 for Test7Zip2.cpp generate target Test7ZipDmg for Test7ZipDmg.cpp generate target Test7ZipRar5 for Test7ZipRar5.cpp -- Configuring done -- Generating done CMake Warning: Manually-specified variables were not used by the project: CMAKE_Fortran_FLAGS_PLD CMAKE_INSTALL_BINDIR CMAKE_INSTALL_DATADIR CMAKE_INSTALL_DATAROOTDIR CMAKE_INSTALL_DOCDIR CMAKE_INSTALL_INCLUDEDIR CMAKE_INSTALL_INFODIR CMAKE_INSTALL_LIBEXECDIR CMAKE_INSTALL_LOCALEDIR CMAKE_INSTALL_LOCALSTATEDIRPATH CMAKE_INSTALL_MANDIR CMAKE_INSTALL_OLDINCLUDEDIR CMAKE_INSTALL_SBINDIR CMAKE_INSTALL_SHAREDSTATEDIRPATH CMAKE_INSTALL_SYSCONFDIR LIB_SUFFIX SYSCONF_INSTALL_DIR -- Build files have been written to: /tmp/B.92el_X/BUILD/lib7zip-3.0.0/build + /usr/bin/make -Otarget -j9 /usr/bin/cmake -S/tmp/B.92el_X/BUILD/lib7zip-3.0.0 -B/tmp/B.92el_X/BUILD/lib7zip-3.0.0/build --check-build-system CMakeFiles/Makefile.cmake 0 /usr/bin/cmake -E cmake_progress_start /tmp/B.92el_X/BUILD/lib7zip-3.0.0/build/CMakeFiles /tmp/B.92el_X/BUILD/lib7zip-3.0.0/build/CMakeFiles/progress.marks /usr/bin/make -f CMakeFiles/Makefile2 all /usr/bin/make -f src/CMakeFiles/lib7zip_shared.dir/build.make src/CMakeFiles/lib7zip_shared.dir/depend /usr/bin/make -f src/CMakeFiles/lib7zip.dir/build.make src/CMakeFiles/lib7zip.dir/depend make[2]: Entering directory '/tmp/B.92el_X/BUILD/lib7zip-3.0.0/build' cd /tmp/B.92el_X/BUILD/lib7zip-3.0.0/build && /usr/bin/cmake -E cmake_depends "Unix Makefiles" /tmp/B.92el_X/BUILD/lib7zip-3.0.0 /tmp/B.92el_X/BUILD/lib7zip-3.0.0/src /tmp/B.92el_X/BUILD/lib7zip-3.0.0/build /tmp/B.92el_X/BUILD/lib7zip-3.0.0/build/src /tmp/B.92el_X/BUILD/lib7zip-3.0.0/build/src/CMakeFiles/lib7zip_shared.dir/DependInfo.cmake --color= Scanning dependencies of target lib7zip_shared make[2]: Leaving directory '/tmp/B.92el_X/BUILD/lib7zip-3.0.0/build' make[2]: Entering directory '/tmp/B.92el_X/BUILD/lib7zip-3.0.0/build' cd /tmp/B.92el_X/BUILD/lib7zip-3.0.0/build && /usr/bin/cmake -E cmake_depends "Unix Makefiles" /tmp/B.92el_X/BUILD/lib7zip-3.0.0 /tmp/B.92el_X/BUILD/lib7zip-3.0.0/src /tmp/B.92el_X/BUILD/lib7zip-3.0.0/build /tmp/B.92el_X/BUILD/lib7zip-3.0.0/build/src /tmp/B.92el_X/BUILD/lib7zip-3.0.0/build/src/CMakeFiles/lib7zip.dir/DependInfo.cmake --color= Scanning dependencies of target lib7zip make[2]: Leaving directory '/tmp/B.92el_X/BUILD/lib7zip-3.0.0/build' /usr/bin/make -f src/CMakeFiles/lib7zip_shared.dir/build.make src/CMakeFiles/lib7zip_shared.dir/build /usr/bin/make -f src/CMakeFiles/lib7zip.dir/build.make src/CMakeFiles/lib7zip.dir/build make[2]: Entering directory '/tmp/B.92el_X/BUILD/lib7zip-3.0.0/build' [ 15%] Building CXX object src/CMakeFiles/lib7zip.dir/7ZipCompressCodecsInfo.cpp.o cd /tmp/B.92el_X/BUILD/lib7zip-3.0.0/build/src && /usr/bin/x86_64-pld-linux-g++ -I/tmp/B.92el_X/BUILD/lib7zip-3.0.0/p7zip_16.02 -I/tmp/B.92el_X/BUILD/lib7zip-3.0.0/p7zip_16.02/CPP -I/tmp/B.92el_X/BUILD/lib7zip-3.0.0/p7zip_16.02/CPP/myWindows -I/tmp/B.92el_X/BUILD/lib7zip-3.0.0/p7zip_16.02/CPP/include_windows -fPIC -Wall -Wextra -Werror -Wno-unused-parameter -std=c++14 -O2 -fwrapv -pipe -Wformat -Werror=format-security -gdwarf-4 -fno-debug-types-section -fvar-tracking-assignments -g2 -Wp,-D_FORTIFY_SOURCE=2 -fstack-protector-strong --param=ssp-buffer-size=4 -fPIC -march=x86-64 -gdwarf-4 -fno-debug-types-section -fvar-tracking-assignments -g2 -Wno-error=unused-result -o CMakeFiles/lib7zip.dir/7ZipCompressCodecsInfo.cpp.o -c /tmp/B.92el_X/BUILD/lib7zip-3.0.0/src/7ZipCompressCodecsInfo.cpp make[2]: Leaving directory '/tmp/B.92el_X/BUILD/lib7zip-3.0.0/build' make[2]: Entering directory '/tmp/B.92el_X/BUILD/lib7zip-3.0.0/build' [ 8%] Building CXX object src/CMakeFiles/lib7zip_shared.dir/7ZipArchiveItem.cpp.o cd /tmp/B.92el_X/BUILD/lib7zip-3.0.0/build/src && /usr/bin/x86_64-pld-linux-g++ -Dlib7zip_shared_EXPORTS -I/tmp/B.92el_X/BUILD/lib7zip-3.0.0/p7zip_16.02 -I/tmp/B.92el_X/BUILD/lib7zip-3.0.0/p7zip_16.02/CPP -I/tmp/B.92el_X/BUILD/lib7zip-3.0.0/p7zip_16.02/CPP/myWindows -I/tmp/B.92el_X/BUILD/lib7zip-3.0.0/p7zip_16.02/CPP/include_windows -fPIC -Wall -Wextra -Werror -Wno-unused-parameter -std=c++14 -O2 -fwrapv -pipe -Wformat -Werror=format-security -gdwarf-4 -fno-debug-types-section -fvar-tracking-assignments -g2 -Wp,-D_FORTIFY_SOURCE=2 -fstack-protector-strong --param=ssp-buffer-size=4 -fPIC -march=x86-64 -gdwarf-4 -fno-debug-types-section -fvar-tracking-assignments -g2 -Wno-error=unused-result -fPIC -o CMakeFiles/lib7zip_shared.dir/7ZipArchiveItem.cpp.o -c /tmp/B.92el_X/BUILD/lib7zip-3.0.0/src/7ZipArchiveItem.cpp make[2]: Leaving directory '/tmp/B.92el_X/BUILD/lib7zip-3.0.0/build' make[2]: Entering directory '/tmp/B.92el_X/BUILD/lib7zip-3.0.0/build' [ 10%] Building CXX object src/CMakeFiles/lib7zip_shared.dir/7ZipInStreamWrapper.cpp.o cd /tmp/B.92el_X/BUILD/lib7zip-3.0.0/build/src && /usr/bin/x86_64-pld-linux-g++ -Dlib7zip_shared_EXPORTS -I/tmp/B.92el_X/BUILD/lib7zip-3.0.0/p7zip_16.02 -I/tmp/B.92el_X/BUILD/lib7zip-3.0.0/p7zip_16.02/CPP -I/tmp/B.92el_X/BUILD/lib7zip-3.0.0/p7zip_16.02/CPP/myWindows -I/tmp/B.92el_X/BUILD/lib7zip-3.0.0/p7zip_16.02/CPP/include_windows -fPIC -Wall -Wextra -Werror -Wno-unused-parameter -std=c++14 -O2 -fwrapv -pipe -Wformat -Werror=format-security -gdwarf-4 -fno-debug-types-section -fvar-tracking-assignments -g2 -Wp,-D_FORTIFY_SOURCE=2 -fstack-protector-strong --param=ssp-buffer-size=4 -fPIC -march=x86-64 -gdwarf-4 -fno-debug-types-section -fvar-tracking-assignments -g2 -Wno-error=unused-result -fPIC -o CMakeFiles/lib7zip_shared.dir/7ZipInStreamWrapper.cpp.o -c /tmp/B.92el_X/BUILD/lib7zip-3.0.0/src/7ZipInStreamWrapper.cpp make[2]: Leaving directory '/tmp/B.92el_X/BUILD/lib7zip-3.0.0/build' make[2]: Entering directory '/tmp/B.92el_X/BUILD/lib7zip-3.0.0/build' [ 8%] Building CXX object src/CMakeFiles/lib7zip_shared.dir/7ZipCompressCodecsInfo.cpp.o cd /tmp/B.92el_X/BUILD/lib7zip-3.0.0/build/src && /usr/bin/x86_64-pld-linux-g++ -Dlib7zip_shared_EXPORTS -I/tmp/B.92el_X/BUILD/lib7zip-3.0.0/p7zip_16.02 -I/tmp/B.92el_X/BUILD/lib7zip-3.0.0/p7zip_16.02/CPP -I/tmp/B.92el_X/BUILD/lib7zip-3.0.0/p7zip_16.02/CPP/myWindows -I/tmp/B.92el_X/BUILD/lib7zip-3.0.0/p7zip_16.02/CPP/include_windows -fPIC -Wall -Wextra -Werror -Wno-unused-parameter -std=c++14 -O2 -fwrapv -pipe -Wformat -Werror=format-security -gdwarf-4 -fno-debug-types-section -fvar-tracking-assignments -g2 -Wp,-D_FORTIFY_SOURCE=2 -fstack-protector-strong --param=ssp-buffer-size=4 -fPIC -march=x86-64 -gdwarf-4 -fno-debug-types-section -fvar-tracking-assignments -g2 -Wno-error=unused-result -fPIC -o CMakeFiles/lib7zip_shared.dir/7ZipCompressCodecsInfo.cpp.o -c /tmp/B.92el_X/BUILD/lib7zip-3.0.0/src/7ZipCompressCodecsInfo.cpp make[2]: Leaving directory '/tmp/B.92el_X/BUILD/lib7zip-3.0.0/build' make[2]: Entering directory '/tmp/B.92el_X/BUILD/lib7zip-3.0.0/build' [ 14%] Building CXX object src/CMakeFiles/lib7zip.dir/OSFunctions_UnixLike.cpp.o cd /tmp/B.92el_X/BUILD/lib7zip-3.0.0/build/src && /usr/bin/x86_64-pld-linux-g++ -I/tmp/B.92el_X/BUILD/lib7zip-3.0.0/p7zip_16.02 -I/tmp/B.92el_X/BUILD/lib7zip-3.0.0/p7zip_16.02/CPP -I/tmp/B.92el_X/BUILD/lib7zip-3.0.0/p7zip_16.02/CPP/myWindows -I/tmp/B.92el_X/BUILD/lib7zip-3.0.0/p7zip_16.02/CPP/include_windows -fPIC -Wall -Wextra -Werror -Wno-unused-parameter -std=c++14 -O2 -fwrapv -pipe -Wformat -Werror=format-security -gdwarf-4 -fno-debug-types-section -fvar-tracking-assignments -g2 -Wp,-D_FORTIFY_SOURCE=2 -fstack-protector-strong --param=ssp-buffer-size=4 -fPIC -march=x86-64 -gdwarf-4 -fno-debug-types-section -fvar-tracking-assignments -g2 -Wno-error=unused-result -o CMakeFiles/lib7zip.dir/OSFunctions_UnixLike.cpp.o -c /tmp/B.92el_X/BUILD/lib7zip-3.0.0/src/OSFunctions_UnixLike.cpp /tmp/B.92el_X/BUILD/lib7zip-3.0.0/src/OSFunctions_UnixLike.cpp: In function 'int myselect(const dirent*)': /tmp/B.92el_X/BUILD/lib7zip-3.0.0/src/OSFunctions_UnixLike.cpp:125:16: warning: ignoring return value of 'int chdir(const char*)', declared with attribute warn_unused_result [-Wunused-result] (void)chdir( szEntryName ); ~~~~~^~~~~~~~~~~~~~~ /tmp/B.92el_X/BUILD/lib7zip-3.0.0/src/OSFunctions_UnixLike.cpp:131:16: warning: ignoring return value of 'int chdir(const char*)', declared with attribute warn_unused_result [-Wunused-result] (void)chdir( ".." ); ~~~~~^~~~~~~~ make[2]: Leaving directory '/tmp/B.92el_X/BUILD/lib7zip-3.0.0/build' make[2]: Entering directory '/tmp/B.92el_X/BUILD/lib7zip-3.0.0/build' [ 22%] Building CXX object src/CMakeFiles/lib7zip_shared.dir/OSFunctions_Win32.cpp.o cd /tmp/B.92el_X/BUILD/lib7zip-3.0.0/build/src && /usr/bin/x86_64-pld-linux-g++ -Dlib7zip_shared_EXPORTS -I/tmp/B.92el_X/BUILD/lib7zip-3.0.0/p7zip_16.02 -I/tmp/B.92el_X/BUILD/lib7zip-3.0.0/p7zip_16.02/CPP -I/tmp/B.92el_X/BUILD/lib7zip-3.0.0/p7zip_16.02/CPP/myWindows -I/tmp/B.92el_X/BUILD/lib7zip-3.0.0/p7zip_16.02/CPP/include_windows -fPIC -Wall -Wextra -Werror -Wno-unused-parameter -std=c++14 -O2 -fwrapv -pipe -Wformat -Werror=format-security -gdwarf-4 -fno-debug-types-section -fvar-tracking-assignments -g2 -Wp,-D_FORTIFY_SOURCE=2 -fstack-protector-strong --param=ssp-buffer-size=4 -fPIC -march=x86-64 -gdwarf-4 -fno-debug-types-section -fvar-tracking-assignments -g2 -Wno-error=unused-result -fPIC -o CMakeFiles/lib7zip_shared.dir/OSFunctions_Win32.cpp.o -c /tmp/B.92el_X/BUILD/lib7zip-3.0.0/src/OSFunctions_Win32.cpp make[2]: Leaving directory '/tmp/B.92el_X/BUILD/lib7zip-3.0.0/build' make[2]: Entering directory '/tmp/B.92el_X/BUILD/lib7zip-3.0.0/build' [ 8%] Building CXX object src/CMakeFiles/lib7zip_shared.dir/OSFunctions_UnixLike.cpp.o cd /tmp/B.92el_X/BUILD/lib7zip-3.0.0/build/src && /usr/bin/x86_64-pld-linux-g++ -Dlib7zip_shared_EXPORTS -I/tmp/B.92el_X/BUILD/lib7zip-3.0.0/p7zip_16.02 -I/tmp/B.92el_X/BUILD/lib7zip-3.0.0/p7zip_16.02/CPP -I/tmp/B.92el_X/BUILD/lib7zip-3.0.0/p7zip_16.02/CPP/myWindows -I/tmp/B.92el_X/BUILD/lib7zip-3.0.0/p7zip_16.02/CPP/include_windows -fPIC -Wall -Wextra -Werror -Wno-unused-parameter -std=c++14 -O2 -fwrapv -pipe -Wformat -Werror=format-security -gdwarf-4 -fno-debug-types-section -fvar-tracking-assignments -g2 -Wp,-D_FORTIFY_SOURCE=2 -fstack-protector-strong --param=ssp-buffer-size=4 -fPIC -march=x86-64 -gdwarf-4 -fno-debug-types-section -fvar-tracking-assignments -g2 -Wno-error=unused-result -fPIC -o CMakeFiles/lib7zip_shared.dir/OSFunctions_UnixLike.cpp.o -c /tmp/B.92el_X/BUILD/lib7zip-3.0.0/src/OSFunctions_UnixLike.cpp /tmp/B.92el_X/BUILD/lib7zip-3.0.0/src/OSFunctions_UnixLike.cpp: In function 'int myselect(const dirent*)': /tmp/B.92el_X/BUILD/lib7zip-3.0.0/src/OSFunctions_UnixLike.cpp:125:16: warning: ignoring return value of 'int chdir(const char*)', declared with attribute warn_unused_result [-Wunused-result] (void)chdir( szEntryName ); ~~~~~^~~~~~~~~~~~~~~ /tmp/B.92el_X/BUILD/lib7zip-3.0.0/src/OSFunctions_UnixLike.cpp:131:16: warning: ignoring return value of 'int chdir(const char*)', declared with attribute warn_unused_result [-Wunused-result] (void)chdir( ".." ); ~~~~~^~~~~~~~ make[2]: Leaving directory '/tmp/B.92el_X/BUILD/lib7zip-3.0.0/build' make[2]: Entering directory '/tmp/B.92el_X/BUILD/lib7zip-3.0.0/build' [ 8%] Building CXX object src/CMakeFiles/lib7zip.dir/7ZipArchive.cpp.o cd /tmp/B.92el_X/BUILD/lib7zip-3.0.0/build/src && /usr/bin/x86_64-pld-linux-g++ -I/tmp/B.92el_X/BUILD/lib7zip-3.0.0/p7zip_16.02 -I/tmp/B.92el_X/BUILD/lib7zip-3.0.0/p7zip_16.02/CPP -I/tmp/B.92el_X/BUILD/lib7zip-3.0.0/p7zip_16.02/CPP/myWindows -I/tmp/B.92el_X/BUILD/lib7zip-3.0.0/p7zip_16.02/CPP/include_windows -fPIC -Wall -Wextra -Werror -Wno-unused-parameter -std=c++14 -O2 -fwrapv -pipe -Wformat -Werror=format-security -gdwarf-4 -fno-debug-types-section -fvar-tracking-assignments -g2 -Wp,-D_FORTIFY_SOURCE=2 -fstack-protector-strong --param=ssp-buffer-size=4 -fPIC -march=x86-64 -gdwarf-4 -fno-debug-types-section -fvar-tracking-assignments -g2 -Wno-error=unused-result -o CMakeFiles/lib7zip.dir/7ZipArchive.cpp.o -c /tmp/B.92el_X/BUILD/lib7zip-3.0.0/src/7ZipArchive.cpp make[2]: Leaving directory '/tmp/B.92el_X/BUILD/lib7zip-3.0.0/build' make[2]: Entering directory '/tmp/B.92el_X/BUILD/lib7zip-3.0.0/build' [ 1%] Building CXX object src/CMakeFiles/lib7zip_shared.dir/7ZipArchive.cpp.o cd /tmp/B.92el_X/BUILD/lib7zip-3.0.0/build/src && /usr/bin/x86_64-pld-linux-g++ -Dlib7zip_shared_EXPORTS -I/tmp/B.92el_X/BUILD/lib7zip-3.0.0/p7zip_16.02 -I/tmp/B.92el_X/BUILD/lib7zip-3.0.0/p7zip_16.02/CPP -I/tmp/B.92el_X/BUILD/lib7zip-3.0.0/p7zip_16.02/CPP/myWindows -I/tmp/B.92el_X/BUILD/lib7zip-3.0.0/p7zip_16.02/CPP/include_windows -fPIC -Wall -Wextra -Werror -Wno-unused-parameter -std=c++14 -O2 -fwrapv -pipe -Wformat -Werror=format-security -gdwarf-4 -fno-debug-types-section -fvar-tracking-assignments -g2 -Wp,-D_FORTIFY_SOURCE=2 -fstack-protector-strong --param=ssp-buffer-size=4 -fPIC -march=x86-64 -gdwarf-4 -fno-debug-types-section -fvar-tracking-assignments -g2 -Wno-error=unused-result -fPIC -o CMakeFiles/lib7zip_shared.dir/7ZipArchive.cpp.o -c /tmp/B.92el_X/BUILD/lib7zip-3.0.0/src/7ZipArchive.cpp make[2]: Leaving directory '/tmp/B.92el_X/BUILD/lib7zip-3.0.0/build' make[2]: Entering directory '/tmp/B.92el_X/BUILD/lib7zip-3.0.0/build' [ 14%] Building CXX object src/CMakeFiles/lib7zip_shared.dir/HelperFuncs.cpp.o cd /tmp/B.92el_X/BUILD/lib7zip-3.0.0/build/src && /usr/bin/x86_64-pld-linux-g++ -Dlib7zip_shared_EXPORTS -I/tmp/B.92el_X/BUILD/lib7zip-3.0.0/p7zip_16.02 -I/tmp/B.92el_X/BUILD/lib7zip-3.0.0/p7zip_16.02/CPP -I/tmp/B.92el_X/BUILD/lib7zip-3.0.0/p7zip_16.02/CPP/myWindows -I/tmp/B.92el_X/BUILD/lib7zip-3.0.0/p7zip_16.02/CPP/include_windows -fPIC -Wall -Wextra -Werror -Wno-unused-parameter -std=c++14 -O2 -fwrapv -pipe -Wformat -Werror=format-security -gdwarf-4 -fno-debug-types-section -fvar-tracking-assignments -g2 -Wp,-D_FORTIFY_SOURCE=2 -fstack-protector-strong --param=ssp-buffer-size=4 -fPIC -march=x86-64 -gdwarf-4 -fno-debug-types-section -fvar-tracking-assignments -g2 -Wno-error=unused-result -fPIC -o CMakeFiles/lib7zip_shared.dir/HelperFuncs.cpp.o -c /tmp/B.92el_X/BUILD/lib7zip-3.0.0/src/HelperFuncs.cpp make[2]: Leaving directory '/tmp/B.92el_X/BUILD/lib7zip-3.0.0/build' make[2]: Entering directory '/tmp/B.92el_X/BUILD/lib7zip-3.0.0/build' [ 17%] Building CXX object src/CMakeFiles/lib7zip.dir/7ZipArchiveItem.cpp.o cd /tmp/B.92el_X/BUILD/lib7zip-3.0.0/build/src && /usr/bin/x86_64-pld-linux-g++ -I/tmp/B.92el_X/BUILD/lib7zip-3.0.0/p7zip_16.02 -I/tmp/B.92el_X/BUILD/lib7zip-3.0.0/p7zip_16.02/CPP -I/tmp/B.92el_X/BUILD/lib7zip-3.0.0/p7zip_16.02/CPP/myWindows -I/tmp/B.92el_X/BUILD/lib7zip-3.0.0/p7zip_16.02/CPP/include_windows -fPIC -Wall -Wextra -Werror -Wno-unused-parameter -std=c++14 -O2 -fwrapv -pipe -Wformat -Werror=format-security -gdwarf-4 -fno-debug-types-section -fvar-tracking-assignments -g2 -Wp,-D_FORTIFY_SOURCE=2 -fstack-protector-strong --param=ssp-buffer-size=4 -fPIC -march=x86-64 -gdwarf-4 -fno-debug-types-section -fvar-tracking-assignments -g2 -Wno-error=unused-result -o CMakeFiles/lib7zip.dir/7ZipArchiveItem.cpp.o -c /tmp/B.92el_X/BUILD/lib7zip-3.0.0/src/7ZipArchiveItem.cpp make[2]: Leaving directory '/tmp/B.92el_X/BUILD/lib7zip-3.0.0/build' make[2]: Entering directory '/tmp/B.92el_X/BUILD/lib7zip-3.0.0/build' [ 24%] Building CXX object src/CMakeFiles/lib7zip_shared.dir/7ZipObjectPtrArray.cpp.o cd /tmp/B.92el_X/BUILD/lib7zip-3.0.0/build/src && /usr/bin/x86_64-pld-linux-g++ -Dlib7zip_shared_EXPORTS -I/tmp/B.92el_X/BUILD/lib7zip-3.0.0/p7zip_16.02 -I/tmp/B.92el_X/BUILD/lib7zip-3.0.0/p7zip_16.02/CPP -I/tmp/B.92el_X/BUILD/lib7zip-3.0.0/p7zip_16.02/CPP/myWindows -I/tmp/B.92el_X/BUILD/lib7zip-3.0.0/p7zip_16.02/CPP/include_windows -fPIC -Wall -Wextra -Werror -Wno-unused-parameter -std=c++14 -O2 -fwrapv -pipe -Wformat -Werror=format-security -gdwarf-4 -fno-debug-types-section -fvar-tracking-assignments -g2 -Wp,-D_FORTIFY_SOURCE=2 -fstack-protector-strong --param=ssp-buffer-size=4 -fPIC -march=x86-64 -gdwarf-4 -fno-debug-types-section -fvar-tracking-assignments -g2 -Wno-error=unused-result -fPIC -o CMakeFiles/lib7zip_shared.dir/7ZipObjectPtrArray.cpp.o -c /tmp/B.92el_X/BUILD/lib7zip-3.0.0/src/7ZipObjectPtrArray.cpp make[2]: Leaving directory '/tmp/B.92el_X/BUILD/lib7zip-3.0.0/build' make[2]: Entering directory '/tmp/B.92el_X/BUILD/lib7zip-3.0.0/build' [ 19%] Building CXX object src/CMakeFiles/lib7zip_shared.dir/7ZipArchiveOpenCallback.cpp.o cd /tmp/B.92el_X/BUILD/lib7zip-3.0.0/build/src && /usr/bin/x86_64-pld-linux-g++ -Dlib7zip_shared_EXPORTS -I/tmp/B.92el_X/BUILD/lib7zip-3.0.0/p7zip_16.02 -I/tmp/B.92el_X/BUILD/lib7zip-3.0.0/p7zip_16.02/CPP -I/tmp/B.92el_X/BUILD/lib7zip-3.0.0/p7zip_16.02/CPP/myWindows -I/tmp/B.92el_X/BUILD/lib7zip-3.0.0/p7zip_16.02/CPP/include_windows -fPIC -Wall -Wextra -Werror -Wno-unused-parameter -std=c++14 -O2 -fwrapv -pipe -Wformat -Werror=format-security -gdwarf-4 -fno-debug-types-section -fvar-tracking-assignments -g2 -Wp,-D_FORTIFY_SOURCE=2 -fstack-protector-strong --param=ssp-buffer-size=4 -fPIC -march=x86-64 -gdwarf-4 -fno-debug-types-section -fvar-tracking-assignments -g2 -Wno-error=unused-result -fPIC -o CMakeFiles/lib7zip_shared.dir/7ZipArchiveOpenCallback.cpp.o -c /tmp/B.92el_X/BUILD/lib7zip-3.0.0/src/7ZipArchiveOpenCallback.cpp make[2]: Leaving directory '/tmp/B.92el_X/BUILD/lib7zip-3.0.0/build' make[2]: Entering directory '/tmp/B.92el_X/BUILD/lib7zip-3.0.0/build' [ 36%] Building CXX object src/CMakeFiles/lib7zip_shared.dir/OSFunctions_OS2.cpp.o cd /tmp/B.92el_X/BUILD/lib7zip-3.0.0/build/src && /usr/bin/x86_64-pld-linux-g++ -Dlib7zip_shared_EXPORTS -I/tmp/B.92el_X/BUILD/lib7zip-3.0.0/p7zip_16.02 -I/tmp/B.92el_X/BUILD/lib7zip-3.0.0/p7zip_16.02/CPP -I/tmp/B.92el_X/BUILD/lib7zip-3.0.0/p7zip_16.02/CPP/myWindows -I/tmp/B.92el_X/BUILD/lib7zip-3.0.0/p7zip_16.02/CPP/include_windows -fPIC -Wall -Wextra -Werror -Wno-unused-parameter -std=c++14 -O2 -fwrapv -pipe -Wformat -Werror=format-security -gdwarf-4 -fno-debug-types-section -fvar-tracking-assignments -g2 -Wp,-D_FORTIFY_SOURCE=2 -fstack-protector-strong --param=ssp-buffer-size=4 -fPIC -march=x86-64 -gdwarf-4 -fno-debug-types-section -fvar-tracking-assignments -g2 -Wno-error=unused-result -fPIC -o CMakeFiles/lib7zip_shared.dir/OSFunctions_OS2.cpp.o -c /tmp/B.92el_X/BUILD/lib7zip-3.0.0/src/OSFunctions_OS2.cpp make[2]: Leaving directory '/tmp/B.92el_X/BUILD/lib7zip-3.0.0/build' make[2]: Entering directory '/tmp/B.92el_X/BUILD/lib7zip-3.0.0/build' [ 21%] Building CXX object src/CMakeFiles/lib7zip_shared.dir/7ZipDllHandler.cpp.o cd /tmp/B.92el_X/BUILD/lib7zip-3.0.0/build/src && /usr/bin/x86_64-pld-linux-g++ -Dlib7zip_shared_EXPORTS -I/tmp/B.92el_X/BUILD/lib7zip-3.0.0/p7zip_16.02 -I/tmp/B.92el_X/BUILD/lib7zip-3.0.0/p7zip_16.02/CPP -I/tmp/B.92el_X/BUILD/lib7zip-3.0.0/p7zip_16.02/CPP/myWindows -I/tmp/B.92el_X/BUILD/lib7zip-3.0.0/p7zip_16.02/CPP/include_windows -fPIC -Wall -Wextra -Werror -Wno-unused-parameter -std=c++14 -O2 -fwrapv -pipe -Wformat -Werror=format-security -gdwarf-4 -fno-debug-types-section -fvar-tracking-assignments -g2 -Wp,-D_FORTIFY_SOURCE=2 -fstack-protector-strong --param=ssp-buffer-size=4 -fPIC -march=x86-64 -gdwarf-4 -fno-debug-types-section -fvar-tracking-assignments -g2 -Wno-error=unused-result -fPIC -o CMakeFiles/lib7zip_shared.dir/7ZipDllHandler.cpp.o -c /tmp/B.92el_X/BUILD/lib7zip-3.0.0/src/7ZipDllHandler.cpp make[2]: Leaving directory '/tmp/B.92el_X/BUILD/lib7zip-3.0.0/build' make[2]: Entering directory '/tmp/B.92el_X/BUILD/lib7zip-3.0.0/build' [ 26%] Building CXX object src/CMakeFiles/lib7zip_shared.dir/7ZipCodecInfo.cpp.o cd /tmp/B.92el_X/BUILD/lib7zip-3.0.0/build/src && /usr/bin/x86_64-pld-linux-g++ -Dlib7zip_shared_EXPORTS -I/tmp/B.92el_X/BUILD/lib7zip-3.0.0/p7zip_16.02 -I/tmp/B.92el_X/BUILD/lib7zip-3.0.0/p7zip_16.02/CPP -I/tmp/B.92el_X/BUILD/lib7zip-3.0.0/p7zip_16.02/CPP/myWindows -I/tmp/B.92el_X/BUILD/lib7zip-3.0.0/p7zip_16.02/CPP/include_windows -fPIC -Wall -Wextra -Werror -Wno-unused-parameter -std=c++14 -O2 -fwrapv -pipe -Wformat -Werror=format-security -gdwarf-4 -fno-debug-types-section -fvar-tracking-assignments -g2 -Wp,-D_FORTIFY_SOURCE=2 -fstack-protector-strong --param=ssp-buffer-size=4 -fPIC -march=x86-64 -gdwarf-4 -fno-debug-types-section -fvar-tracking-assignments -g2 -Wno-error=unused-result -fPIC -o CMakeFiles/lib7zip_shared.dir/7ZipCodecInfo.cpp.o -c /tmp/B.92el_X/BUILD/lib7zip-3.0.0/src/7ZipCodecInfo.cpp make[2]: Leaving directory '/tmp/B.92el_X/BUILD/lib7zip-3.0.0/build' make[2]: Entering directory '/tmp/B.92el_X/BUILD/lib7zip-3.0.0/build' [ 28%] Building CXX object src/CMakeFiles/lib7zip.dir/7ZipInStreamWrapper.cpp.o cd /tmp/B.92el_X/BUILD/lib7zip-3.0.0/build/src && /usr/bin/x86_64-pld-linux-g++ -I/tmp/B.92el_X/BUILD/lib7zip-3.0.0/p7zip_16.02 -I/tmp/B.92el_X/BUILD/lib7zip-3.0.0/p7zip_16.02/CPP -I/tmp/B.92el_X/BUILD/lib7zip-3.0.0/p7zip_16.02/CPP/myWindows -I/tmp/B.92el_X/BUILD/lib7zip-3.0.0/p7zip_16.02/CPP/include_windows -fPIC -Wall -Wextra -Werror -Wno-unused-parameter -std=c++14 -O2 -fwrapv -pipe -Wformat -Werror=format-security -gdwarf-4 -fno-debug-types-section -fvar-tracking-assignments -g2 -Wp,-D_FORTIFY_SOURCE=2 -fstack-protector-strong --param=ssp-buffer-size=4 -fPIC -march=x86-64 -gdwarf-4 -fno-debug-types-section -fvar-tracking-assignments -g2 -Wno-error=unused-result -o CMakeFiles/lib7zip.dir/7ZipInStreamWrapper.cpp.o -c /tmp/B.92el_X/BUILD/lib7zip-3.0.0/src/7ZipInStreamWrapper.cpp make[2]: Leaving directory '/tmp/B.92el_X/BUILD/lib7zip-3.0.0/build' make[2]: Entering directory '/tmp/B.92el_X/BUILD/lib7zip-3.0.0/build' [ 40%] Building CXX object src/CMakeFiles/lib7zip_shared.dir/__/p7zip_16.02/CPP/Common/MyWindows.cpp.o cd /tmp/B.92el_X/BUILD/lib7zip-3.0.0/build/src && /usr/bin/x86_64-pld-linux-g++ -Dlib7zip_shared_EXPORTS -I/tmp/B.92el_X/BUILD/lib7zip-3.0.0/p7zip_16.02 -I/tmp/B.92el_X/BUILD/lib7zip-3.0.0/p7zip_16.02/CPP -I/tmp/B.92el_X/BUILD/lib7zip-3.0.0/p7zip_16.02/CPP/myWindows -I/tmp/B.92el_X/BUILD/lib7zip-3.0.0/p7zip_16.02/CPP/include_windows -fPIC -Wall -Wextra -Werror -Wno-unused-parameter -std=c++14 -O2 -fwrapv -pipe -Wformat -Werror=format-security -gdwarf-4 -fno-debug-types-section -fvar-tracking-assignments -g2 -Wp,-D_FORTIFY_SOURCE=2 -fstack-protector-strong --param=ssp-buffer-size=4 -fPIC -march=x86-64 -gdwarf-4 -fno-debug-types-section -fvar-tracking-assignments -g2 -Wno-error=unused-result -fPIC -o CMakeFiles/lib7zip_shared.dir/__/p7zip_16.02/CPP/Common/MyWindows.cpp.o -c /tmp/B.92el_X/BUILD/lib7zip-3.0.0/p7zip_16.02/CPP/Common/MyWindows.cpp make[2]: Leaving directory '/tmp/B.92el_X/BUILD/lib7zip-3.0.0/build' make[2]: Entering directory '/tmp/B.92el_X/BUILD/lib7zip-3.0.0/build' [ 45%] Building CXX object src/CMakeFiles/lib7zip.dir/OSFunctions_Win32.cpp.o cd /tmp/B.92el_X/BUILD/lib7zip-3.0.0/build/src && /usr/bin/x86_64-pld-linux-g++ -I/tmp/B.92el_X/BUILD/lib7zip-3.0.0/p7zip_16.02 -I/tmp/B.92el_X/BUILD/lib7zip-3.0.0/p7zip_16.02/CPP -I/tmp/B.92el_X/BUILD/lib7zip-3.0.0/p7zip_16.02/CPP/myWindows -I/tmp/B.92el_X/BUILD/lib7zip-3.0.0/p7zip_16.02/CPP/include_windows -fPIC -Wall -Wextra -Werror -Wno-unused-parameter -std=c++14 -O2 -fwrapv -pipe -Wformat -Werror=format-security -gdwarf-4 -fno-debug-types-section -fvar-tracking-assignments -g2 -Wp,-D_FORTIFY_SOURCE=2 -fstack-protector-strong --param=ssp-buffer-size=4 -fPIC -march=x86-64 -gdwarf-4 -fno-debug-types-section -fvar-tracking-assignments -g2 -Wno-error=unused-result -o CMakeFiles/lib7zip.dir/OSFunctions_Win32.cpp.o -c /tmp/B.92el_X/BUILD/lib7zip-3.0.0/src/OSFunctions_Win32.cpp make[2]: Leaving directory '/tmp/B.92el_X/BUILD/lib7zip-3.0.0/build' make[2]: Entering directory '/tmp/B.92el_X/BUILD/lib7zip-3.0.0/build' [ 42%] Building CXX object src/CMakeFiles/lib7zip_shared.dir/__/p7zip_16.02/CPP/Windows/PropVariant.cpp.o cd /tmp/B.92el_X/BUILD/lib7zip-3.0.0/build/src && /usr/bin/x86_64-pld-linux-g++ -Dlib7zip_shared_EXPORTS -I/tmp/B.92el_X/BUILD/lib7zip-3.0.0/p7zip_16.02 -I/tmp/B.92el_X/BUILD/lib7zip-3.0.0/p7zip_16.02/CPP -I/tmp/B.92el_X/BUILD/lib7zip-3.0.0/p7zip_16.02/CPP/myWindows -I/tmp/B.92el_X/BUILD/lib7zip-3.0.0/p7zip_16.02/CPP/include_windows -fPIC -Wall -Wextra -Werror -Wno-unused-parameter -std=c++14 -O2 -fwrapv -pipe -Wformat -Werror=format-security -gdwarf-4 -fno-debug-types-section -fvar-tracking-assignments -g2 -Wp,-D_FORTIFY_SOURCE=2 -fstack-protector-strong --param=ssp-buffer-size=4 -fPIC -march=x86-64 -gdwarf-4 -fno-debug-types-section -fvar-tracking-assignments -g2 -Wno-error=unused-result -fPIC -o CMakeFiles/lib7zip_shared.dir/__/p7zip_16.02/CPP/Windows/PropVariant.cpp.o -c /tmp/B.92el_X/BUILD/lib7zip-3.0.0/p7zip_16.02/CPP/Windows/PropVariant.cpp /tmp/B.92el_X/BUILD/lib7zip-3.0.0/p7zip_16.02/CPP/Windows/PropVariant.cpp: In member function 'LONG NWindows::NCOM::CPropVariant::Attach(PROPVARIANT*)': /tmp/B.92el_X/BUILD/lib7zip-3.0.0/p7zip_16.02/CPP/Windows/PropVariant.cpp:281:41: error: 'void* memcpy(void*, const void*, size_t)' writing to an object of type 'class NWindows::NCOM::CPropVariant' with no trivial copy-assignment; use copy-assignment or copy-initialization instead [-Werror=class-memaccess] memcpy(this, pSrc, sizeof(PROPVARIANT)); ^ In file included from /tmp/B.92el_X/BUILD/lib7zip-3.0.0/p7zip_16.02/CPP/Windows/PropVariant.cpp:7: /tmp/B.92el_X/BUILD/lib7zip-3.0.0/p7zip_16.02/CPP/Windows/PropVariant.h:46:7: note: 'class NWindows::NCOM::CPropVariant' declared here class CPropVariant : public tagPROPVARIANT ^~~~~~~~~~~~ cc1plus: all warnings being treated as errors make[2]: *** [src/CMakeFiles/lib7zip_shared.dir/build.make:274: src/CMakeFiles/lib7zip_shared.dir/__/p7zip_16.02/CPP/Windows/PropVariant.cpp.o] Error 1 make[2]: Leaving directory '/tmp/B.92el_X/BUILD/lib7zip-3.0.0/build' make[2]: *** Waiting for unfinished jobs.... make[2]: Entering directory '/tmp/B.92el_X/BUILD/lib7zip-3.0.0/build' [ 47%] Building CXX object src/CMakeFiles/lib7zip.dir/7ZipObjectPtrArray.cpp.o cd /tmp/B.92el_X/BUILD/lib7zip-3.0.0/build/src && /usr/bin/x86_64-pld-linux-g++ -I/tmp/B.92el_X/BUILD/lib7zip-3.0.0/p7zip_16.02 -I/tmp/B.92el_X/BUILD/lib7zip-3.0.0/p7zip_16.02/CPP -I/tmp/B.92el_X/BUILD/lib7zip-3.0.0/p7zip_16.02/CPP/myWindows -I/tmp/B.92el_X/BUILD/lib7zip-3.0.0/p7zip_16.02/CPP/include_windows -fPIC -Wall -Wextra -Werror -Wno-unused-parameter -std=c++14 -O2 -fwrapv -pipe -Wformat -Werror=format-security -gdwarf-4 -fno-debug-types-section -fvar-tracking-assignments -g2 -Wp,-D_FORTIFY_SOURCE=2 -fstack-protector-strong --param=ssp-buffer-size=4 -fPIC -march=x86-64 -gdwarf-4 -fno-debug-types-section -fvar-tracking-assignments -g2 -Wno-error=unused-result -o CMakeFiles/lib7zip.dir/7ZipObjectPtrArray.cpp.o -c /tmp/B.92el_X/BUILD/lib7zip-3.0.0/src/7ZipObjectPtrArray.cpp make[2]: Leaving directory '/tmp/B.92el_X/BUILD/lib7zip-3.0.0/build' make[2]: Entering directory '/tmp/B.92el_X/BUILD/lib7zip-3.0.0/build' [ 31%] Building CXX object src/CMakeFiles/lib7zip_shared.dir/7ZipFormatInfo.cpp.o cd /tmp/B.92el_X/BUILD/lib7zip-3.0.0/build/src && /usr/bin/x86_64-pld-linux-g++ -Dlib7zip_shared_EXPORTS -I/tmp/B.92el_X/BUILD/lib7zip-3.0.0/p7zip_16.02 -I/tmp/B.92el_X/BUILD/lib7zip-3.0.0/p7zip_16.02/CPP -I/tmp/B.92el_X/BUILD/lib7zip-3.0.0/p7zip_16.02/CPP/myWindows -I/tmp/B.92el_X/BUILD/lib7zip-3.0.0/p7zip_16.02/CPP/include_windows -fPIC -Wall -Wextra -Werror -Wno-unused-parameter -std=c++14 -O2 -fwrapv -pipe -Wformat -Werror=format-security -gdwarf-4 -fno-debug-types-section -fvar-tracking-assignments -g2 -Wp,-D_FORTIFY_SOURCE=2 -fstack-protector-strong --param=ssp-buffer-size=4 -fPIC -march=x86-64 -gdwarf-4 -fno-debug-types-section -fvar-tracking-assignments -g2 -Wno-error=unused-result -fPIC -o CMakeFiles/lib7zip_shared.dir/7ZipFormatInfo.cpp.o -c /tmp/B.92el_X/BUILD/lib7zip-3.0.0/src/7ZipFormatInfo.cpp make[2]: Leaving directory '/tmp/B.92el_X/BUILD/lib7zip-3.0.0/build' make[2]: Entering directory '/tmp/B.92el_X/BUILD/lib7zip-3.0.0/build' [ 35%] Building CXX object src/CMakeFiles/lib7zip.dir/7ZipArchiveOpenCallback.cpp.o cd /tmp/B.92el_X/BUILD/lib7zip-3.0.0/build/src && /usr/bin/x86_64-pld-linux-g++ -I/tmp/B.92el_X/BUILD/lib7zip-3.0.0/p7zip_16.02 -I/tmp/B.92el_X/BUILD/lib7zip-3.0.0/p7zip_16.02/CPP -I/tmp/B.92el_X/BUILD/lib7zip-3.0.0/p7zip_16.02/CPP/myWindows -I/tmp/B.92el_X/BUILD/lib7zip-3.0.0/p7zip_16.02/CPP/include_windows -fPIC -Wall -Wextra -Werror -Wno-unused-parameter -std=c++14 -O2 -fwrapv -pipe -Wformat -Werror=format-security -gdwarf-4 -fno-debug-types-section -fvar-tracking-assignments -g2 -Wp,-D_FORTIFY_SOURCE=2 -fstack-protector-strong --param=ssp-buffer-size=4 -fPIC -march=x86-64 -gdwarf-4 -fno-debug-types-section -fvar-tracking-assignments -g2 -Wno-error=unused-result -o CMakeFiles/lib7zip.dir/7ZipArchiveOpenCallback.cpp.o -c /tmp/B.92el_X/BUILD/lib7zip-3.0.0/src/7ZipArchiveOpenCallback.cpp make[2]: Leaving directory '/tmp/B.92el_X/BUILD/lib7zip-3.0.0/build' make[2]: Entering directory '/tmp/B.92el_X/BUILD/lib7zip-3.0.0/build' [ 54%] Building CXX object src/CMakeFiles/lib7zip.dir/OSFunctions_OS2.cpp.o cd /tmp/B.92el_X/BUILD/lib7zip-3.0.0/build/src && /usr/bin/x86_64-pld-linux-g++ -I/tmp/B.92el_X/BUILD/lib7zip-3.0.0/p7zip_16.02 -I/tmp/B.92el_X/BUILD/lib7zip-3.0.0/p7zip_16.02/CPP -I/tmp/B.92el_X/BUILD/lib7zip-3.0.0/p7zip_16.02/CPP/myWindows -I/tmp/B.92el_X/BUILD/lib7zip-3.0.0/p7zip_16.02/CPP/include_windows -fPIC -Wall -Wextra -Werror -Wno-unused-parameter -std=c++14 -O2 -fwrapv -pipe -Wformat -Werror=format-security -gdwarf-4 -fno-debug-types-section -fvar-tracking-assignments -g2 -Wp,-D_FORTIFY_SOURCE=2 -fstack-protector-strong --param=ssp-buffer-size=4 -fPIC -march=x86-64 -gdwarf-4 -fno-debug-types-section -fvar-tracking-assignments -g2 -Wno-error=unused-result -o CMakeFiles/lib7zip.dir/OSFunctions_OS2.cpp.o -c /tmp/B.92el_X/BUILD/lib7zip-3.0.0/src/OSFunctions_OS2.cpp make[2]: Leaving directory '/tmp/B.92el_X/BUILD/lib7zip-3.0.0/build' make[2]: Entering directory '/tmp/B.92el_X/BUILD/lib7zip-3.0.0/build' [ 38%] Building CXX object src/CMakeFiles/lib7zip_shared.dir/7zipLibrary.cpp.o cd /tmp/B.92el_X/BUILD/lib7zip-3.0.0/build/src && /usr/bin/x86_64-pld-linux-g++ -Dlib7zip_shared_EXPORTS -I/tmp/B.92el_X/BUILD/lib7zip-3.0.0/p7zip_16.02 -I/tmp/B.92el_X/BUILD/lib7zip-3.0.0/p7zip_16.02/CPP -I/tmp/B.92el_X/BUILD/lib7zip-3.0.0/p7zip_16.02/CPP/myWindows -I/tmp/B.92el_X/BUILD/lib7zip-3.0.0/p7zip_16.02/CPP/include_windows -fPIC -Wall -Wextra -Werror -Wno-unused-parameter -std=c++14 -O2 -fwrapv -pipe -Wformat -Werror=format-security -gdwarf-4 -fno-debug-types-section -fvar-tracking-assignments -g2 -Wp,-D_FORTIFY_SOURCE=2 -fstack-protector-strong --param=ssp-buffer-size=4 -fPIC -march=x86-64 -gdwarf-4 -fno-debug-types-section -fvar-tracking-assignments -g2 -Wno-error=unused-result -fPIC -o CMakeFiles/lib7zip_shared.dir/7zipLibrary.cpp.o -c /tmp/B.92el_X/BUILD/lib7zip-3.0.0/src/7zipLibrary.cpp make[2]: Leaving directory '/tmp/B.92el_X/BUILD/lib7zip-3.0.0/build' make[2]: Entering directory '/tmp/B.92el_X/BUILD/lib7zip-3.0.0/build' [ 43%] Building CXX object src/CMakeFiles/lib7zip.dir/7ZipDllHandler.cpp.o cd /tmp/B.92el_X/BUILD/lib7zip-3.0.0/build/src && /usr/bin/x86_64-pld-linux-g++ -I/tmp/B.92el_X/BUILD/lib7zip-3.0.0/p7zip_16.02 -I/tmp/B.92el_X/BUILD/lib7zip-3.0.0/p7zip_16.02/CPP -I/tmp/B.92el_X/BUILD/lib7zip-3.0.0/p7zip_16.02/CPP/myWindows -I/tmp/B.92el_X/BUILD/lib7zip-3.0.0/p7zip_16.02/CPP/include_windows -fPIC -Wall -Wextra -Werror -Wno-unused-parameter -std=c++14 -O2 -fwrapv -pipe -Wformat -Werror=format-security -gdwarf-4 -fno-debug-types-section -fvar-tracking-assignments -g2 -Wp,-D_FORTIFY_SOURCE=2 -fstack-protector-strong --param=ssp-buffer-size=4 -fPIC -march=x86-64 -gdwarf-4 -fno-debug-types-section -fvar-tracking-assignments -g2 -Wno-error=unused-result -o CMakeFiles/lib7zip.dir/7ZipDllHandler.cpp.o -c /tmp/B.92el_X/BUILD/lib7zip-3.0.0/src/7ZipDllHandler.cpp make[2]: Leaving directory '/tmp/B.92el_X/BUILD/lib7zip-3.0.0/build' make[2]: Entering directory '/tmp/B.92el_X/BUILD/lib7zip-3.0.0/build' [ 29%] Building CXX object src/CMakeFiles/lib7zip.dir/HelperFuncs.cpp.o cd /tmp/B.92el_X/BUILD/lib7zip-3.0.0/build/src && /usr/bin/x86_64-pld-linux-g++ -I/tmp/B.92el_X/BUILD/lib7zip-3.0.0/p7zip_16.02 -I/tmp/B.92el_X/BUILD/lib7zip-3.0.0/p7zip_16.02/CPP -I/tmp/B.92el_X/BUILD/lib7zip-3.0.0/p7zip_16.02/CPP/myWindows -I/tmp/B.92el_X/BUILD/lib7zip-3.0.0/p7zip_16.02/CPP/include_windows -fPIC -Wall -Wextra -Werror -Wno-unused-parameter -std=c++14 -O2 -fwrapv -pipe -Wformat -Werror=format-security -gdwarf-4 -fno-debug-types-section -fvar-tracking-assignments -g2 -Wp,-D_FORTIFY_SOURCE=2 -fstack-protector-strong --param=ssp-buffer-size=4 -fPIC -march=x86-64 -gdwarf-4 -fno-debug-types-section -fvar-tracking-assignments -g2 -Wno-error=unused-result -o CMakeFiles/lib7zip.dir/HelperFuncs.cpp.o -c /tmp/B.92el_X/BUILD/lib7zip-3.0.0/src/HelperFuncs.cpp make[2]: Leaving directory '/tmp/B.92el_X/BUILD/lib7zip-3.0.0/build' make[2]: Entering directory '/tmp/B.92el_X/BUILD/lib7zip-3.0.0/build' [ 57%] Building CXX object src/CMakeFiles/lib7zip.dir/__/p7zip_16.02/CPP/Common/MyWindows.cpp.o cd /tmp/B.92el_X/BUILD/lib7zip-3.0.0/build/src && /usr/bin/x86_64-pld-linux-g++ -I/tmp/B.92el_X/BUILD/lib7zip-3.0.0/p7zip_16.02 -I/tmp/B.92el_X/BUILD/lib7zip-3.0.0/p7zip_16.02/CPP -I/tmp/B.92el_X/BUILD/lib7zip-3.0.0/p7zip_16.02/CPP/myWindows -I/tmp/B.92el_X/BUILD/lib7zip-3.0.0/p7zip_16.02/CPP/include_windows -fPIC -Wall -Wextra -Werror -Wno-unused-parameter -std=c++14 -O2 -fwrapv -pipe -Wformat -Werror=format-security -gdwarf-4 -fno-debug-types-section -fvar-tracking-assignments -g2 -Wp,-D_FORTIFY_SOURCE=2 -fstack-protector-strong --param=ssp-buffer-size=4 -fPIC -march=x86-64 -gdwarf-4 -fno-debug-types-section -fvar-tracking-assignments -g2 -Wno-error=unused-result -o CMakeFiles/lib7zip.dir/__/p7zip_16.02/CPP/Common/MyWindows.cpp.o -c /tmp/B.92el_X/BUILD/lib7zip-3.0.0/p7zip_16.02/CPP/Common/MyWindows.cpp make[2]: Leaving directory '/tmp/B.92el_X/BUILD/lib7zip-3.0.0/build' make[2]: Entering directory '/tmp/B.92el_X/BUILD/lib7zip-3.0.0/build' [ 49%] Building CXX object src/CMakeFiles/lib7zip.dir/7ZipCodecInfo.cpp.o cd /tmp/B.92el_X/BUILD/lib7zip-3.0.0/build/src && /usr/bin/x86_64-pld-linux-g++ -I/tmp/B.92el_X/BUILD/lib7zip-3.0.0/p7zip_16.02 -I/tmp/B.92el_X/BUILD/lib7zip-3.0.0/p7zip_16.02/CPP -I/tmp/B.92el_X/BUILD/lib7zip-3.0.0/p7zip_16.02/CPP/myWindows -I/tmp/B.92el_X/BUILD/lib7zip-3.0.0/p7zip_16.02/CPP/include_windows -fPIC -Wall -Wextra -Werror -Wno-unused-parameter -std=c++14 -O2 -fwrapv -pipe -Wformat -Werror=format-security -gdwarf-4 -fno-debug-types-section -fvar-tracking-assignments -g2 -Wp,-D_FORTIFY_SOURCE=2 -fstack-protector-strong --param=ssp-buffer-size=4 -fPIC -march=x86-64 -gdwarf-4 -fno-debug-types-section -fvar-tracking-assignments -g2 -Wno-error=unused-result -o CMakeFiles/lib7zip.dir/7ZipCodecInfo.cpp.o -c /tmp/B.92el_X/BUILD/lib7zip-3.0.0/src/7ZipCodecInfo.cpp make[2]: Leaving directory '/tmp/B.92el_X/BUILD/lib7zip-3.0.0/build' make[2]: Entering directory '/tmp/B.92el_X/BUILD/lib7zip-3.0.0/build' [ 33%] Building CXX object src/CMakeFiles/lib7zip_shared.dir/7ZipOpenArchive.cpp.o cd /tmp/B.92el_X/BUILD/lib7zip-3.0.0/build/src && /usr/bin/x86_64-pld-linux-g++ -Dlib7zip_shared_EXPORTS -I/tmp/B.92el_X/BUILD/lib7zip-3.0.0/p7zip_16.02 -I/tmp/B.92el_X/BUILD/lib7zip-3.0.0/p7zip_16.02/CPP -I/tmp/B.92el_X/BUILD/lib7zip-3.0.0/p7zip_16.02/CPP/myWindows -I/tmp/B.92el_X/BUILD/lib7zip-3.0.0/p7zip_16.02/CPP/include_windows -fPIC -Wall -Wextra -Werror -Wno-unused-parameter -std=c++14 -O2 -fwrapv -pipe -Wformat -Werror=format-security -gdwarf-4 -fno-debug-types-section -fvar-tracking-assignments -g2 -Wp,-D_FORTIFY_SOURCE=2 -fstack-protector-strong --param=ssp-buffer-size=4 -fPIC -march=x86-64 -gdwarf-4 -fno-debug-types-section -fvar-tracking-assignments -g2 -Wno-error=unused-result -fPIC -o CMakeFiles/lib7zip_shared.dir/7ZipOpenArchive.cpp.o -c /tmp/B.92el_X/BUILD/lib7zip-3.0.0/src/7ZipOpenArchive.cpp make[2]: Leaving directory '/tmp/B.92el_X/BUILD/lib7zip-3.0.0/build' make[1]: *** [CMakeFiles/Makefile2:96: src/CMakeFiles/lib7zip_shared.dir/all] Error 2 make[1]: *** Waiting for unfinished jobs.... make[2]: Entering directory '/tmp/B.92el_X/BUILD/lib7zip-3.0.0/build' [ 59%] Building CXX object src/CMakeFiles/lib7zip.dir/__/p7zip_16.02/CPP/Windows/PropVariant.cpp.o cd /tmp/B.92el_X/BUILD/lib7zip-3.0.0/build/src && /usr/bin/x86_64-pld-linux-g++ -I/tmp/B.92el_X/BUILD/lib7zip-3.0.0/p7zip_16.02 -I/tmp/B.92el_X/BUILD/lib7zip-3.0.0/p7zip_16.02/CPP -I/tmp/B.92el_X/BUILD/lib7zip-3.0.0/p7zip_16.02/CPP/myWindows -I/tmp/B.92el_X/BUILD/lib7zip-3.0.0/p7zip_16.02/CPP/include_windows -fPIC -Wall -Wextra -Werror -Wno-unused-parameter -std=c++14 -O2 -fwrapv -pipe -Wformat -Werror=format-security -gdwarf-4 -fno-debug-types-section -fvar-tracking-assignments -g2 -Wp,-D_FORTIFY_SOURCE=2 -fstack-protector-strong --param=ssp-buffer-size=4 -fPIC -march=x86-64 -gdwarf-4 -fno-debug-types-section -fvar-tracking-assignments -g2 -Wno-error=unused-result -o CMakeFiles/lib7zip.dir/__/p7zip_16.02/CPP/Windows/PropVariant.cpp.o -c /tmp/B.92el_X/BUILD/lib7zip-3.0.0/p7zip_16.02/CPP/Windows/PropVariant.cpp /tmp/B.92el_X/BUILD/lib7zip-3.0.0/p7zip_16.02/CPP/Windows/PropVariant.cpp: In member function 'LONG NWindows::NCOM::CPropVariant::Attach(PROPVARIANT*)': /tmp/B.92el_X/BUILD/lib7zip-3.0.0/p7zip_16.02/CPP/Windows/PropVariant.cpp:281:41: error: 'void* memcpy(void*, const void*, size_t)' writing to an object of type 'class NWindows::NCOM::CPropVariant' with no trivial copy-assignment; use copy-assignment or copy-initialization instead [-Werror=class-memaccess] memcpy(this, pSrc, sizeof(PROPVARIANT)); ^ In file included from /tmp/B.92el_X/BUILD/lib7zip-3.0.0/p7zip_16.02/CPP/Windows/PropVariant.cpp:7: /tmp/B.92el_X/BUILD/lib7zip-3.0.0/p7zip_16.02/CPP/Windows/PropVariant.h:46:7: note: 'class NWindows::NCOM::CPropVariant' declared here class CPropVariant : public tagPROPVARIANT ^~~~~~~~~~~~ cc1plus: all warnings being treated as errors make[2]: *** [src/CMakeFiles/lib7zip.dir/build.make:274: src/CMakeFiles/lib7zip.dir/__/p7zip_16.02/CPP/Windows/PropVariant.cpp.o] Error 1 make[2]: Leaving directory '/tmp/B.92el_X/BUILD/lib7zip-3.0.0/build' make[2]: *** Waiting for unfinished jobs.... make[2]: Entering directory '/tmp/B.92el_X/BUILD/lib7zip-3.0.0/build' [ 56%] Building CXX object src/CMakeFiles/lib7zip.dir/7zipLibrary.cpp.o cd /tmp/B.92el_X/BUILD/lib7zip-3.0.0/build/src && /usr/bin/x86_64-pld-linux-g++ -I/tmp/B.92el_X/BUILD/lib7zip-3.0.0/p7zip_16.02 -I/tmp/B.92el_X/BUILD/lib7zip-3.0.0/p7zip_16.02/CPP -I/tmp/B.92el_X/BUILD/lib7zip-3.0.0/p7zip_16.02/CPP/myWindows -I/tmp/B.92el_X/BUILD/lib7zip-3.0.0/p7zip_16.02/CPP/include_windows -fPIC -Wall -Wextra -Werror -Wno-unused-parameter -std=c++14 -O2 -fwrapv -pipe -Wformat -Werror=format-security -gdwarf-4 -fno-debug-types-section -fvar-tracking-assignments -g2 -Wp,-D_FORTIFY_SOURCE=2 -fstack-protector-strong --param=ssp-buffer-size=4 -fPIC -march=x86-64 -gdwarf-4 -fno-debug-types-section -fvar-tracking-assignments -g2 -Wno-error=unused-result -o CMakeFiles/lib7zip.dir/7zipLibrary.cpp.o -c /tmp/B.92el_X/BUILD/lib7zip-3.0.0/src/7zipLibrary.cpp make[2]: Leaving directory '/tmp/B.92el_X/BUILD/lib7zip-3.0.0/build' make[2]: Entering directory '/tmp/B.92el_X/BUILD/lib7zip-3.0.0/build' [ 50%] Building CXX object src/CMakeFiles/lib7zip.dir/7ZipFormatInfo.cpp.o cd /tmp/B.92el_X/BUILD/lib7zip-3.0.0/build/src && /usr/bin/x86_64-pld-linux-g++ -I/tmp/B.92el_X/BUILD/lib7zip-3.0.0/p7zip_16.02 -I/tmp/B.92el_X/BUILD/lib7zip-3.0.0/p7zip_16.02/CPP -I/tmp/B.92el_X/BUILD/lib7zip-3.0.0/p7zip_16.02/CPP/myWindows -I/tmp/B.92el_X/BUILD/lib7zip-3.0.0/p7zip_16.02/CPP/include_windows -fPIC -Wall -Wextra -Werror -Wno-unused-parameter -std=c++14 -O2 -fwrapv -pipe -Wformat -Werror=format-security -gdwarf-4 -fno-debug-types-section -fvar-tracking-assignments -g2 -Wp,-D_FORTIFY_SOURCE=2 -fstack-protector-strong --param=ssp-buffer-size=4 -fPIC -march=x86-64 -gdwarf-4 -fno-debug-types-section -fvar-tracking-assignments -g2 -Wno-error=unused-result -o CMakeFiles/lib7zip.dir/7ZipFormatInfo.cpp.o -c /tmp/B.92el_X/BUILD/lib7zip-3.0.0/src/7ZipFormatInfo.cpp make[2]: Leaving directory '/tmp/B.92el_X/BUILD/lib7zip-3.0.0/build' make[2]: Entering directory '/tmp/B.92el_X/BUILD/lib7zip-3.0.0/build' [ 52%] Building CXX object src/CMakeFiles/lib7zip.dir/7ZipOpenArchive.cpp.o cd /tmp/B.92el_X/BUILD/lib7zip-3.0.0/build/src && /usr/bin/x86_64-pld-linux-g++ -I/tmp/B.92el_X/BUILD/lib7zip-3.0.0/p7zip_16.02 -I/tmp/B.92el_X/BUILD/lib7zip-3.0.0/p7zip_16.02/CPP -I/tmp/B.92el_X/BUILD/lib7zip-3.0.0/p7zip_16.02/CPP/myWindows -I/tmp/B.92el_X/BUILD/lib7zip-3.0.0/p7zip_16.02/CPP/include_windows -fPIC -Wall -Wextra -Werror -Wno-unused-parameter -std=c++14 -O2 -fwrapv -pipe -Wformat -Werror=format-security -gdwarf-4 -fno-debug-types-section -fvar-tracking-assignments -g2 -Wp,-D_FORTIFY_SOURCE=2 -fstack-protector-strong --param=ssp-buffer-size=4 -fPIC -march=x86-64 -gdwarf-4 -fno-debug-types-section -fvar-tracking-assignments -g2 -Wno-error=unused-result -o CMakeFiles/lib7zip.dir/7ZipOpenArchive.cpp.o -c /tmp/B.92el_X/BUILD/lib7zip-3.0.0/src/7ZipOpenArchive.cpp make[2]: Leaving directory '/tmp/B.92el_X/BUILD/lib7zip-3.0.0/build' make[1]: *** [CMakeFiles/Makefile2:133: src/CMakeFiles/lib7zip.dir/all] Error 2 make: *** [Makefile:133: all] Error 2 error: Bad exit status from /tmp/B.92el_X/BUILD/tmp/rpm-tmp.91972 (%build) RPM build errors: Bad exit status from /tmp/B.92el_X/BUILD/tmp/rpm-tmp.91972 (%build) ended at: Mon Dec 31 18:13:32 2018, done in 0:00:07.049258 error: No files produced. + chmod -R u+rwX /tmp/B.92el_X/BUILD + rm -rf /tmp/B.92el_X/tmp /tmp/B.92el_X/BUILD + rm -rf /tmp/B.92el_X Begin-PLD-Builder-Info Build-Time: user:23.55s sys:2.99s real:11.18s (faults io:0 non-io:777569) End-PLD-Builder-Info
[Back to list of logs] [View rpm -qa of builder]