FailedOk

th/SRPMS[OK]
th/x32[OK]
th/i686[OK]
th/x86_64[OK]

ac/SRPMS[OK]
ac/i386[OK]
ac/i586[OK]
ac/i686[OK]
ac/alpha[OK]
ac/amd64[OK]
ac/athlon[OK]
ac/ppc[OK]
ac/sparc[OK]
ac/sparc64[OK]

Advanced Search
main()
Powered by PLD Linux
(c) 2002-2019 PLD Team
$Revision: 1.37 $
Powered by /dev/null.
Your IP: 3.85.92.139

lib7zip a6e125f2-75ac-49a8-8d84-da2830ecdd73

Status:Failed
Source URL:ftp://buildlogs.pld-linux.org/th/x86_64/FAIL/lib7zip,a6e125f2-75ac-49a8-8d84-da2830ecdd73.bz2
text/plain URL:View!
full text:View!
rpm -qa of builder:View!
Date:2018/12/31 18:13:32
Runtime:0:00:07.049258

Toc:

  • error 1
  • /tmp/B.92el_X/BUILD/lib7zip-3.0.0/p7zip_16.02/CPP/Windows/PropVariant.cpp:281:41: error: 'void* memcpy(void*, const void*, size_t)' writing to an object of type 'class NWindows::NCOM::CPropVariant' with no trivial copy-assignment; use copy-assignment or copy-initialization instead [-Werror=class-memaccess]
  • error 2
  • make[2]: *** [src/CMakeFiles/lib7zip_shared.dir/build.make:274: src/CMakeFiles/lib7zip_shared.dir/__/p7zip_16.02/CPP/Windows/PropVariant.cpp.o] Error 1
  • error 3
  • make[1]: *** [CMakeFiles/Makefile2:96: src/CMakeFiles/lib7zip_shared.dir/all] Error 2
  • error 4
  • /tmp/B.92el_X/BUILD/lib7zip-3.0.0/p7zip_16.02/CPP/Windows/PropVariant.cpp:281:41: error: 'void* memcpy(void*, const void*, size_t)' writing to an object of type 'class NWindows::NCOM::CPropVariant' with no trivial copy-assignment; use copy-assignment or copy-initialization instead [-Werror=class-memaccess]
  • error 5
  • make[2]: *** [src/CMakeFiles/lib7zip.dir/build.make:274: src/CMakeFiles/lib7zip.dir/__/p7zip_16.02/CPP/Windows/PropVariant.cpp.o] Error 1
  • error 6
  • make[1]: *** [CMakeFiles/Makefile2:133: src/CMakeFiles/lib7zip.dir/all] Error 2
  • error 7
  • error: Bad exit status from /tmp/B.92el_X/BUILD/tmp/rpm-tmp.91972 (%build)
  • error 8
  • RPM build errors:
  • error 9
  • error: No files produced.

Content:

cd /tmp/B.92el_X/BUILD/lib7zip-3.0.0/build && /usr/bin/cmake -E cmake_depends "Unix Makefiles" /tmp/B.92el_X/BUILD/lib7zip-3.0.0 /tmp/B.92el_X/BUILD/lib7zip-3.0.0/src /tmp/B.92el_X/BUILD/lib7zip-3.0.0/build /tmp/B.92el_X/BUILD/lib7zip-3.0.0/build/src /tmp/B.92el_X/BUILD/lib7zip-3.0.0/build/src/CMakeFiles/lib7zip.dir/DependInfo.cmake --color=
Scanning dependencies of target lib7zip
make[2]: Leaving directory '/tmp/B.92el_X/BUILD/lib7zip-3.0.0/build'
/usr/bin/make -f src/CMakeFiles/lib7zip_shared.dir/build.make src/CMakeFiles/lib7zip_shared.dir/build
/usr/bin/make -f src/CMakeFiles/lib7zip.dir/build.make src/CMakeFiles/lib7zip.dir/build
make[2]: Entering directory '/tmp/B.92el_X/BUILD/lib7zip-3.0.0/build'
[ 15%] Building CXX object src/CMakeFiles/lib7zip.dir/7ZipCompressCodecsInfo.cpp.o
cd /tmp/B.92el_X/BUILD/lib7zip-3.0.0/build/src && /usr/bin/x86_64-pld-linux-g++   -I/tmp/B.92el_X/BUILD/lib7zip-3.0.0/p7zip_16.02 -I/tmp/B.92el_X/BUILD/lib7zip-3.0.0/p7zip_16.02/CPP -I/tmp/B.92el_X/BUILD/lib7zip-3.0.0/p7zip_16.02/CPP/myWindows -I/tmp/B.92el_X/BUILD/lib7zip-3.0.0/p7zip_16.02/CPP/include_windows  -fPIC -Wall -Wextra -Werror -Wno-unused-parameter -std=c++14 -O2 -fwrapv -pipe -Wformat -Werror=format-security -gdwarf-4 -fno-debug-types-section -fvar-tracking-assignments -g2 -Wp,-D_FORTIFY_SOURCE=2 -fstack-protector-strong --param=ssp-buffer-size=4 -fPIC -march=x86-64 -gdwarf-4 -fno-debug-types-section -fvar-tracking-assignments -g2  -Wno-error=unused-result   -o CMakeFiles/lib7zip.dir/7ZipCompressCodecsInfo.cpp.o -c /tmp/B.92el_X/BUILD/lib7zip-3.0.0/src/7ZipCompressCodecsInfo.cpp
make[2]: Leaving directory '/tmp/B.92el_X/BUILD/lib7zip-3.0.0/build'
make[2]: Entering directory '/tmp/B.92el_X/BUILD/lib7zip-3.0.0/build'
[  8%] Building CXX object src/CMakeFiles/lib7zip_shared.dir/7ZipArchiveItem.cpp.o
cd /tmp/B.92el_X/BUILD/lib7zip-3.0.0/build/src && /usr/bin/x86_64-pld-linux-g++  -Dlib7zip_shared_EXPORTS -I/tmp/B.92el_X/BUILD/lib7zip-3.0.0/p7zip_16.02 -I/tmp/B.92el_X/BUILD/lib7zip-3.0.0/p7zip_16.02/CPP -I/tmp/B.92el_X/BUILD/lib7zip-3.0.0/p7zip_16.02/CPP/myWindows -I/tmp/B.92el_X/BUILD/lib7zip-3.0.0/p7zip_16.02/CPP/include_windows  -fPIC -Wall -Wextra -Werror -Wno-unused-parameter -std=c++14 -O2 -fwrapv -pipe -Wformat -Werror=format-security -gdwarf-4 -fno-debug-types-section -fvar-tracking-assignments -g2 -Wp,-D_FORTIFY_SOURCE=2 -fstack-protector-strong --param=ssp-buffer-size=4 -fPIC -march=x86-64 -gdwarf-4 -fno-debug-types-section -fvar-tracking-assignments -g2  -Wno-error=unused-result -fPIC   -o CMakeFiles/lib7zip_shared.dir/7ZipArchiveItem.cpp.o -c /tmp/B.92el_X/BUILD/lib7zip-3.0.0/src/7ZipArchiveItem.cpp
make[2]: Leaving directory '/tmp/B.92el_X/BUILD/lib7zip-3.0.0/build'
make[2]: Entering directory '/tmp/B.92el_X/BUILD/lib7zip-3.0.0/build'
[ 10%] Building CXX object src/CMakeFiles/lib7zip_shared.dir/7ZipInStreamWrapper.cpp.o
cd /tmp/B.92el_X/BUILD/lib7zip-3.0.0/build/src && /usr/bin/x86_64-pld-linux-g++  -Dlib7zip_shared_EXPORTS -I/tmp/B.92el_X/BUILD/lib7zip-3.0.0/p7zip_16.02 -I/tmp/B.92el_X/BUILD/lib7zip-3.0.0/p7zip_16.02/CPP -I/tmp/B.92el_X/BUILD/lib7zip-3.0.0/p7zip_16.02/CPP/myWindows -I/tmp/B.92el_X/BUILD/lib7zip-3.0.0/p7zip_16.02/CPP/include_windows  -fPIC -Wall -Wextra -Werror -Wno-unused-parameter -std=c++14 -O2 -fwrapv -pipe -Wformat -Werror=format-security -gdwarf-4 -fno-debug-types-section -fvar-tracking-assignments -g2 -Wp,-D_FORTIFY_SOURCE=2 -fstack-protector-strong --param=ssp-buffer-size=4 -fPIC -march=x86-64 -gdwarf-4 -fno-debug-types-section -fvar-tracking-assignments -g2  -Wno-error=unused-result -fPIC   -o CMakeFiles/lib7zip_shared.dir/7ZipInStreamWrapper.cpp.o -c /tmp/B.92el_X/BUILD/lib7zip-3.0.0/src/7ZipInStreamWrapper.cpp
make[2]: Leaving directory '/tmp/B.92el_X/BUILD/lib7zip-3.0.0/build'
make[2]: Entering directory '/tmp/B.92el_X/BUILD/lib7zip-3.0.0/build'
[  8%] Building CXX object src/CMakeFiles/lib7zip_shared.dir/7ZipCompressCodecsInfo.cpp.o
cd /tmp/B.92el_X/BUILD/lib7zip-3.0.0/build/src && /usr/bin/x86_64-pld-linux-g++  -Dlib7zip_shared_EXPORTS -I/tmp/B.92el_X/BUILD/lib7zip-3.0.0/p7zip_16.02 -I/tmp/B.92el_X/BUILD/lib7zip-3.0.0/p7zip_16.02/CPP -I/tmp/B.92el_X/BUILD/lib7zip-3.0.0/p7zip_16.02/CPP/myWindows -I/tmp/B.92el_X/BUILD/lib7zip-3.0.0/p7zip_16.02/CPP/include_windows  -fPIC -Wall -Wextra -Werror -Wno-unused-parameter -std=c++14 -O2 -fwrapv -pipe -Wformat -Werror=format-security -gdwarf-4 -fno-debug-types-section -fvar-tracking-assignments -g2 -Wp,-D_FORTIFY_SOURCE=2 -fstack-protector-strong --param=ssp-buffer-size=4 -fPIC -march=x86-64 -gdwarf-4 -fno-debug-types-section -fvar-tracking-assignments -g2  -Wno-error=unused-result -fPIC   -o CMakeFiles/lib7zip_shared.dir/7ZipCompressCodecsInfo.cpp.o -c /tmp/B.92el_X/BUILD/lib7zip-3.0.0/src/7ZipCompressCodecsInfo.cpp
make[2]: Leaving directory '/tmp/B.92el_X/BUILD/lib7zip-3.0.0/build'
make[2]: Entering directory '/tmp/B.92el_X/BUILD/lib7zip-3.0.0/build'
[ 14%] Building CXX object src/CMakeFiles/lib7zip.dir/OSFunctions_UnixLike.cpp.o
cd /tmp/B.92el_X/BUILD/lib7zip-3.0.0/build/src && /usr/bin/x86_64-pld-linux-g++   -I/tmp/B.92el_X/BUILD/lib7zip-3.0.0/p7zip_16.02 -I/tmp/B.92el_X/BUILD/lib7zip-3.0.0/p7zip_16.02/CPP -I/tmp/B.92el_X/BUILD/lib7zip-3.0.0/p7zip_16.02/CPP/myWindows -I/tmp/B.92el_X/BUILD/lib7zip-3.0.0/p7zip_16.02/CPP/include_windows  -fPIC -Wall -Wextra -Werror -Wno-unused-parameter -std=c++14 -O2 -fwrapv -pipe -Wformat -Werror=format-security -gdwarf-4 -fno-debug-types-section -fvar-tracking-assignments -g2 -Wp,-D_FORTIFY_SOURCE=2 -fstack-protector-strong --param=ssp-buffer-size=4 -fPIC -march=x86-64 -gdwarf-4 -fno-debug-types-section -fvar-tracking-assignments -g2  -Wno-error=unused-result   -o CMakeFiles/lib7zip.dir/OSFunctions_UnixLike.cpp.o -c /tmp/B.92el_X/BUILD/lib7zip-3.0.0/src/OSFunctions_UnixLike.cpp
/tmp/B.92el_X/BUILD/lib7zip-3.0.0/src/OSFunctions_UnixLike.cpp: In function 'int myselect(const dirent*)':
/tmp/B.92el_X/BUILD/lib7zip-3.0.0/src/OSFunctions_UnixLike.cpp:125:16: warning: ignoring return value of 'int chdir(const char*)', declared with attribute warn_unused_result [-Wunused-result]
     (void)chdir( szEntryName );
           ~~~~~^~~~~~~~~~~~~~~
/tmp/B.92el_X/BUILD/lib7zip-3.0.0/src/OSFunctions_UnixLike.cpp:131:16: warning: ignoring return value of 'int chdir(const char*)', declared with attribute warn_unused_result [-Wunused-result]
     (void)chdir( ".." );
           ~~~~~^~~~~~~~
make[2]: Leaving directory '/tmp/B.92el_X/BUILD/lib7zip-3.0.0/build'
make[2]: Entering directory '/tmp/B.92el_X/BUILD/lib7zip-3.0.0/build'
[ 22%] Building CXX object src/CMakeFiles/lib7zip_shared.dir/OSFunctions_Win32.cpp.o
cd /tmp/B.92el_X/BUILD/lib7zip-3.0.0/build/src && /usr/bin/x86_64-pld-linux-g++  -Dlib7zip_shared_EXPORTS -I/tmp/B.92el_X/BUILD/lib7zip-3.0.0/p7zip_16.02 -I/tmp/B.92el_X/BUILD/lib7zip-3.0.0/p7zip_16.02/CPP -I/tmp/B.92el_X/BUILD/lib7zip-3.0.0/p7zip_16.02/CPP/myWindows -I/tmp/B.92el_X/BUILD/lib7zip-3.0.0/p7zip_16.02/CPP/include_windows  -fPIC -Wall -Wextra -Werror -Wno-unused-parameter -std=c++14 -O2 -fwrapv -pipe -Wformat -Werror=format-security -gdwarf-4 -fno-debug-types-section -fvar-tracking-assignments -g2 -Wp,-D_FORTIFY_SOURCE=2 -fstack-protector-strong --param=ssp-buffer-size=4 -fPIC -march=x86-64 -gdwarf-4 -fno-debug-types-section -fvar-tracking-assignments -g2  -Wno-error=unused-result -fPIC   -o CMakeFiles/lib7zip_shared.dir/OSFunctions_Win32.cpp.o -c /tmp/B.92el_X/BUILD/lib7zip-3.0.0/src/OSFunctions_Win32.cpp
make[2]: Leaving directory '/tmp/B.92el_X/BUILD/lib7zip-3.0.0/build'
make[2]: Entering directory '/tmp/B.92el_X/BUILD/lib7zip-3.0.0/build'
[  8%] Building CXX object src/CMakeFiles/lib7zip_shared.dir/OSFunctions_UnixLike.cpp.o
cd /tmp/B.92el_X/BUILD/lib7zip-3.0.0/build/src && /usr/bin/x86_64-pld-linux-g++  -Dlib7zip_shared_EXPORTS -I/tmp/B.92el_X/BUILD/lib7zip-3.0.0/p7zip_16.02 -I/tmp/B.92el_X/BUILD/lib7zip-3.0.0/p7zip_16.02/CPP -I/tmp/B.92el_X/BUILD/lib7zip-3.0.0/p7zip_16.02/CPP/myWindows -I/tmp/B.92el_X/BUILD/lib7zip-3.0.0/p7zip_16.02/CPP/include_windows  -fPIC -Wall -Wextra -Werror -Wno-unused-parameter -std=c++14 -O2 -fwrapv -pipe -Wformat -Werror=format-security -gdwarf-4 -fno-debug-types-section -fvar-tracking-assignments -g2 -Wp,-D_FORTIFY_SOURCE=2 -fstack-protector-strong --param=ssp-buffer-size=4 -fPIC -march=x86-64 -gdwarf-4 -fno-debug-types-section -fvar-tracking-assignments -g2  -Wno-error=unused-result -fPIC   -o CMakeFiles/lib7zip_shared.dir/OSFunctions_UnixLike.cpp.o -c /tmp/B.92el_X/BUILD/lib7zip-3.0.0/src/OSFunctions_UnixLike.cpp
/tmp/B.92el_X/BUILD/lib7zip-3.0.0/src/OSFunctions_UnixLike.cpp: In function 'int myselect(const dirent*)':
/tmp/B.92el_X/BUILD/lib7zip-3.0.0/src/OSFunctions_UnixLike.cpp:125:16: warning: ignoring return value of 'int chdir(const char*)', declared with attribute warn_unused_result [-Wunused-result]
     (void)chdir( szEntryName );
           ~~~~~^~~~~~~~~~~~~~~
/tmp/B.92el_X/BUILD/lib7zip-3.0.0/src/OSFunctions_UnixLike.cpp:131:16: warning: ignoring return value of 'int chdir(const char*)', declared with attribute warn_unused_result [-Wunused-result]
     (void)chdir( ".." );
           ~~~~~^~~~~~~~
make[2]: Leaving directory '/tmp/B.92el_X/BUILD/lib7zip-3.0.0/build'
make[2]: Entering directory '/tmp/B.92el_X/BUILD/lib7zip-3.0.0/build'
[  8%] Building CXX object src/CMakeFiles/lib7zip.dir/7ZipArchive.cpp.o
cd /tmp/B.92el_X/BUILD/lib7zip-3.0.0/build/src && /usr/bin/x86_64-pld-linux-g++   -I/tmp/B.92el_X/BUILD/lib7zip-3.0.0/p7zip_16.02 -I/tmp/B.92el_X/BUILD/lib7zip-3.0.0/p7zip_16.02/CPP -I/tmp/B.92el_X/BUILD/lib7zip-3.0.0/p7zip_16.02/CPP/myWindows -I/tmp/B.92el_X/BUILD/lib7zip-3.0.0/p7zip_16.02/CPP/include_windows  -fPIC -Wall -Wextra -Werror -Wno-unused-parameter -std=c++14 -O2 -fwrapv -pipe -Wformat -Werror=format-security -gdwarf-4 -fno-debug-types-section -fvar-tracking-assignments -g2 -Wp,-D_FORTIFY_SOURCE=2 -fstack-protector-strong --param=ssp-buffer-size=4 -fPIC -march=x86-64 -gdwarf-4 -fno-debug-types-section -fvar-tracking-assignments -g2  -Wno-error=unused-result   -o CMakeFiles/lib7zip.dir/7ZipArchive.cpp.o -c /tmp/B.92el_X/BUILD/lib7zip-3.0.0/src/7ZipArchive.cpp
make[2]: Leaving directory '/tmp/B.92el_X/BUILD/lib7zip-3.0.0/build'
make[2]: Entering directory '/tmp/B.92el_X/BUILD/lib7zip-3.0.0/build'
[  1%] Building CXX object src/CMakeFiles/lib7zip_shared.dir/7ZipArchive.cpp.o
cd /tmp/B.92el_X/BUILD/lib7zip-3.0.0/build/src && /usr/bin/x86_64-pld-linux-g++  -Dlib7zip_shared_EXPORTS -I/tmp/B.92el_X/BUILD/lib7zip-3.0.0/p7zip_16.02 -I/tmp/B.92el_X/BUILD/lib7zip-3.0.0/p7zip_16.02/CPP -I/tmp/B.92el_X/BUILD/lib7zip-3.0.0/p7zip_16.02/CPP/myWindows -I/tmp/B.92el_X/BUILD/lib7zip-3.0.0/p7zip_16.02/CPP/include_windows  -fPIC -Wall -Wextra -Werror -Wno-unused-parameter -std=c++14 -O2 -fwrapv -pipe -Wformat -Werror=format-security -gdwarf-4 -fno-debug-types-section -fvar-tracking-assignments -g2 -Wp,-D_FORTIFY_SOURCE=2 -fstack-protector-strong --param=ssp-buffer-size=4 -fPIC -march=x86-64 -gdwarf-4 -fno-debug-types-section -fvar-tracking-assignments -g2  -Wno-error=unused-result -fPIC   -o CMakeFiles/lib7zip_shared.dir/7ZipArchive.cpp.o -c /tmp/B.92el_X/BUILD/lib7zip-3.0.0/src/7ZipArchive.cpp
make[2]: Leaving directory '/tmp/B.92el_X/BUILD/lib7zip-3.0.0/build'
make[2]: Entering directory '/tmp/B.92el_X/BUILD/lib7zip-3.0.0/build'
[ 14%] Building CXX object src/CMakeFiles/lib7zip_shared.dir/HelperFuncs.cpp.o
cd /tmp/B.92el_X/BUILD/lib7zip-3.0.0/build/src && /usr/bin/x86_64-pld-linux-g++  -Dlib7zip_shared_EXPORTS -I/tmp/B.92el_X/BUILD/lib7zip-3.0.0/p7zip_16.02 -I/tmp/B.92el_X/BUILD/lib7zip-3.0.0/p7zip_16.02/CPP -I/tmp/B.92el_X/BUILD/lib7zip-3.0.0/p7zip_16.02/CPP/myWindows -I/tmp/B.92el_X/BUILD/lib7zip-3.0.0/p7zip_16.02/CPP/include_windows  -fPIC -Wall -Wextra -Werror -Wno-unused-parameter -std=c++14 -O2 -fwrapv -pipe -Wformat -Werror=format-security -gdwarf-4 -fno-debug-types-section -fvar-tracking-assignments -g2 -Wp,-D_FORTIFY_SOURCE=2 -fstack-protector-strong --param=ssp-buffer-size=4 -fPIC -march=x86-64 -gdwarf-4 -fno-debug-types-section -fvar-tracking-assignments -g2  -Wno-error=unused-result -fPIC   -o CMakeFiles/lib7zip_shared.dir/HelperFuncs.cpp.o -c /tmp/B.92el_X/BUILD/lib7zip-3.0.0/src/HelperFuncs.cpp
make[2]: Leaving directory '/tmp/B.92el_X/BUILD/lib7zip-3.0.0/build'
make[2]: Entering directory '/tmp/B.92el_X/BUILD/lib7zip-3.0.0/build'
[ 17%] Building CXX object src/CMakeFiles/lib7zip.dir/7ZipArchiveItem.cpp.o
cd /tmp/B.92el_X/BUILD/lib7zip-3.0.0/build/src && /usr/bin/x86_64-pld-linux-g++   -I/tmp/B.92el_X/BUILD/lib7zip-3.0.0/p7zip_16.02 -I/tmp/B.92el_X/BUILD/lib7zip-3.0.0/p7zip_16.02/CPP -I/tmp/B.92el_X/BUILD/lib7zip-3.0.0/p7zip_16.02/CPP/myWindows -I/tmp/B.92el_X/BUILD/lib7zip-3.0.0/p7zip_16.02/CPP/include_windows  -fPIC -Wall -Wextra -Werror -Wno-unused-parameter -std=c++14 -O2 -fwrapv -pipe -Wformat -Werror=format-security -gdwarf-4 -fno-debug-types-section -fvar-tracking-assignments -g2 -Wp,-D_FORTIFY_SOURCE=2 -fstack-protector-strong --param=ssp-buffer-size=4 -fPIC -march=x86-64 -gdwarf-4 -fno-debug-types-section -fvar-tracking-assignments -g2  -Wno-error=unused-result   -o CMakeFiles/lib7zip.dir/7ZipArchiveItem.cpp.o -c /tmp/B.92el_X/BUILD/lib7zip-3.0.0/src/7ZipArchiveItem.cpp
make[2]: Leaving directory '/tmp/B.92el_X/BUILD/lib7zip-3.0.0/build'
make[2]: Entering directory '/tmp/B.92el_X/BUILD/lib7zip-3.0.0/build'
[ 24%] Building CXX object src/CMakeFiles/lib7zip_shared.dir/7ZipObjectPtrArray.cpp.o
cd /tmp/B.92el_X/BUILD/lib7zip-3.0.0/build/src && /usr/bin/x86_64-pld-linux-g++  -Dlib7zip_shared_EXPORTS -I/tmp/B.92el_X/BUILD/lib7zip-3.0.0/p7zip_16.02 -I/tmp/B.92el_X/BUILD/lib7zip-3.0.0/p7zip_16.02/CPP -I/tmp/B.92el_X/BUILD/lib7zip-3.0.0/p7zip_16.02/CPP/myWindows -I/tmp/B.92el_X/BUILD/lib7zip-3.0.0/p7zip_16.02/CPP/include_windows  -fPIC -Wall -Wextra -Werror -Wno-unused-parameter -std=c++14 -O2 -fwrapv -pipe -Wformat -Werror=format-security -gdwarf-4 -fno-debug-types-section -fvar-tracking-assignments -g2 -Wp,-D_FORTIFY_SOURCE=2 -fstack-protector-strong --param=ssp-buffer-size=4 -fPIC -march=x86-64 -gdwarf-4 -fno-debug-types-section -fvar-tracking-assignments -g2  -Wno-error=unused-result -fPIC   -o CMakeFiles/lib7zip_shared.dir/7ZipObjectPtrArray.cpp.o -c /tmp/B.92el_X/BUILD/lib7zip-3.0.0/src/7ZipObjectPtrArray.cpp
make[2]: Leaving directory '/tmp/B.92el_X/BUILD/lib7zip-3.0.0/build'
make[2]: Entering directory '/tmp/B.92el_X/BUILD/lib7zip-3.0.0/build'
[ 19%] Building CXX object src/CMakeFiles/lib7zip_shared.dir/7ZipArchiveOpenCallback.cpp.o
cd /tmp/B.92el_X/BUILD/lib7zip-3.0.0/build/src && /usr/bin/x86_64-pld-linux-g++  -Dlib7zip_shared_EXPORTS -I/tmp/B.92el_X/BUILD/lib7zip-3.0.0/p7zip_16.02 -I/tmp/B.92el_X/BUILD/lib7zip-3.0.0/p7zip_16.02/CPP -I/tmp/B.92el_X/BUILD/lib7zip-3.0.0/p7zip_16.02/CPP/myWindows -I/tmp/B.92el_X/BUILD/lib7zip-3.0.0/p7zip_16.02/CPP/include_windows  -fPIC -Wall -Wextra -Werror -Wno-unused-parameter -std=c++14 -O2 -fwrapv -pipe -Wformat -Werror=format-security -gdwarf-4 -fno-debug-types-section -fvar-tracking-assignments -g2 -Wp,-D_FORTIFY_SOURCE=2 -fstack-protector-strong --param=ssp-buffer-size=4 -fPIC -march=x86-64 -gdwarf-4 -fno-debug-types-section -fvar-tracking-assignments -g2  -Wno-error=unused-result -fPIC   -o CMakeFiles/lib7zip_shared.dir/7ZipArchiveOpenCallback.cpp.o -c /tmp/B.92el_X/BUILD/lib7zip-3.0.0/src/7ZipArchiveOpenCallback.cpp
make[2]: Leaving directory '/tmp/B.92el_X/BUILD/lib7zip-3.0.0/build'
make[2]: Entering directory '/tmp/B.92el_X/BUILD/lib7zip-3.0.0/build'
[ 36%] Building CXX object src/CMakeFiles/lib7zip_shared.dir/OSFunctions_OS2.cpp.o
cd /tmp/B.92el_X/BUILD/lib7zip-3.0.0/build/src && /usr/bin/x86_64-pld-linux-g++  -Dlib7zip_shared_EXPORTS -I/tmp/B.92el_X/BUILD/lib7zip-3.0.0/p7zip_16.02 -I/tmp/B.92el_X/BUILD/lib7zip-3.0.0/p7zip_16.02/CPP -I/tmp/B.92el_X/BUILD/lib7zip-3.0.0/p7zip_16.02/CPP/myWindows -I/tmp/B.92el_X/BUILD/lib7zip-3.0.0/p7zip_16.02/CPP/include_windows  -fPIC -Wall -Wextra -Werror -Wno-unused-parameter -std=c++14 -O2 -fwrapv -pipe -Wformat -Werror=format-security -gdwarf-4 -fno-debug-types-section -fvar-tracking-assignments -g2 -Wp,-D_FORTIFY_SOURCE=2 -fstack-protector-strong --param=ssp-buffer-size=4 -fPIC -march=x86-64 -gdwarf-4 -fno-debug-types-section -fvar-tracking-assignments -g2  -Wno-error=unused-result -fPIC   -o CMakeFiles/lib7zip_shared.dir/OSFunctions_OS2.cpp.o -c /tmp/B.92el_X/BUILD/lib7zip-3.0.0/src/OSFunctions_OS2.cpp
make[2]: Leaving directory '/tmp/B.92el_X/BUILD/lib7zip-3.0.0/build'
make[2]: Entering directory '/tmp/B.92el_X/BUILD/lib7zip-3.0.0/build'
[ 21%] Building CXX object src/CMakeFiles/lib7zip_shared.dir/7ZipDllHandler.cpp.o
cd /tmp/B.92el_X/BUILD/lib7zip-3.0.0/build/src && /usr/bin/x86_64-pld-linux-g++  -Dlib7zip_shared_EXPORTS -I/tmp/B.92el_X/BUILD/lib7zip-3.0.0/p7zip_16.02 -I/tmp/B.92el_X/BUILD/lib7zip-3.0.0/p7zip_16.02/CPP -I/tmp/B.92el_X/BUILD/lib7zip-3.0.0/p7zip_16.02/CPP/myWindows -I/tmp/B.92el_X/BUILD/lib7zip-3.0.0/p7zip_16.02/CPP/include_windows  -fPIC -Wall -Wextra -Werror -Wno-unused-parameter -std=c++14 -O2 -fwrapv -pipe -Wformat -Werror=format-security -gdwarf-4 -fno-debug-types-section -fvar-tracking-assignments -g2 -Wp,-D_FORTIFY_SOURCE=2 -fstack-protector-strong --param=ssp-buffer-size=4 -fPIC -march=x86-64 -gdwarf-4 -fno-debug-types-section -fvar-tracking-assignments -g2  -Wno-error=unused-result -fPIC   -o CMakeFiles/lib7zip_shared.dir/7ZipDllHandler.cpp.o -c /tmp/B.92el_X/BUILD/lib7zip-3.0.0/src/7ZipDllHandler.cpp
make[2]: Leaving directory '/tmp/B.92el_X/BUILD/lib7zip-3.0.0/build'
make[2]: Entering directory '/tmp/B.92el_X/BUILD/lib7zip-3.0.0/build'
[ 26%] Building CXX object src/CMakeFiles/lib7zip_shared.dir/7ZipCodecInfo.cpp.o
cd /tmp/B.92el_X/BUILD/lib7zip-3.0.0/build/src && /usr/bin/x86_64-pld-linux-g++  -Dlib7zip_shared_EXPORTS -I/tmp/B.92el_X/BUILD/lib7zip-3.0.0/p7zip_16.02 -I/tmp/B.92el_X/BUILD/lib7zip-3.0.0/p7zip_16.02/CPP -I/tmp/B.92el_X/BUILD/lib7zip-3.0.0/p7zip_16.02/CPP/myWindows -I/tmp/B.92el_X/BUILD/lib7zip-3.0.0/p7zip_16.02/CPP/include_windows  -fPIC -Wall -Wextra -Werror -Wno-unused-parameter -std=c++14 -O2 -fwrapv -pipe -Wformat -Werror=format-security -gdwarf-4 -fno-debug-types-section -fvar-tracking-assignments -g2 -Wp,-D_FORTIFY_SOURCE=2 -fstack-protector-strong --param=ssp-buffer-size=4 -fPIC -march=x86-64 -gdwarf-4 -fno-debug-types-section -fvar-tracking-assignments -g2  -Wno-error=unused-result -fPIC   -o CMakeFiles/lib7zip_shared.dir/7ZipCodecInfo.cpp.o -c /tmp/B.92el_X/BUILD/lib7zip-3.0.0/src/7ZipCodecInfo.cpp
make[2]: Leaving directory '/tmp/B.92el_X/BUILD/lib7zip-3.0.0/build'
make[2]: Entering directory '/tmp/B.92el_X/BUILD/lib7zip-3.0.0/build'
[ 28%] Building CXX object src/CMakeFiles/lib7zip.dir/7ZipInStreamWrapper.cpp.o
cd /tmp/B.92el_X/BUILD/lib7zip-3.0.0/build/src && /usr/bin/x86_64-pld-linux-g++   -I/tmp/B.92el_X/BUILD/lib7zip-3.0.0/p7zip_16.02 -I/tmp/B.92el_X/BUILD/lib7zip-3.0.0/p7zip_16.02/CPP -I/tmp/B.92el_X/BUILD/lib7zip-3.0.0/p7zip_16.02/CPP/myWindows -I/tmp/B.92el_X/BUILD/lib7zip-3.0.0/p7zip_16.02/CPP/include_windows  -fPIC -Wall -Wextra -Werror -Wno-unused-parameter -std=c++14 -O2 -fwrapv -pipe -Wformat -Werror=format-security -gdwarf-4 -fno-debug-types-section -fvar-tracking-assignments -g2 -Wp,-D_FORTIFY_SOURCE=2 -fstack-protector-strong --param=ssp-buffer-size=4 -fPIC -march=x86-64 -gdwarf-4 -fno-debug-types-section -fvar-tracking-assignments -g2  -Wno-error=unused-result   -o CMakeFiles/lib7zip.dir/7ZipInStreamWrapper.cpp.o -c /tmp/B.92el_X/BUILD/lib7zip-3.0.0/src/7ZipInStreamWrapper.cpp
make[2]: Leaving directory '/tmp/B.92el_X/BUILD/lib7zip-3.0.0/build'
make[2]: Entering directory '/tmp/B.92el_X/BUILD/lib7zip-3.0.0/build'
[ 40%] Building CXX object src/CMakeFiles/lib7zip_shared.dir/__/p7zip_16.02/CPP/Common/MyWindows.cpp.o
cd /tmp/B.92el_X/BUILD/lib7zip-3.0.0/build/src && /usr/bin/x86_64-pld-linux-g++  -Dlib7zip_shared_EXPORTS -I/tmp/B.92el_X/BUILD/lib7zip-3.0.0/p7zip_16.02 -I/tmp/B.92el_X/BUILD/lib7zip-3.0.0/p7zip_16.02/CPP -I/tmp/B.92el_X/BUILD/lib7zip-3.0.0/p7zip_16.02/CPP/myWindows -I/tmp/B.92el_X/BUILD/lib7zip-3.0.0/p7zip_16.02/CPP/include_windows  -fPIC -Wall -Wextra -Werror -Wno-unused-parameter -std=c++14 -O2 -fwrapv -pipe -Wformat -Werror=format-security -gdwarf-4 -fno-debug-types-section -fvar-tracking-assignments -g2 -Wp,-D_FORTIFY_SOURCE=2 -fstack-protector-strong --param=ssp-buffer-size=4 -fPIC -march=x86-64 -gdwarf-4 -fno-debug-types-section -fvar-tracking-assignments -g2  -Wno-error=unused-result -fPIC   -o CMakeFiles/lib7zip_shared.dir/__/p7zip_16.02/CPP/Common/MyWindows.cpp.o -c /tmp/B.92el_X/BUILD/lib7zip-3.0.0/p7zip_16.02/CPP/Common/MyWindows.cpp
make[2]: Leaving directory '/tmp/B.92el_X/BUILD/lib7zip-3.0.0/build'
make[2]: Entering directory '/tmp/B.92el_X/BUILD/lib7zip-3.0.0/build'
[ 45%] Building CXX object src/CMakeFiles/lib7zip.dir/OSFunctions_Win32.cpp.o
cd /tmp/B.92el_X/BUILD/lib7zip-3.0.0/build/src && /usr/bin/x86_64-pld-linux-g++   -I/tmp/B.92el_X/BUILD/lib7zip-3.0.0/p7zip_16.02 -I/tmp/B.92el_X/BUILD/lib7zip-3.0.0/p7zip_16.02/CPP -I/tmp/B.92el_X/BUILD/lib7zip-3.0.0/p7zip_16.02/CPP/myWindows -I/tmp/B.92el_X/BUILD/lib7zip-3.0.0/p7zip_16.02/CPP/include_windows  -fPIC -Wall -Wextra -Werror -Wno-unused-parameter -std=c++14 -O2 -fwrapv -pipe -Wformat -Werror=format-security -gdwarf-4 -fno-debug-types-section -fvar-tracking-assignments -g2 -Wp,-D_FORTIFY_SOURCE=2 -fstack-protector-strong --param=ssp-buffer-size=4 -fPIC -march=x86-64 -gdwarf-4 -fno-debug-types-section -fvar-tracking-assignments -g2  -Wno-error=unused-result   -o CMakeFiles/lib7zip.dir/OSFunctions_Win32.cpp.o -c /tmp/B.92el_X/BUILD/lib7zip-3.0.0/src/OSFunctions_Win32.cpp
make[2]: Leaving directory '/tmp/B.92el_X/BUILD/lib7zip-3.0.0/build'
make[2]: Entering directory '/tmp/B.92el_X/BUILD/lib7zip-3.0.0/build'
[ 42%] Building CXX object src/CMakeFiles/lib7zip_shared.dir/__/p7zip_16.02/CPP/Windows/PropVariant.cpp.o
cd /tmp/B.92el_X/BUILD/lib7zip-3.0.0/build/src && /usr/bin/x86_64-pld-linux-g++  -Dlib7zip_shared_EXPORTS -I/tmp/B.92el_X/BUILD/lib7zip-3.0.0/p7zip_16.02 -I/tmp/B.92el_X/BUILD/lib7zip-3.0.0/p7zip_16.02/CPP -I/tmp/B.92el_X/BUILD/lib7zip-3.0.0/p7zip_16.02/CPP/myWindows -I/tmp/B.92el_X/BUILD/lib7zip-3.0.0/p7zip_16.02/CPP/include_windows  -fPIC -Wall -Wextra -Werror -Wno-unused-parameter -std=c++14 -O2 -fwrapv -pipe -Wformat -Werror=format-security -gdwarf-4 -fno-debug-types-section -fvar-tracking-assignments -g2 -Wp,-D_FORTIFY_SOURCE=2 -fstack-protector-strong --param=ssp-buffer-size=4 -fPIC -march=x86-64 -gdwarf-4 -fno-debug-types-section -fvar-tracking-assignments -g2  -Wno-error=unused-result -fPIC   -o CMakeFiles/lib7zip_shared.dir/__/p7zip_16.02/CPP/Windows/PropVariant.cpp.o -c /tmp/B.92el_X/BUILD/lib7zip-3.0.0/p7zip_16.02/CPP/Windows/PropVariant.cpp
/tmp/B.92el_X/BUILD/lib7zip-3.0.0/p7zip_16.02/CPP/Windows/PropVariant.cpp: In member function 'LONG NWindows::NCOM::CPropVariant::Attach(PROPVARIANT*)':
/tmp/B.92el_X/BUILD/lib7zip-3.0.0/p7zip_16.02/CPP/Windows/PropVariant.cpp:281:41: error: 'void* memcpy(void*, const void*, size_t)' writing to an object of type 'class NWindows::NCOM::CPropVariant' with no trivial copy-assignment; use copy-assignment or copy-initialization instead [-Werror=class-memaccess]
   memcpy(this, pSrc, sizeof(PROPVARIANT));
                                         ^
In file included from /tmp/B.92el_X/BUILD/lib7zip-3.0.0/p7zip_16.02/CPP/Windows/PropVariant.cpp:7:
/tmp/B.92el_X/BUILD/lib7zip-3.0.0/p7zip_16.02/CPP/Windows/PropVariant.h:46:7: note: 'class NWindows::NCOM::CPropVariant' declared here
 class CPropVariant : public tagPROPVARIANT
       ^~~~~~~~~~~~
cc1plus: all warnings being treated as errors
make[2]: *** [src/CMakeFiles/lib7zip_shared.dir/build.make:274: src/CMakeFiles/lib7zip_shared.dir/__/p7zip_16.02/CPP/Windows/PropVariant.cpp.o] Error 1
make[2]: Leaving directory '/tmp/B.92el_X/BUILD/lib7zip-3.0.0/build'
make[2]: *** Waiting for unfinished jobs....
make[2]: Entering directory '/tmp/B.92el_X/BUILD/lib7zip-3.0.0/build'
[ 47%] Building CXX object src/CMakeFiles/lib7zip.dir/7ZipObjectPtrArray.cpp.o
cd /tmp/B.92el_X/BUILD/lib7zip-3.0.0/build/src && /usr/bin/x86_64-pld-linux-g++   -I/tmp/B.92el_X/BUILD/lib7zip-3.0.0/p7zip_16.02 -I/tmp/B.92el_X/BUILD/lib7zip-3.0.0/p7zip_16.02/CPP -I/tmp/B.92el_X/BUILD/lib7zip-3.0.0/p7zip_16.02/CPP/myWindows -I/tmp/B.92el_X/BUILD/lib7zip-3.0.0/p7zip_16.02/CPP/include_windows  -fPIC -Wall -Wextra -Werror -Wno-unused-parameter -std=c++14 -O2 -fwrapv -pipe -Wformat -Werror=format-security -gdwarf-4 -fno-debug-types-section -fvar-tracking-assignments -g2 -Wp,-D_FORTIFY_SOURCE=2 -fstack-protector-strong --param=ssp-buffer-size=4 -fPIC -march=x86-64 -gdwarf-4 -fno-debug-types-section -fvar-tracking-assignments -g2  -Wno-error=unused-result   -o CMakeFiles/lib7zip.dir/7ZipObjectPtrArray.cpp.o -c /tmp/B.92el_X/BUILD/lib7zip-3.0.0/src/7ZipObjectPtrArray.cpp
make[2]: Leaving directory '/tmp/B.92el_X/BUILD/lib7zip-3.0.0/build'
make[2]: Entering directory '/tmp/B.92el_X/BUILD/lib7zip-3.0.0/build'
[ 31%] Building CXX object src/CMakeFiles/lib7zip_shared.dir/7ZipFormatInfo.cpp.o
cd /tmp/B.92el_X/BUILD/lib7zip-3.0.0/build/src && /usr/bin/x86_64-pld-linux-g++  -Dlib7zip_shared_EXPORTS -I/tmp/B.92el_X/BUILD/lib7zip-3.0.0/p7zip_16.02 -I/tmp/B.92el_X/BUILD/lib7zip-3.0.0/p7zip_16.02/CPP -I/tmp/B.92el_X/BUILD/lib7zip-3.0.0/p7zip_16.02/CPP/myWindows -I/tmp/B.92el_X/BUILD/lib7zip-3.0.0/p7zip_16.02/CPP/include_windows  -fPIC -Wall -Wextra -Werror -Wno-unused-parameter -std=c++14 -O2 -fwrapv -pipe -Wformat -Werror=format-security -gdwarf-4 -fno-debug-types-section -fvar-tracking-assignments -g2 -Wp,-D_FORTIFY_SOURCE=2 -fstack-protector-strong --param=ssp-buffer-size=4 -fPIC -march=x86-64 -gdwarf-4 -fno-debug-types-section -fvar-tracking-assignments -g2  -Wno-error=unused-result -fPIC   -o CMakeFiles/lib7zip_shared.dir/7ZipFormatInfo.cpp.o -c /tmp/B.92el_X/BUILD/lib7zip-3.0.0/src/7ZipFormatInfo.cpp
make[2]: Leaving directory '/tmp/B.92el_X/BUILD/lib7zip-3.0.0/build'
make[2]: Entering directory '/tmp/B.92el_X/BUILD/lib7zip-3.0.0/build'
[ 35%] Building CXX object src/CMakeFiles/lib7zip.dir/7ZipArchiveOpenCallback.cpp.o
cd /tmp/B.92el_X/BUILD/lib7zip-3.0.0/build/src && /usr/bin/x86_64-pld-linux-g++   -I/tmp/B.92el_X/BUILD/lib7zip-3.0.0/p7zip_16.02 -I/tmp/B.92el_X/BUILD/lib7zip-3.0.0/p7zip_16.02/CPP -I/tmp/B.92el_X/BUILD/lib7zip-3.0.0/p7zip_16.02/CPP/myWindows -I/tmp/B.92el_X/BUILD/lib7zip-3.0.0/p7zip_16.02/CPP/include_windows  -fPIC -Wall -Wextra -Werror -Wno-unused-parameter -std=c++14 -O2 -fwrapv -pipe -Wformat -Werror=format-security -gdwarf-4 -fno-debug-types-section -fvar-tracking-assignments -g2 -Wp,-D_FORTIFY_SOURCE=2 -fstack-protector-strong --param=ssp-buffer-size=4 -fPIC -march=x86-64 -gdwarf-4 -fno-debug-types-section -fvar-tracking-assignments -g2  -Wno-error=unused-result   -o CMakeFiles/lib7zip.dir/7ZipArchiveOpenCallback.cpp.o -c /tmp/B.92el_X/BUILD/lib7zip-3.0.0/src/7ZipArchiveOpenCallback.cpp
make[2]: Leaving directory '/tmp/B.92el_X/BUILD/lib7zip-3.0.0/build'
make[2]: Entering directory '/tmp/B.92el_X/BUILD/lib7zip-3.0.0/build'
[ 54%] Building CXX object src/CMakeFiles/lib7zip.dir/OSFunctions_OS2.cpp.o
cd /tmp/B.92el_X/BUILD/lib7zip-3.0.0/build/src && /usr/bin/x86_64-pld-linux-g++   -I/tmp/B.92el_X/BUILD/lib7zip-3.0.0/p7zip_16.02 -I/tmp/B.92el_X/BUILD/lib7zip-3.0.0/p7zip_16.02/CPP -I/tmp/B.92el_X/BUILD/lib7zip-3.0.0/p7zip_16.02/CPP/myWindows -I/tmp/B.92el_X/BUILD/lib7zip-3.0.0/p7zip_16.02/CPP/include_windows  -fPIC -Wall -Wextra -Werror -Wno-unused-parameter -std=c++14 -O2 -fwrapv -pipe -Wformat -Werror=format-security -gdwarf-4 -fno-debug-types-section -fvar-tracking-assignments -g2 -Wp,-D_FORTIFY_SOURCE=2 -fstack-protector-strong --param=ssp-buffer-size=4 -fPIC -march=x86-64 -gdwarf-4 -fno-debug-types-section -fvar-tracking-assignments -g2  -Wno-error=unused-result   -o CMakeFiles/lib7zip.dir/OSFunctions_OS2.cpp.o -c /tmp/B.92el_X/BUILD/lib7zip-3.0.0/src/OSFunctions_OS2.cpp
make[2]: Leaving directory '/tmp/B.92el_X/BUILD/lib7zip-3.0.0/build'
make[2]: Entering directory '/tmp/B.92el_X/BUILD/lib7zip-3.0.0/build'
[ 38%] Building CXX object src/CMakeFiles/lib7zip_shared.dir/7zipLibrary.cpp.o
cd /tmp/B.92el_X/BUILD/lib7zip-3.0.0/build/src && /usr/bin/x86_64-pld-linux-g++  -Dlib7zip_shared_EXPORTS -I/tmp/B.92el_X/BUILD/lib7zip-3.0.0/p7zip_16.02 -I/tmp/B.92el_X/BUILD/lib7zip-3.0.0/p7zip_16.02/CPP -I/tmp/B.92el_X/BUILD/lib7zip-3.0.0/p7zip_16.02/CPP/myWindows -I/tmp/B.92el_X/BUILD/lib7zip-3.0.0/p7zip_16.02/CPP/include_windows  -fPIC -Wall -Wextra -Werror -Wno-unused-parameter -std=c++14 -O2 -fwrapv -pipe -Wformat -Werror=format-security -gdwarf-4 -fno-debug-types-section -fvar-tracking-assignments -g2 -Wp,-D_FORTIFY_SOURCE=2 -fstack-protector-strong --param=ssp-buffer-size=4 -fPIC -march=x86-64 -gdwarf-4 -fno-debug-types-section -fvar-tracking-assignments -g2  -Wno-error=unused-result -fPIC   -o CMakeFiles/lib7zip_shared.dir/7zipLibrary.cpp.o -c /tmp/B.92el_X/BUILD/lib7zip-3.0.0/src/7zipLibrary.cpp
make[2]: Leaving directory '/tmp/B.92el_X/BUILD/lib7zip-3.0.0/build'
make[2]: Entering directory '/tmp/B.92el_X/BUILD/lib7zip-3.0.0/build'
[ 43%] Building CXX object src/CMakeFiles/lib7zip.dir/7ZipDllHandler.cpp.o
cd /tmp/B.92el_X/BUILD/lib7zip-3.0.0/build/src && /usr/bin/x86_64-pld-linux-g++   -I/tmp/B.92el_X/BUILD/lib7zip-3.0.0/p7zip_16.02 -I/tmp/B.92el_X/BUILD/lib7zip-3.0.0/p7zip_16.02/CPP -I/tmp/B.92el_X/BUILD/lib7zip-3.0.0/p7zip_16.02/CPP/myWindows -I/tmp/B.92el_X/BUILD/lib7zip-3.0.0/p7zip_16.02/CPP/include_windows  -fPIC -Wall -Wextra -Werror -Wno-unused-parameter -std=c++14 -O2 -fwrapv -pipe -Wformat -Werror=format-security -gdwarf-4 -fno-debug-types-section -fvar-tracking-assignments -g2 -Wp,-D_FORTIFY_SOURCE=2 -fstack-protector-strong --param=ssp-buffer-size=4 -fPIC -march=x86-64 -gdwarf-4 -fno-debug-types-section -fvar-tracking-assignments -g2  -Wno-error=unused-result   -o CMakeFiles/lib7zip.dir/7ZipDllHandler.cpp.o -c /tmp/B.92el_X/BUILD/lib7zip-3.0.0/src/7ZipDllHandler.cpp
make[2]: Leaving directory '/tmp/B.92el_X/BUILD/lib7zip-3.0.0/build'
make[2]: Entering directory '/tmp/B.92el_X/BUILD/lib7zip-3.0.0/build'
[ 29%] Building CXX object src/CMakeFiles/lib7zip.dir/HelperFuncs.cpp.o
cd /tmp/B.92el_X/BUILD/lib7zip-3.0.0/build/src && /usr/bin/x86_64-pld-linux-g++   -I/tmp/B.92el_X/BUILD/lib7zip-3.0.0/p7zip_16.02 -I/tmp/B.92el_X/BUILD/lib7zip-3.0.0/p7zip_16.02/CPP -I/tmp/B.92el_X/BUILD/lib7zip-3.0.0/p7zip_16.02/CPP/myWindows -I/tmp/B.92el_X/BUILD/lib7zip-3.0.0/p7zip_16.02/CPP/include_windows  -fPIC -Wall -Wextra -Werror -Wno-unused-parameter -std=c++14 -O2 -fwrapv -pipe -Wformat -Werror=format-security -gdwarf-4 -fno-debug-types-section -fvar-tracking-assignments -g2 -Wp,-D_FORTIFY_SOURCE=2 -fstack-protector-strong --param=ssp-buffer-size=4 -fPIC -march=x86-64 -gdwarf-4 -fno-debug-types-section -fvar-tracking-assignments -g2  -Wno-error=unused-result   -o CMakeFiles/lib7zip.dir/HelperFuncs.cpp.o -c /tmp/B.92el_X/BUILD/lib7zip-3.0.0/src/HelperFuncs.cpp
make[2]: Leaving directory '/tmp/B.92el_X/BUILD/lib7zip-3.0.0/build'
make[2]: Entering directory '/tmp/B.92el_X/BUILD/lib7zip-3.0.0/build'
[ 57%] Building CXX object src/CMakeFiles/lib7zip.dir/__/p7zip_16.02/CPP/Common/MyWindows.cpp.o
cd /tmp/B.92el_X/BUILD/lib7zip-3.0.0/build/src && /usr/bin/x86_64-pld-linux-g++   -I/tmp/B.92el_X/BUILD/lib7zip-3.0.0/p7zip_16.02 -I/tmp/B.92el_X/BUILD/lib7zip-3.0.0/p7zip_16.02/CPP -I/tmp/B.92el_X/BUILD/lib7zip-3.0.0/p7zip_16.02/CPP/myWindows -I/tmp/B.92el_X/BUILD/lib7zip-3.0.0/p7zip_16.02/CPP/include_windows  -fPIC -Wall -Wextra -Werror -Wno-unused-parameter -std=c++14 -O2 -fwrapv -pipe -Wformat -Werror=format-security -gdwarf-4 -fno-debug-types-section -fvar-tracking-assignments -g2 -Wp,-D_FORTIFY_SOURCE=2 -fstack-protector-strong --param=ssp-buffer-size=4 -fPIC -march=x86-64 -gdwarf-4 -fno-debug-types-section -fvar-tracking-assignments -g2  -Wno-error=unused-result   -o CMakeFiles/lib7zip.dir/__/p7zip_16.02/CPP/Common/MyWindows.cpp.o -c /tmp/B.92el_X/BUILD/lib7zip-3.0.0/p7zip_16.02/CPP/Common/MyWindows.cpp
make[2]: Leaving directory '/tmp/B.92el_X/BUILD/lib7zip-3.0.0/build'
make[2]: Entering directory '/tmp/B.92el_X/BUILD/lib7zip-3.0.0/build'
[ 49%] Building CXX object src/CMakeFiles/lib7zip.dir/7ZipCodecInfo.cpp.o
cd /tmp/B.92el_X/BUILD/lib7zip-3.0.0/build/src && /usr/bin/x86_64-pld-linux-g++   -I/tmp/B.92el_X/BUILD/lib7zip-3.0.0/p7zip_16.02 -I/tmp/B.92el_X/BUILD/lib7zip-3.0.0/p7zip_16.02/CPP -I/tmp/B.92el_X/BUILD/lib7zip-3.0.0/p7zip_16.02/CPP/myWindows -I/tmp/B.92el_X/BUILD/lib7zip-3.0.0/p7zip_16.02/CPP/include_windows  -fPIC -Wall -Wextra -Werror -Wno-unused-parameter -std=c++14 -O2 -fwrapv -pipe -Wformat -Werror=format-security -gdwarf-4 -fno-debug-types-section -fvar-tracking-assignments -g2 -Wp,-D_FORTIFY_SOURCE=2 -fstack-protector-strong --param=ssp-buffer-size=4 -fPIC -march=x86-64 -gdwarf-4 -fno-debug-types-section -fvar-tracking-assignments -g2  -Wno-error=unused-result   -o CMakeFiles/lib7zip.dir/7ZipCodecInfo.cpp.o -c /tmp/B.92el_X/BUILD/lib7zip-3.0.0/src/7ZipCodecInfo.cpp
make[2]: Leaving directory '/tmp/B.92el_X/BUILD/lib7zip-3.0.0/build'
make[2]: Entering directory '/tmp/B.92el_X/BUILD/lib7zip-3.0.0/build'
[ 33%] Building CXX object src/CMakeFiles/lib7zip_shared.dir/7ZipOpenArchive.cpp.o
cd /tmp/B.92el_X/BUILD/lib7zip-3.0.0/build/src && /usr/bin/x86_64-pld-linux-g++  -Dlib7zip_shared_EXPORTS -I/tmp/B.92el_X/BUILD/lib7zip-3.0.0/p7zip_16.02 -I/tmp/B.92el_X/BUILD/lib7zip-3.0.0/p7zip_16.02/CPP -I/tmp/B.92el_X/BUILD/lib7zip-3.0.0/p7zip_16.02/CPP/myWindows -I/tmp/B.92el_X/BUILD/lib7zip-3.0.0/p7zip_16.02/CPP/include_windows  -fPIC -Wall -Wextra -Werror -Wno-unused-parameter -std=c++14 -O2 -fwrapv -pipe -Wformat -Werror=format-security -gdwarf-4 -fno-debug-types-section -fvar-tracking-assignments -g2 -Wp,-D_FORTIFY_SOURCE=2 -fstack-protector-strong --param=ssp-buffer-size=4 -fPIC -march=x86-64 -gdwarf-4 -fno-debug-types-section -fvar-tracking-assignments -g2  -Wno-error=unused-result -fPIC   -o CMakeFiles/lib7zip_shared.dir/7ZipOpenArchive.cpp.o -c /tmp/B.92el_X/BUILD/lib7zip-3.0.0/src/7ZipOpenArchive.cpp
make[2]: Leaving directory '/tmp/B.92el_X/BUILD/lib7zip-3.0.0/build'
make[1]: *** [CMakeFiles/Makefile2:96: src/CMakeFiles/lib7zip_shared.dir/all] Error 2
make[1]: *** Waiting for unfinished jobs....
make[2]: Entering directory '/tmp/B.92el_X/BUILD/lib7zip-3.0.0/build'
[ 59%] Building CXX object src/CMakeFiles/lib7zip.dir/__/p7zip_16.02/CPP/Windows/PropVariant.cpp.o
cd /tmp/B.92el_X/BUILD/lib7zip-3.0.0/build/src && /usr/bin/x86_64-pld-linux-g++   -I/tmp/B.92el_X/BUILD/lib7zip-3.0.0/p7zip_16.02 -I/tmp/B.92el_X/BUILD/lib7zip-3.0.0/p7zip_16.02/CPP -I/tmp/B.92el_X/BUILD/lib7zip-3.0.0/p7zip_16.02/CPP/myWindows -I/tmp/B.92el_X/BUILD/lib7zip-3.0.0/p7zip_16.02/CPP/include_windows  -fPIC -Wall -Wextra -Werror -Wno-unused-parameter -std=c++14 -O2 -fwrapv -pipe -Wformat -Werror=format-security -gdwarf-4 -fno-debug-types-section -fvar-tracking-assignments -g2 -Wp,-D_FORTIFY_SOURCE=2 -fstack-protector-strong --param=ssp-buffer-size=4 -fPIC -march=x86-64 -gdwarf-4 -fno-debug-types-section -fvar-tracking-assignments -g2  -Wno-error=unused-result   -o CMakeFiles/lib7zip.dir/__/p7zip_16.02/CPP/Windows/PropVariant.cpp.o -c /tmp/B.92el_X/BUILD/lib7zip-3.0.0/p7zip_16.02/CPP/Windows/PropVariant.cpp
/tmp/B.92el_X/BUILD/lib7zip-3.0.0/p7zip_16.02/CPP/Windows/PropVariant.cpp: In member function 'LONG NWindows::NCOM::CPropVariant::Attach(PROPVARIANT*)':
/tmp/B.92el_X/BUILD/lib7zip-3.0.0/p7zip_16.02/CPP/Windows/PropVariant.cpp:281:41: error: 'void* memcpy(void*, const void*, size_t)' writing to an object of type 'class NWindows::NCOM::CPropVariant' with no trivial copy-assignment; use copy-assignment or copy-initialization instead [-Werror=class-memaccess]
   memcpy(this, pSrc, sizeof(PROPVARIANT));
                                         ^
In file included from /tmp/B.92el_X/BUILD/lib7zip-3.0.0/p7zip_16.02/CPP/Windows/PropVariant.cpp:7:
/tmp/B.92el_X/BUILD/lib7zip-3.0.0/p7zip_16.02/CPP/Windows/PropVariant.h:46:7: note: 'class NWindows::NCOM::CPropVariant' declared here
 class CPropVariant : public tagPROPVARIANT
       ^~~~~~~~~~~~
cc1plus: all warnings being treated as errors
make[2]: *** [src/CMakeFiles/lib7zip.dir/build.make:274: src/CMakeFiles/lib7zip.dir/__/p7zip_16.02/CPP/Windows/PropVariant.cpp.o] Error 1
make[2]: Leaving directory '/tmp/B.92el_X/BUILD/lib7zip-3.0.0/build'
make[2]: *** Waiting for unfinished jobs....
make[2]: Entering directory '/tmp/B.92el_X/BUILD/lib7zip-3.0.0/build'
[ 56%] Building CXX object src/CMakeFiles/lib7zip.dir/7zipLibrary.cpp.o
cd /tmp/B.92el_X/BUILD/lib7zip-3.0.0/build/src && /usr/bin/x86_64-pld-linux-g++   -I/tmp/B.92el_X/BUILD/lib7zip-3.0.0/p7zip_16.02 -I/tmp/B.92el_X/BUILD/lib7zip-3.0.0/p7zip_16.02/CPP -I/tmp/B.92el_X/BUILD/lib7zip-3.0.0/p7zip_16.02/CPP/myWindows -I/tmp/B.92el_X/BUILD/lib7zip-3.0.0/p7zip_16.02/CPP/include_windows  -fPIC -Wall -Wextra -Werror -Wno-unused-parameter -std=c++14 -O2 -fwrapv -pipe -Wformat -Werror=format-security -gdwarf-4 -fno-debug-types-section -fvar-tracking-assignments -g2 -Wp,-D_FORTIFY_SOURCE=2 -fstack-protector-strong --param=ssp-buffer-size=4 -fPIC -march=x86-64 -gdwarf-4 -fno-debug-types-section -fvar-tracking-assignments -g2  -Wno-error=unused-result   -o CMakeFiles/lib7zip.dir/7zipLibrary.cpp.o -c /tmp/B.92el_X/BUILD/lib7zip-3.0.0/src/7zipLibrary.cpp
make[2]: Leaving directory '/tmp/B.92el_X/BUILD/lib7zip-3.0.0/build'
make[2]: Entering directory '/tmp/B.92el_X/BUILD/lib7zip-3.0.0/build'
[ 50%] Building CXX object src/CMakeFiles/lib7zip.dir/7ZipFormatInfo.cpp.o
cd /tmp/B.92el_X/BUILD/lib7zip-3.0.0/build/src && /usr/bin/x86_64-pld-linux-g++   -I/tmp/B.92el_X/BUILD/lib7zip-3.0.0/p7zip_16.02 -I/tmp/B.92el_X/BUILD/lib7zip-3.0.0/p7zip_16.02/CPP -I/tmp/B.92el_X/BUILD/lib7zip-3.0.0/p7zip_16.02/CPP/myWindows -I/tmp/B.92el_X/BUILD/lib7zip-3.0.0/p7zip_16.02/CPP/include_windows  -fPIC -Wall -Wextra -Werror -Wno-unused-parameter -std=c++14 -O2 -fwrapv -pipe -Wformat -Werror=format-security -gdwarf-4 -fno-debug-types-section -fvar-tracking-assignments -g2 -Wp,-D_FORTIFY_SOURCE=2 -fstack-protector-strong --param=ssp-buffer-size=4 -fPIC -march=x86-64 -gdwarf-4 -fno-debug-types-section -fvar-tracking-assignments -g2  -Wno-error=unused-result   -o CMakeFiles/lib7zip.dir/7ZipFormatInfo.cpp.o -c /tmp/B.92el_X/BUILD/lib7zip-3.0.0/src/7ZipFormatInfo.cpp
make[2]: Leaving directory '/tmp/B.92el_X/BUILD/lib7zip-3.0.0/build'
make[2]: Entering directory '/tmp/B.92el_X/BUILD/lib7zip-3.0.0/build'
[ 52%] Building CXX object src/CMakeFiles/lib7zip.dir/7ZipOpenArchive.cpp.o
cd /tmp/B.92el_X/BUILD/lib7zip-3.0.0/build/src && /usr/bin/x86_64-pld-linux-g++   -I/tmp/B.92el_X/BUILD/lib7zip-3.0.0/p7zip_16.02 -I/tmp/B.92el_X/BUILD/lib7zip-3.0.0/p7zip_16.02/CPP -I/tmp/B.92el_X/BUILD/lib7zip-3.0.0/p7zip_16.02/CPP/myWindows -I/tmp/B.92el_X/BUILD/lib7zip-3.0.0/p7zip_16.02/CPP/include_windows  -fPIC -Wall -Wextra -Werror -Wno-unused-parameter -std=c++14 -O2 -fwrapv -pipe -Wformat -Werror=format-security -gdwarf-4 -fno-debug-types-section -fvar-tracking-assignments -g2 -Wp,-D_FORTIFY_SOURCE=2 -fstack-protector-strong --param=ssp-buffer-size=4 -fPIC -march=x86-64 -gdwarf-4 -fno-debug-types-section -fvar-tracking-assignments -g2  -Wno-error=unused-result   -o CMakeFiles/lib7zip.dir/7ZipOpenArchive.cpp.o -c /tmp/B.92el_X/BUILD/lib7zip-3.0.0/src/7ZipOpenArchive.cpp
make[2]: Leaving directory '/tmp/B.92el_X/BUILD/lib7zip-3.0.0/build'
make[1]: *** [CMakeFiles/Makefile2:133: src/CMakeFiles/lib7zip.dir/all] Error 2
make: *** [Makefile:133: all] Error 2
error: Bad exit status from /tmp/B.92el_X/BUILD/tmp/rpm-tmp.91972 (%build)


RPM build errors:
    Bad exit status from /tmp/B.92el_X/BUILD/tmp/rpm-tmp.91972 (%build)
ended at: Mon Dec 31 18:13:32 2018, done in 0:00:07.049258
error: No files produced.
+ chmod -R u+rwX /tmp/B.92el_X/BUILD
+ rm -rf /tmp/B.92el_X/tmp /tmp/B.92el_X/BUILD
+ rm -rf /tmp/B.92el_X
Begin-PLD-Builder-Info
Build-Time: user:23.55s sys:2.99s real:11.18s (faults io:0 non-io:777569)

End-PLD-Builder-Info
[Back to list of logs] [View rpm -qa of builder]