FailedOk

th/SRPMS[OK]
th/x32[OK]
th/i686[OK]
th/x86_64[OK]

ac/SRPMS[OK]
ac/i386[OK]
ac/i586[OK]
ac/i686[OK]
ac/alpha[OK]
ac/amd64[OK]
ac/athlon[OK]
ac/ppc[OK]
ac/sparc[OK]
ac/sparc64[OK]

Advanced Search
main()
Powered by PLD Linux
(c) 2002-2018 PLD Team
$Revision: 1.37 $
Powered by Neo.
Your IP: 54.196.13.210

libdbi-drivers 8a49818e-47bb-43a3-923f-69ea55d7c7de

Status:Failed
Source URL:ftp://buildlogs.pld-linux.org/th/x86_64/FAIL/libdbi-drivers,8a49818e-47bb-43a3-923f-69ea55d7c7de.bz2
text/plain URL:View!
full text:View!
rpm -qa of builder:View!
Date:2018/03/07 11:05:03
Runtime:0:00:10.445991

Toc:

  • error 1
  • collect2: error: ld returned 1 exit status
  • error 2
  • make[3]: *** [Makefile:479: libdbdmysql.la] Error 1
  • error 3
  • make[2]: *** [Makefile:403: all-recursive] Error 1
  • error 4
  • make[1]: *** [Makefile:454: all-recursive] Error 1
  • error 5
  • error: Bad exit status from /tmp/B.shWGFf/BUILD/tmp/rpm-tmp.35637 (%build)
  • error 6
  • RPM build errors:
  • error 7
  • error: No files produced.

Content:

checking for MySQL libraries... 
checking for PostgreSQL support... yes
checking for PostgreSQL includes... -I/usr/include
checking for PostgreSQL libraries... -L/usr/lib64
checking for SQLite support... yes
checking for SQLite3 support... yes
checking for Msql support... no
checking for Oracle support... no
checking for Firebird/Interbase support... yes
checking for isql-fb... no
checking for isql... isql
checking for Freetds support... yes
checking CS_TDS_80... CS_TDS_71
checking for Ingres support... no
checking for IBM DB2 support... no
checking for strtoll... yes
checking for atoll... yes
checking for vasprintf... yes
checking for asprintf... yes
checking for libdbi library... yes: libs in /usr/lib64
checking for string.h... (cached) yes
checking for strings.h... (cached) yes
checking that generated files are newer than configure... done
configure: creating ./config.status
config.status: creating libdbi-drivers.spec
config.status: creating Makefile
config.status: creating doc/Makefile
config.status: creating doc/include/Makefile
config.status: creating drivers/Makefile
config.status: creating drivers/mysql/Makefile
config.status: creating drivers/pgsql/Makefile
config.status: creating drivers/sqlite/Makefile
config.status: creating drivers/sqlite3/Makefile
config.status: creating drivers/msql/Makefile
config.status: creating drivers/oracle/Makefile
config.status: creating drivers/firebird/Makefile
config.status: creating drivers/freetds/Makefile
config.status: creating drivers/ingres/Makefile
config.status: creating drivers/db2/Makefile
config.status: creating tests/Makefile
config.status: creating tests/cgreen/Makefile
config.status: creating tests/test_dbi.cfg
config.status: creating tests/plugin_settings.sh
config.status: creating config.h
config.status: executing depfiles commands
config.status: executing libtool commands
+ /usr/bin/make -Otarget -j5
/usr/bin/make  all-recursive
Making all in drivers
Making all in mysql
make[3]: Entering directory '/tmp/B.shWGFf/BUILD/libdbi-drivers-0.9.0/drivers/mysql'
/bin/sh ../../libtool  --tag=CC   --mode=compile x86_64-pld-linux-gcc -DHAVE_CONFIG_H -I. -I../.. -I../.. -I../../include -I/usr/include -I/usr/include/mysql    -std=gnu99 -O2 -fwrapv -pipe -Wformat -Werror=format-security -gdwarf-4 -fno-debug-types-section -fvar-tracking-assignments -g2 -Wp,-D_FORTIFY_SOURCE=2 -fstack-protector-strong --param=ssp-buffer-size=4 -fPIC -march=x86-64 -gdwarf-4 -fno-debug-types-section -fvar-tracking-assignments -g2  -MT dbd_mysql.lo -MD -MP -MF .deps/dbd_mysql.Tpo -c -o dbd_mysql.lo dbd_mysql.c
libtool: compile:  x86_64-pld-linux-gcc -DHAVE_CONFIG_H -I. -I../.. -I../.. -I../../include -I/usr/include -I/usr/include/mysql -std=gnu99 -O2 -fwrapv -pipe -Wformat -Werror=format-security -gdwarf-4 -fno-debug-types-section -fvar-tracking-assignments -g2 -Wp,-D_FORTIFY_SOURCE=2 -fstack-protector-strong --param=ssp-buffer-size=4 -fPIC -march=x86-64 -gdwarf-4 -fno-debug-types-section -fvar-tracking-assignments -g2 -MT dbd_mysql.lo -MD -MP -MF .deps/dbd_mysql.Tpo -c dbd_mysql.c  -fPIC -DPIC -o .libs/dbd_mysql.o
/usr/include/dbi/dbd.h: In function 'dbd_connect':
dbd_mysql.c:231:8: warning: ignoring return value of 'asprintf', declared with attribute warn_unused_result [-Wunused-result]
        asprintf(&sql_cmd, "SET NAMES '%s'", dbd_encoding_from_iana(encoding));
        ^~~~~~~~~~~~~~~~~~~~~~~~~~~~~~~~~~~~~~~~~~~~~~~~~~~~~~~~~~~~~~~~~~~~~~
dbd_mysql.c:238:6: warning: ignoring return value of 'asprintf', declared with attribute warn_unused_result [-Wunused-result]
      asprintf(&sql_cmd, "SET NAMES '%s'", dbd_encoding_from_iana(encoding));
      ^~~~~~~~~~~~~~~~~~~~~~~~~~~~~~~~~~~~~~~~~~~~~~~~~~~~~~~~~~~~~~~~~~~~~~
/usr/include/dbi/dbd.h: In function 'dbd_get_encoding':
dbd_mysql.c:312:4: warning: ignoring return value of 'asprintf', declared with attribute warn_unused_result [-Wunused-result]
    asprintf(&sql_cmd, "SHOW CREATE DATABASE %s", conn->current_db);
    ^~~~~~~~~~~~~~~~~~~~~~~~~~~~~~~~~~~~~~~~~~~~~~~~~~~~~~~~~~~~~~~
dbd_mysql.c:337:4: warning: ignoring return value of 'asprintf', declared with attribute warn_unused_result [-Wunused-result]
    asprintf(&sql_cmd, "SHOW VARIABLES LIKE '%s'", "character_set_connection");
    ^~~~~~~~~~~~~~~~~~~~~~~~~~~~~~~~~~~~~~~~~~~~~~~~~~~~~~~~~~~~~~~~~~~~~~~~~~
dbd_mysql.c:355:6: warning: ignoring return value of 'asprintf', declared with attribute warn_unused_result [-Wunused-result]
      asprintf(&sql_cmd, "SHOW VARIABLES LIKE '%s'", "character_set");
      ^~~~~~~~~~~~~~~~~~~~~~~~~~~~~~~~~~~~~~~~~~~~~~~~~~~~~~~~~~~~~~~
/usr/include/dbi/dbd.h: In function 'dbd_list_dbs':
dbd_mysql.c:466:3: warning: ignoring return value of 'asprintf', declared with attribute warn_unused_result [-Wunused-result]
   asprintf(&sql_cmd, "SHOW DATABASES LIKE '%s'", pattern);
   ^~~~~~~~~~~~~~~~~~~~~~~~~~~~~~~~~~~~~~~~~~~~~~~~~~~~~~~
/usr/include/dbi/dbd.h: In function 'dbd_list_tables':
dbd_mysql.c:482:3: warning: ignoring return value of 'asprintf', declared with attribute warn_unused_result [-Wunused-result]
   asprintf(&sql_cmd, "SHOW TABLES FROM %s", db);
   ^~~~~~~~~~~~~~~~~~~~~~~~~~~~~~~~~~~~~~~~~~~~~
dbd_mysql.c:488:3: warning: ignoring return value of 'asprintf', declared with attribute warn_unused_result [-Wunused-result]
   asprintf(&sql_cmd, "SHOW TABLES FROM %s LIKE '%s'", db, pattern);
   ^~~~~~~~~~~~~~~~~~~~~~~~~~~~~~~~~~~~~~~~~~~~~~~~~~~~~~~~~~~~~~~~
/usr/include/dbi/dbd.h: In function 'dbd_savepoint':
dbd_mysql.c:631:3: warning: ignoring return value of 'asprintf', declared with attribute warn_unused_result [-Wunused-result]
   asprintf(&query, "SAVEPOINT %s", savepoint);
   ^~~~~~~~~~~~~~~~~~~~~~~~~~~~~~~~~~~~~~~~~~~
/usr/include/dbi/dbd.h: In function 'dbd_rollback_to_savepoint':
dbd_mysql.c:650:3: warning: ignoring return value of 'asprintf', declared with attribute warn_unused_result [-Wunused-result]
   asprintf(&query, "ROLLBACK TO SAVEPOINT %s", savepoint);
   ^~~~~~~~~~~~~~~~~~~~~~~~~~~~~~~~~~~~~~~~~~~~~~~~~~~~~~~
/usr/include/dbi/dbd.h: In function 'dbd_release_savepoint':
dbd_mysql.c:669:3: warning: ignoring return value of 'asprintf', declared with attribute warn_unused_result [-Wunused-result]
   asprintf(&query, "RELEASE SAVEPOINT %s", savepoint);
   ^~~~~~~~~~~~~~~~~~~~~~~~~~~~~~~~~~~~~~~~~~~~~~~~~~~
mv -f .deps/dbd_mysql.Tpo .deps/dbd_mysql.Plo
make[3]: Leaving directory '/tmp/B.shWGFf/BUILD/libdbi-drivers-0.9.0/drivers/mysql'
make[3]: Entering directory '/tmp/B.shWGFf/BUILD/libdbi-drivers-0.9.0/drivers/mysql'
/bin/sh ../../libtool  --tag=CC   --mode=link x86_64-pld-linux-gcc  -std=gnu99 -O2 -fwrapv -pipe -Wformat -Werror=format-security -gdwarf-4 -fno-debug-types-section -fvar-tracking-assignments -g2 -Wp,-D_FORTIFY_SOURCE=2 -fstack-protector-strong --param=ssp-buffer-size=4 -fPIC -march=x86-64 -gdwarf-4 -fno-debug-types-section -fvar-tracking-assignments -g2  -module -avoid-version  -L/usr/lib64 -lmysqlclient_r -no-undefined -ldbi -L/usr/lib64 -Wl,--as-needed -Wl,--no-copy-dt-needed-entries -Wl,-z,relro -Wl,-z,combreloc  -o libdbdmysql.la -rpath /usr/lib64/dbd dbd_mysql.lo  
libtool: link: x86_64-pld-linux-gcc -shared  -fPIC -DPIC  -O2 -gdwarf-4 -g2 -fstack-protector-strong -march=x86-64 -gdwarf-4 -g2 -Wl,--as-needed -Wl,--no-copy-dt-needed-entries -Wl,-z -Wl,relro -Wl,-z -Wl,combreloc    .libs/dbd_mysql.o   -L/usr/lib64 -lmysqlclient_r /usr/lib64/libdbi.so -ldl -lm -Wl,-soname -Wl,libdbdmysql.so -o .libs/libdbdmysql.so
/usr/bin/ld: cannot find -lmysqlclient_r
collect2: error: ld returned 1 exit status
make[3]: *** [Makefile:479: libdbdmysql.la] Error 1
make[3]: Leaving directory '/tmp/B.shWGFf/BUILD/libdbi-drivers-0.9.0/drivers/mysql'
make[2]: *** [Makefile:403: all-recursive] Error 1
make[1]: *** [Makefile:454: all-recursive] Error 1
make: *** [Makefile:384: all] Error 2
error: Bad exit status from /tmp/B.shWGFf/BUILD/tmp/rpm-tmp.35637 (%build)


RPM build errors:
    Bad exit status from /tmp/B.shWGFf/BUILD/tmp/rpm-tmp.35637 (%build)
ended at: Wed Mar  7 11:05:03 2018, done in 0:00:10.445991
error: No files produced.
mesg: ttyname failed: Inappropriate ioctl for device
+ chmod -R u+rwX /tmp/B.shWGFf/BUILD
+ rm -rf /tmp/B.shWGFf/tmp /tmp/B.shWGFf/BUILD
mesg: ttyname failed: Inappropriate ioctl for device
+ rm -rf /tmp/B.shWGFf
Begin-PLD-Builder-Info
Build-Time: user:10.32s sys:1.02s real:14.63s (faults io:0 non-io:701169)

End-PLD-Builder-Info
[Back to list of logs] [View rpm -qa of builder]