FailedOk

th/SRPMS[OK]
th/x32[OK]
th/i686[OK]
th/x86_64[OK]

ac/SRPMS[OK]
ac/i386[OK]
ac/i586[OK]
ac/i686[OK]
ac/alpha[OK]
ac/amd64[OK]
ac/athlon[OK]
ac/ppc[OK]
ac/sparc[OK]
ac/sparc64[OK]

Advanced Search
main()
Powered by PLD Linux
(c) 2002-2018 PLD Team
$Revision: 1.37 $
Powered by php.
Your IP: 54.92.190.11

libdigidoc 703e50c9-dcf0-47e5-b31d-d2a0abc05285

Status:Failed
Source URL:ftp://buildlogs.pld-linux.org/th/x86_64/FAIL/libdigidoc,703e50c9-dcf0-47e5-b31d-d2a0abc05285.bz2
text/plain URL:View!
rpm -qa of builder:View!
Date:2018/09/14 20:14:06
Runtime:0:00:02.206796

Toc:

  • prep
  • Executing(%prep): /bin/sh -e /tmp/B.TBk3hR/BUILD/tmp/rpm-tmp.66765
  • build
  • Executing(%build): /bin/sh -e /tmp/B.TBk3hR/BUILD/tmp/rpm-tmp.66765
  • error 1
  • /tmp/B.TBk3hR/BUILD/libdigidoc-3.10.2/libdigidoc/DigiDocObj.c:3708:14: error: dereferencing pointer to incomplete type 'OCSP_BASICRESP' {aka 'struct ocsp_basic_response_st'}
  • error 2
  • /tmp/B.TBk3hR/BUILD/libdigidoc-3.10.2/libdigidoc/DigiDocObj.c:3859:72: error: dereferencing pointer to incomplete type 'OCSP_SINGLERESP' {aka 'struct ocsp_single_response_st'}
  • error 3
  • /tmp/B.TBk3hR/BUILD/libdigidoc-3.10.2/libdigidoc/DigiDocObj.c:4054:44: error: dereferencing pointer to incomplete type 'X509_EXTENSION' {aka 'struct X509_extension_st'}
  • error 4
  • /tmp/B.TBk3hR/BUILD/libdigidoc-3.10.2/libdigidoc/DigiDocObj.c:4331:15: error: storage size of 'ctx' isn't known
  • error 5
  • make[2]: *** [libdigidoc/CMakeFiles/digidoc.dir/build.make:92: libdigidoc/CMakeFiles/digidoc.dir/DigiDocObj.c.o] Error 1
  • error 6
  • /tmp/B.TBk3hR/BUILD/libdigidoc-3.10.2/libdigidoc/DigiDocSAXParser.c:82:18: error: field 'ectx' has incomplete type
  • error 7
  • make[2]: *** [libdigidoc/CMakeFiles/digidoc.dir/build.make:157: libdigidoc/CMakeFiles/digidoc.dir/DigiDocSAXParser.c.o] Error 1
  • error 8
  • /tmp/B.TBk3hR/BUILD/libdigidoc-3.10.2/libdigidoc/DigiDocLib.c:477:15: error: storage size of 'ctx' isn't known
  • error 9
  • /tmp/B.TBk3hR/BUILD/libdigidoc-3.10.2/libdigidoc/DigiDocLib.c:538:15: error: storage size of 'ctx' isn't known
  • error 10
  • /tmp/B.TBk3hR/BUILD/libdigidoc-3.10.2/libdigidoc/DigiDocLib.c:848:28: error: 'BIO_R_BAD_HOSTNAME_LOOKUP' undeclared (first use in this function); did you mean 'BIO_R_BAD_FOPEN_MODE'?
  • error 11
  • /tmp/B.TBk3hR/BUILD/libdigidoc-3.10.2/libdigidoc/DigiDocLib.c:849:25: error: 'OCSP_R_SERVER_WRITE_ERROR' undeclared (first use in this function); did you mean 'OCSP_R_SERVER_RESPONSE_ERROR'?
  • error 12
  • make[2]: *** [libdigidoc/CMakeFiles/digidoc.dir/build.make:79: libdigidoc/CMakeFiles/digidoc.dir/DigiDocLib.c.o] Error 1
  • error 13
  • make[1]: *** [CMakeFiles/Makefile2:128: libdigidoc/CMakeFiles/digidoc.dir/all] Error 2
  • error 14
  • error: Bad exit status from /tmp/B.TBk3hR/BUILD/tmp/rpm-tmp.66765 (%build)
  • error 15
  • RPM build errors:
  • error 16
  • error: No files produced.

Content:

request from: arekm
checking if we should skip the build
started at: Fri Sep 14 20:14:01 2018
killing old processes on a builder
mesg: ttyname failed: Inappropriate ioctl for device
sending signal 9 to pid -1
Killed
cleaning up /tmp
mesg: ttyname failed: Inappropriate ioctl for device
fetching https://srcbuilder.pld-linux.org/th//srpms/703e50c9-dcf0-47e5-b31d-d2a0abc05285/libdigidoc-3.10.2-3.src.rpm
fetched 3805034 bytes, 3489.9 K/s
installing srpm: libdigidoc-3.10.2-3.src.rpm
mesg: ttyname failed: Inappropriate ioctl for device
+ install -d /tmp/B.TBk3hR/BUILD /tmp/B.TBk3hR/RPMS
+ LC_ALL=en_US.UTF-8
+ rpm -qp --changelog libdigidoc-3.10.2-3.src.rpm
* Fri Sep 14 2018 PLD Linux Team <feedback@pld-linux.org>
- For complete changelog see: http://git.pld-linux.org/?p=packages/libdigidoc.git;a=log;h=master
* Fri Sep 14 2018 Arkadiusz Miśkiewicz <arekm@maven.pl> e91dbf6
- release 3 (by relup.sh) * Sat Nov 25 2017 Jakub Bogusz <qboosh@pld-linux.org> 5dc8043
- Obsoletes libdigidoc-static (present before 2.7.0) * Sat Nov 25 2017 Jakub Bogusz <qboosh@pld-linux.org> cb4a229
- added cmake patch (drop rpath, disable unnecessary C++ compiler checks) - don't package *.docx files, *.pdf versions moved to -apidocs - release 2 * Mon Sep 18 2017 Elan Ruusamäe <glen@delfi.ee> b3824cc
- BR pkgconfig, libstdc++-devel * Mon Sep 18 2017 Elan Ruusamäe <glen@pld-linux.org> d0abbd7
- up to 3.10.2 * Mon Sep 18 2017 Elan Ruusamäe <glen@pld-linux.org> 4041c96
- certs todo is outdated + rpm -Uhv --nodeps --define '_topdir /tmp/B.TBk3hR' --define '_specdir %{_topdir}' --define '_sourcedir %{_specdir}' --define '_rpmdir %{_topdir}/RPMS' --define '_builddir %{_topdir}/BUILD' libdigidoc-3.10.2-3.src.rpm Preparing... ################################################## libdigidoc ################################################## + rm -f libdigidoc-3.10.2-3.src.rpm mesg: ttyname failed: Inappropriate ioctl for device + install -m 700 -d /tmp/B.TBk3hR/BUILD/tmp mesg: ttyname failed: Inappropriate ioctl for device + TMPDIR=/tmp/B.TBk3hR/BUILD/tmp + exec nice -n 0 rpmbuild -bp --short-circuit --nodeps --define '_topdir /tmp/B.TBk3hR' --define '_specdir %{_topdir}' --define '_sourcedir %{_specdir}' --define '_rpmdir %{_topdir}/RPMS' --define '_builddir %{_topdir}/BUILD' --target x86_64-pld-linux --define 'prep exit 0' /tmp/B.TBk3hR/libdigidoc.spec Building target platforms: x86_64-pld-linux checking BuildConflict-ing packages no BuildConflicts found checking BR rpm: Building target platforms: x86_64-pld-linux no BR needed building RPM using: set -ex; : build-id: 703e50c9-dcf0-47e5-b31d-d2a0abc05285; TMPDIR=/tmp/B.TBk3hR/BUILD/tmp exec nice -n 0 rpmbuild -bb --define '_smp_mflags -j9' --define '_make_opts -Otarget' --define '_pld_builder 1' --define '_topdir /tmp/B.TBk3hR' --define '_specdir %{_topdir}' --define '_sourcedir %{_specdir}' --define '_rpmdir %{_topdir}/RPMS' --define '_builddir %{_topdir}/BUILD' --target x86_64-pld-linux /tmp/B.TBk3hR/libdigidoc.spec mesg: ttyname failed: Inappropriate ioctl for device + : build-id: 703e50c9-dcf0-47e5-b31d-d2a0abc05285 + TMPDIR=/tmp/B.TBk3hR/BUILD/tmp + exec nice -n 0 rpmbuild -bb --define '_smp_mflags -j9' --define '_make_opts -Otarget' --define '_pld_builder 1' --define '_topdir /tmp/B.TBk3hR' --define '_specdir %{_topdir}' --define '_sourcedir %{_specdir}' --define '_rpmdir %{_topdir}/RPMS' --define '_builddir %{_topdir}/BUILD' --target x86_64-pld-linux /tmp/B.TBk3hR/libdigidoc.spec Building target platforms: x86_64-pld-linux Executing(%prep): /bin/sh -e /tmp/B.TBk3hR/BUILD/tmp/rpm-tmp.66765 + umask 022 + cd /tmp/B.TBk3hR/BUILD + cd /tmp/B.TBk3hR/BUILD + rm -rf libdigidoc-3.10.2 + /usr/bin/gzip -dc /tmp/B.TBk3hR/libdigidoc-3.10.2.tar.gz + /bin/tar -xf - + STATUS=0 + '[' 0 -ne 0 ']' + cd libdigidoc-3.10.2 + /bin/id -u + '[' 1000 '=' 0 ']' + /bin/id -u + '[' 1000 '=' 0 ']' + /bin/chmod -Rf a+rX,u+w,g-w,o-w . + echo 'Patch #0 (libdigidoc-cmake.patch):' Patch #0 (libdigidoc-cmake.patch): + '[' -f /tmp/B.TBk3hR/libdigidoc-cmake.patch ']' + /bin/cat /tmp/B.TBk3hR/libdigidoc-cmake.patch + /usr/bin/patch -s -p1 + exit 0 Executing(%build): /bin/sh -e /tmp/B.TBk3hR/BUILD/tmp/rpm-tmp.66765 TMP=/home/users/builder/tmp HOME=/home/users/builder PATH=/home/users/builder/GNUstep/Tools:/usr/local/bin:/usr/bin:/bin:/home/users/builder/bin TMPDIR=/tmp/B.TBk3hR/BUILD/tmp + umask 022 + cd /tmp/B.TBk3hR/BUILD + cd libdigidoc-3.10.2 + install -d build + cd build + CC=x86_64-pld-linux-gcc CXX=x86_64-pld-linux-g++ CPPFLAGS= /usr/bin/cmake '-DCMAKE_VERBOSE_MAKEFILE=ON' '-DCMAKE_BUILD_TYPE=PLD' '-DCMAKE_INSTALL_BINDIR:PATH=/usr/bin' '-DCMAKE_INSTALL_SBINDIR:PATH=/usr/sbin' '-DCMAKE_INSTALL_LIBEXECDIR:PATH=/usr/libexec' '-DCMAKE_INSTALL_SYSCONFDIR:PATH=/etc' '-DCMAKE_INSTALL_SHAREDSTATEDIRPATH:PATH=/var/lib' '-DCMAKE_INSTALL_LOCALSTATEDIRPATH:PATH=/var' '-DCMAKE_INSTALL_LIBDIR:PATH=/usr/lib64' '-DCMAKE_INSTALL_INCLUDEDIR:PATH=/usr/include' '-DCMAKE_INSTALL_OLDINCLUDEDIR:PATH=/usr/include' '-DCMAKE_INSTALL_DATAROOTDIR:PATH=/usr/share' '-DCMAKE_INSTALL_DATADIR:PATH=/usr/share' '-DCMAKE_INSTALL_INFODIR:PATH=/usr/share/info' '-DCMAKE_INSTALL_LOCALEDIR:PATH=/usr/share/locale' '-DCMAKE_INSTALL_MANDIR:PATH=/usr/share/man' '-DCMAKE_INSTALL_DOCDIR:PATH=/usr/share/doc' '-DCMAKE_INSTALL_PREFIX:PATH=/usr' '-DSYSCONF_INSTALL_DIR:PATH=/etc' '-DCMAKE_CXX_FLAGS_PLD=-O2 -fwrapv -pipe -Wformat -Werror=format-security -gdwarf-4 -fno-debug-types-section -fvar-tracking-assignments -g2 -Wp,-D_FORTIFY_SOURCE=2 -fstack-protector-strong --param=ssp-buffer-size=4 -fPIC -march=x86-64 -gdwarf-4 -fno-debug-types-section -fvar-tracking-assignments -g2 -DNDEBUG -DQT_NO_DEBUG' '-DCMAKE_C_FLAGS_PLD=-O2 -fwrapv -pipe -Wformat -Werror=format-security -gdwarf-4 -fno-debug-types-section -fvar-tracking-assignments -g2 -Wp,-D_FORTIFY_SOURCE=2 -fstack-protector-strong --param=ssp-buffer-size=4 -fPIC -march=x86-64 -gdwarf-4 -fno-debug-types-section -fvar-tracking-assignments -g2 -DNDEBUG -DQT_NO_DEBUG' '-DCMAKE_Fortran_FLAGS_PLD=-O2 -fwrapv -pipe -Wformat -Werror=format-security -gdwarf-4 -fno-debug-types-section -fvar-tracking-assignments -g2 -Wp,-D_FORTIFY_SOURCE=2 -fstack-protector-strong --param=ssp-buffer-size=4 -fPIC -march=x86-64 -gdwarf-4 -fno-debug-types-section -fvar-tracking-assignments -g2 -DNDEBUG -DQT_NO_DEBUG' '-DCMAKE_EXE_LINKER_FLAGS_PLD=-Wl,--as-needed -Wl,--no-copy-dt-needed-entries -Wl,-z,relro -Wl,-z,combreloc ' '-DCMAKE_SHARED_LINKER_FLAGS_PLD=-Wl,--as-needed -Wl,--no-copy-dt-needed-entries -Wl,-z,relro -Wl,-z,combreloc ' '-DCMAKE_MODULE_LINKER_FLAGS_PLD=-Wl,--as-needed -Wl,--no-copy-dt-needed-entries -Wl,-z,relro -Wl,-z,combreloc ' '-DLIB_SUFFIX=64' '-DBUILD_SHARED_LIBS:BOOL=ON' .. -- The C compiler identification is GNU 8.2.0 -- Check for working C compiler: /usr/bin/x86_64-pld-linux-gcc -- Check for working C compiler: /usr/bin/x86_64-pld-linux-gcc -- works -- Detecting C compiler ABI info -- Detecting C compiler ABI info - done -- Detecting C compile features -- Detecting C compile features - done -- Found Doxygen: /usr/bin/doxygen (found version "1.8.8") found components: doxygen dot -- Found LibXml2: /usr/lib64/libxml2.so (found version "2.9.8") -- Found OpenSSL: /usr/lib64/libcrypto.so (found version "1.1.1") -- Found PKCS11_Module: opensc-pkcs11.so -- Found ZLIB: /usr/lib64/libz.so (found version "1.2.11") -- Performing Test ICONV_SECOND_ARGUMENT_IS_CONST -- Performing Test ICONV_SECOND_ARGUMENT_IS_CONST - Success -- Found Iconv: /usr/lib64/libc.so -- Configuring done -- Generating done CMake Warning: Manually-specified variables were not used by the project: CMAKE_CXX_FLAGS_PLD CMAKE_Fortran_FLAGS_PLD CMAKE_INSTALL_LOCALSTATEDIRPATH CMAKE_INSTALL_SHAREDSTATEDIRPATH LIB_SUFFIX SYSCONF_INSTALL_DIR -- Build files have been written to: /tmp/B.TBk3hR/BUILD/libdigidoc-3.10.2/build + /usr/bin/make -Otarget -j9 /usr/bin/cmake -H/tmp/B.TBk3hR/BUILD/libdigidoc-3.10.2 -B/tmp/B.TBk3hR/BUILD/libdigidoc-3.10.2/build --check-build-system CMakeFiles/Makefile.cmake 0 /usr/bin/cmake -E cmake_progress_start /tmp/B.TBk3hR/BUILD/libdigidoc-3.10.2/build/CMakeFiles /tmp/B.TBk3hR/BUILD/libdigidoc-3.10.2/build/CMakeFiles/progress.marks /usr/bin/make -f CMakeFiles/Makefile2 all /usr/bin/make -f libdigidoc/CMakeFiles/digidoc.dir/build.make libdigidoc/CMakeFiles/digidoc.dir/depend make[2]: Entering directory '/tmp/B.TBk3hR/BUILD/libdigidoc-3.10.2/build' cd /tmp/B.TBk3hR/BUILD/libdigidoc-3.10.2/build && /usr/bin/cmake -E cmake_depends "Unix Makefiles" /tmp/B.TBk3hR/BUILD/libdigidoc-3.10.2 /tmp/B.TBk3hR/BUILD/libdigidoc-3.10.2/libdigidoc /tmp/B.TBk3hR/BUILD/libdigidoc-3.10.2/build /tmp/B.TBk3hR/BUILD/libdigidoc-3.10.2/build/libdigidoc /tmp/B.TBk3hR/BUILD/libdigidoc-3.10.2/build/libdigidoc/CMakeFiles/digidoc.dir/DependInfo.cmake --color= Scanning dependencies of target digidoc make[2]: Leaving directory '/tmp/B.TBk3hR/BUILD/libdigidoc-3.10.2/build' /usr/bin/make -f libdigidoc/CMakeFiles/digidoc.dir/build.make libdigidoc/CMakeFiles/digidoc.dir/build make[2]: Entering directory '/tmp/B.TBk3hR/BUILD/libdigidoc-3.10.2/build' [ 33%] Building C object libdigidoc/CMakeFiles/digidoc.dir/DigiDocDebug.c.o cd /tmp/B.TBk3hR/BUILD/libdigidoc-3.10.2/build/libdigidoc && /usr/bin/x86_64-pld-linux-gcc -DBUILD_DATE=\"14.09.2018\" -DBUILD_VER=0 -DDOMAINURL=\"ria.ee\" -DMAJOR_VER=3 -DMINOR_VER=10 -DORG=\"RIA\" -DRELEASE_VER=1 -DVER_SUFFIX=\"\" -Ddigidoc_EXPORTS -I/tmp/B.TBk3hR/BUILD/libdigidoc-3.10.2 -I/tmp/B.TBk3hR/BUILD/libdigidoc-3.10.2/build -I/usr/include/libxml2 -fvisibility=hidden -O2 -fwrapv -pipe -Wformat -Werror=format-security -gdwarf-4 -fno-debug-types-section -fvar-tracking-assignments -g2 -Wp,-D_FORTIFY_SOURCE=2 -fstack-protector-strong --param=ssp-buffer-size=4 -fPIC -march=x86-64 -gdwarf-4 -fno-debug-types-section -fvar-tracking-assignments -g2 -DNDEBUG -DQT_NO_DEBUG -fPIC -o CMakeFiles/digidoc.dir/DigiDocDebug.c.o -c /tmp/B.TBk3hR/BUILD/libdigidoc-3.10.2/libdigidoc/DigiDocDebug.c make[2]: Leaving directory '/tmp/B.TBk3hR/BUILD/libdigidoc-3.10.2/build' make[2]: Entering directory '/tmp/B.TBk3hR/BUILD/libdigidoc-3.10.2/build' [ 25%] Building C object libdigidoc/CMakeFiles/digidoc.dir/DigiDocObj.c.o cd /tmp/B.TBk3hR/BUILD/libdigidoc-3.10.2/build/libdigidoc && /usr/bin/x86_64-pld-linux-gcc -DBUILD_DATE=\"14.09.2018\" -DBUILD_VER=0 -DDOMAINURL=\"ria.ee\" -DMAJOR_VER=3 -DMINOR_VER=10 -DORG=\"RIA\" -DRELEASE_VER=1 -DVER_SUFFIX=\"\" -Ddigidoc_EXPORTS -I/tmp/B.TBk3hR/BUILD/libdigidoc-3.10.2 -I/tmp/B.TBk3hR/BUILD/libdigidoc-3.10.2/build -I/usr/include/libxml2 -fvisibility=hidden -O2 -fwrapv -pipe -Wformat -Werror=format-security -gdwarf-4 -fno-debug-types-section -fvar-tracking-assignments -g2 -Wp,-D_FORTIFY_SOURCE=2 -fstack-protector-strong --param=ssp-buffer-size=4 -fPIC -march=x86-64 -gdwarf-4 -fno-debug-types-section -fvar-tracking-assignments -g2 -DNDEBUG -DQT_NO_DEBUG -fPIC -o CMakeFiles/digidoc.dir/DigiDocObj.c.o -c /tmp/B.TBk3hR/BUILD/libdigidoc-3.10.2/libdigidoc/DigiDocObj.c /tmp/B.TBk3hR/BUILD/libdigidoc-3.10.2/libdigidoc/DigiDocObj.c: In function 'hasSignatureWithWrongDataFileHash': /tmp/B.TBk3hR/BUILD/libdigidoc-3.10.2/libdigidoc/DigiDocObj.c:3310:9: warning: 'verifiedByWrongDataFileHash' is deprecated [-Wdeprecated-declarations] j = verifiedByWrongDataFileHash(pSigInfo); ^ /tmp/B.TBk3hR/BUILD/libdigidoc-3.10.2/libdigidoc/DigiDocObj.c:3282:16: note: declared here EXP_OPTION int verifiedByWrongDataFileHash(const SignatureInfo* pSigInfo) ^~~~~~~~~~~~~~~~~~~~~~~~~~~ /tmp/B.TBk3hR/BUILD/libdigidoc-3.10.2/libdigidoc/DigiDocObj.c: In function 'ddocGetOcspRespIdTypeAndValue': /tmp/B.TBk3hR/BUILD/libdigidoc-3.10.2/libdigidoc/DigiDocObj.c:3708:14: error: dereferencing pointer to incomplete type 'OCSP_BASICRESP' {aka 'struct ocsp_basic_response_st'} switch(br->tbsResponseData->responderId->type) { ^~ /tmp/B.TBk3hR/BUILD/libdigidoc-3.10.2/libdigidoc/DigiDocObj.c: In function 'ddocNotInfo_GetThisUpdate': /tmp/B.TBk3hR/BUILD/libdigidoc-3.10.2/libdigidoc/DigiDocObj.c:3859:72: error: dereferencing pointer to incomplete type 'OCSP_SINGLERESP' {aka 'struct ocsp_single_response_st'} ddocDebug(3, "ddocNotInfo_GetThisUpdate", "This update: %s", single->thisUpdate); ^~ /tmp/B.TBk3hR/BUILD/libdigidoc-3.10.2/libdigidoc/DigiDocObj.c: In function 'ddocNotInfo_GetOcspRealDigest': /tmp/B.TBk3hR/BUILD/libdigidoc-3.10.2/libdigidoc/DigiDocObj.c:4054:44: error: dereferencing pointer to incomplete type 'X509_EXTENSION' {aka 'struct X509_extension_st'} int l1 = ASN1_STRING_length(ext->value); ^~ /tmp/B.TBk3hR/BUILD/libdigidoc-3.10.2/libdigidoc/DigiDocObj.c:4055:13: warning: 'ASN1_STRING_data' is deprecated [-Wdeprecated-declarations] p = ASN1_STRING_data(ext->value); ^ In file included from /usr/include/openssl/e_os2.h:13, from /usr/include/openssl/x509.h:14, from /tmp/B.TBk3hR/BUILD/libdigidoc-3.10.2/libdigidoc/DigiDocObj.h:27, from /tmp/B.TBk3hR/BUILD/libdigidoc-3.10.2/libdigidoc/DigiDocObj.c:23: /usr/include/openssl/asn1.h:554:1: note: declared here DEPRECATEDIN_1_1_0(unsigned char *ASN1_STRING_data(ASN1_STRING *x)) ^~~~~~~~~~~~~~~~~~ /tmp/B.TBk3hR/BUILD/libdigidoc-3.10.2/libdigidoc/DigiDocObj.c: In function 'calculateSignatureWithPkcs12': /tmp/B.TBk3hR/BUILD/libdigidoc-3.10.2/libdigidoc/DigiDocObj.c:4331:15: error: storage size of 'ctx' isn't known EVP_MD_CTX ctx; ^~~ /tmp/B.TBk3hR/BUILD/libdigidoc-3.10.2/libdigidoc/DigiDocObj.c: In function 'DataFile_new': /tmp/B.TBk3hR/BUILD/libdigidoc-3.10.2/libdigidoc/DigiDocObj.c:282:2: warning: ignoring return value of 'fgets', declared with attribute warn_unused_result [-Wunused-result] fgets(buf1, sizeof(buf1), hFile); ^~~~~~~~~~~~~~~~~~~~~~~~~~~~~~~~ make[2]: *** [libdigidoc/CMakeFiles/digidoc.dir/build.make:92: libdigidoc/CMakeFiles/digidoc.dir/DigiDocObj.c.o] Error 1 make[2]: Leaving directory '/tmp/B.TBk3hR/BUILD/libdigidoc-3.10.2/build' make[2]: *** Waiting for unfinished jobs.... make[2]: Entering directory '/tmp/B.TBk3hR/BUILD/libdigidoc-3.10.2/build' [ 20%] Building C object libdigidoc/CMakeFiles/digidoc.dir/DigiDocError.c.o cd /tmp/B.TBk3hR/BUILD/libdigidoc-3.10.2/build/libdigidoc && /usr/bin/x86_64-pld-linux-gcc -DBUILD_DATE=\"14.09.2018\" -DBUILD_VER=0 -DDOMAINURL=\"ria.ee\" -DMAJOR_VER=3 -DMINOR_VER=10 -DORG=\"RIA\" -DRELEASE_VER=1 -DVER_SUFFIX=\"\" -Ddigidoc_EXPORTS -I/tmp/B.TBk3hR/BUILD/libdigidoc-3.10.2 -I/tmp/B.TBk3hR/BUILD/libdigidoc-3.10.2/build -I/usr/include/libxml2 -fvisibility=hidden -O2 -fwrapv -pipe -Wformat -Werror=format-security -gdwarf-4 -fno-debug-types-section -fvar-tracking-assignments -g2 -Wp,-D_FORTIFY_SOURCE=2 -fstack-protector-strong --param=ssp-buffer-size=4 -fPIC -march=x86-64 -gdwarf-4 -fno-debug-types-section -fvar-tracking-assignments -g2 -DNDEBUG -DQT_NO_DEBUG -fPIC -o CMakeFiles/digidoc.dir/DigiDocError.c.o -c /tmp/B.TBk3hR/BUILD/libdigidoc-3.10.2/libdigidoc/DigiDocError.c make[2]: Leaving directory '/tmp/B.TBk3hR/BUILD/libdigidoc-3.10.2/build' make[2]: Entering directory '/tmp/B.TBk3hR/BUILD/libdigidoc-3.10.2/build' [ 37%] Building C object libdigidoc/CMakeFiles/digidoc.dir/DigiDocMem.c.o cd /tmp/B.TBk3hR/BUILD/libdigidoc-3.10.2/build/libdigidoc && /usr/bin/x86_64-pld-linux-gcc -DBUILD_DATE=\"14.09.2018\" -DBUILD_VER=0 -DDOMAINURL=\"ria.ee\" -DMAJOR_VER=3 -DMINOR_VER=10 -DORG=\"RIA\" -DRELEASE_VER=1 -DVER_SUFFIX=\"\" -Ddigidoc_EXPORTS -I/tmp/B.TBk3hR/BUILD/libdigidoc-3.10.2 -I/tmp/B.TBk3hR/BUILD/libdigidoc-3.10.2/build -I/usr/include/libxml2 -fvisibility=hidden -O2 -fwrapv -pipe -Wformat -Werror=format-security -gdwarf-4 -fno-debug-types-section -fvar-tracking-assignments -g2 -Wp,-D_FORTIFY_SOURCE=2 -fstack-protector-strong --param=ssp-buffer-size=4 -fPIC -march=x86-64 -gdwarf-4 -fno-debug-types-section -fvar-tracking-assignments -g2 -DNDEBUG -DQT_NO_DEBUG -fPIC -o CMakeFiles/digidoc.dir/DigiDocMem.c.o -c /tmp/B.TBk3hR/BUILD/libdigidoc-3.10.2/libdigidoc/DigiDocMem.c make[2]: Leaving directory '/tmp/B.TBk3hR/BUILD/libdigidoc-3.10.2/build' make[2]: Entering directory '/tmp/B.TBk3hR/BUILD/libdigidoc-3.10.2/build' [ 33%] Building C object libdigidoc/CMakeFiles/digidoc.dir/DigiDocSAXParser.c.o cd /tmp/B.TBk3hR/BUILD/libdigidoc-3.10.2/build/libdigidoc && /usr/bin/x86_64-pld-linux-gcc -DBUILD_DATE=\"14.09.2018\" -DBUILD_VER=0 -DDOMAINURL=\"ria.ee\" -DMAJOR_VER=3 -DMINOR_VER=10 -DORG=\"RIA\" -DRELEASE_VER=1 -DVER_SUFFIX=\"\" -Ddigidoc_EXPORTS -I/tmp/B.TBk3hR/BUILD/libdigidoc-3.10.2 -I/tmp/B.TBk3hR/BUILD/libdigidoc-3.10.2/build -I/usr/include/libxml2 -fvisibility=hidden -O2 -fwrapv -pipe -Wformat -Werror=format-security -gdwarf-4 -fno-debug-types-section -fvar-tracking-assignments -g2 -Wp,-D_FORTIFY_SOURCE=2 -fstack-protector-strong --param=ssp-buffer-size=4 -fPIC -march=x86-64 -gdwarf-4 -fno-debug-types-section -fvar-tracking-assignments -g2 -DNDEBUG -DQT_NO_DEBUG -fPIC -o CMakeFiles/digidoc.dir/DigiDocSAXParser.c.o -c /tmp/B.TBk3hR/BUILD/libdigidoc-3.10.2/libdigidoc/DigiDocSAXParser.c /tmp/B.TBk3hR/BUILD/libdigidoc-3.10.2/libdigidoc/DigiDocSAXParser.c:82:18: error: field 'ectx' has incomplete type EVP_ENCODE_CTX ectx; ^~~~ /tmp/B.TBk3hR/BUILD/libdigidoc-3.10.2/libdigidoc/DigiDocSAXParser.c: In function 'startElementHandler': /tmp/B.TBk3hR/BUILD/libdigidoc-3.10.2/libdigidoc/DigiDocSAXParser.c:1782:19: warning: implicit declaration of function 'validateElementPath'; did you mean 'xmlValidateElement'? [-Wimplicit-function-declaration] pctx->errcode = validateElementPath(pctx->eCurr); ^~~~~~~~~~~~~~~~~~~ xmlValidateElement /tmp/B.TBk3hR/BUILD/libdigidoc-3.10.2/libdigidoc/DigiDocSAXParser.c: In function 'charactersHandler': /tmp/B.TBk3hR/BUILD/libdigidoc-3.10.2/libdigidoc/DigiDocSAXParser.c:2081:23: warning: implicit declaration of function 'escapeTextNode'; did you mean 'escape2xmlsym'? [-Wimplicit-function-declaration] pctx->errcode = escapeTextNode((const char*)ch, len, &p); ^~~~~~~~~~~~~~ escape2xmlsym make[2]: *** [libdigidoc/CMakeFiles/digidoc.dir/build.make:157: libdigidoc/CMakeFiles/digidoc.dir/DigiDocSAXParser.c.o] Error 1 make[2]: Leaving directory '/tmp/B.TBk3hR/BUILD/libdigidoc-3.10.2/build' make[2]: Entering directory '/tmp/B.TBk3hR/BUILD/libdigidoc-3.10.2/build' [ 4%] Building C object libdigidoc/CMakeFiles/digidoc.dir/DigiDocLib.c.o cd /tmp/B.TBk3hR/BUILD/libdigidoc-3.10.2/build/libdigidoc && /usr/bin/x86_64-pld-linux-gcc -DBUILD_DATE=\"14.09.2018\" -DBUILD_VER=0 -DDOMAINURL=\"ria.ee\" -DMAJOR_VER=3 -DMINOR_VER=10 -DORG=\"RIA\" -DRELEASE_VER=1 -DVER_SUFFIX=\"\" -Ddigidoc_EXPORTS -I/tmp/B.TBk3hR/BUILD/libdigidoc-3.10.2 -I/tmp/B.TBk3hR/BUILD/libdigidoc-3.10.2/build -I/usr/include/libxml2 -fvisibility=hidden -O2 -fwrapv -pipe -Wformat -Werror=format-security -gdwarf-4 -fno-debug-types-section -fvar-tracking-assignments -g2 -Wp,-D_FORTIFY_SOURCE=2 -fstack-protector-strong --param=ssp-buffer-size=4 -fPIC -march=x86-64 -gdwarf-4 -fno-debug-types-section -fvar-tracking-assignments -g2 -DNDEBUG -DQT_NO_DEBUG -fPIC -o CMakeFiles/digidoc.dir/DigiDocLib.c.o -c /tmp/B.TBk3hR/BUILD/libdigidoc-3.10.2/libdigidoc/DigiDocLib.c /tmp/B.TBk3hR/BUILD/libdigidoc-3.10.2/libdigidoc/DigiDocLib.c: In function 'calculateFileSignature': /tmp/B.TBk3hR/BUILD/libdigidoc-3.10.2/libdigidoc/DigiDocLib.c:477:15: error: storage size of 'ctx' isn't known EVP_MD_CTX ctx; ^~~ /tmp/B.TBk3hR/BUILD/libdigidoc-3.10.2/libdigidoc/DigiDocLib.c: In function 'signData': /tmp/B.TBk3hR/BUILD/libdigidoc-3.10.2/libdigidoc/DigiDocLib.c:538:15: error: storage size of 'ctx' isn't known EVP_MD_CTX ctx; ^~~ /tmp/B.TBk3hR/BUILD/libdigidoc-3.10.2/libdigidoc/DigiDocLib.c: In function 'ddocPullUrl': /tmp/B.TBk3hR/BUILD/libdigidoc-3.10.2/libdigidoc/DigiDocLib.c:848:28: error: 'BIO_R_BAD_HOSTNAME_LOOKUP' undeclared (first use in this function); did you mean 'BIO_R_BAD_FOPEN_MODE'? if(ERR_GET_REASON(e) == BIO_R_BAD_HOSTNAME_LOOKUP || ^~~~~~~~~~~~~~~~~~~~~~~~~ BIO_R_BAD_FOPEN_MODE /tmp/B.TBk3hR/BUILD/libdigidoc-3.10.2/libdigidoc/DigiDocLib.c:848:28: note: each undeclared identifier is reported only once for each function it appears in /tmp/B.TBk3hR/BUILD/libdigidoc-3.10.2/libdigidoc/DigiDocLib.c:849:25: error: 'OCSP_R_SERVER_WRITE_ERROR' undeclared (first use in this function); did you mean 'OCSP_R_SERVER_RESPONSE_ERROR'? ERR_GET_REASON(e) == OCSP_R_SERVER_WRITE_ERROR) ^~~~~~~~~~~~~~~~~~~~~~~~~ OCSP_R_SERVER_RESPONSE_ERROR In file included from /tmp/B.TBk3hR/BUILD/libdigidoc-3.10.2/libdigidoc/DigiDocLib.c:86: /tmp/B.TBk3hR/BUILD/libdigidoc-3.10.2/libdigidoc/DigiDocLib.c: In function 'getFullFileName': /tmp/B.TBk3hR/BUILD/libdigidoc-3.10.2/libdigidoc/DigiDocDefs.h:64:19: warning: ignoring return value of 'getcwd', declared with attribute warn_unused_result [-Wunused-result] #define _getcwd getcwd /tmp/B.TBk3hR/BUILD/libdigidoc-3.10.2/libdigidoc/DigiDocLib.c:644:5: note: in expansion of macro '_getcwd' _getcwd(szDest, len); ^~~~~~~ make[2]: *** [libdigidoc/CMakeFiles/digidoc.dir/build.make:79: libdigidoc/CMakeFiles/digidoc.dir/DigiDocLib.c.o] Error 1 make[2]: Leaving directory '/tmp/B.TBk3hR/BUILD/libdigidoc-3.10.2/build' make[2]: Entering directory '/tmp/B.TBk3hR/BUILD/libdigidoc-3.10.2/build' [ 41%] Building C object libdigidoc/CMakeFiles/digidoc.dir/DigiDocStack.c.o cd /tmp/B.TBk3hR/BUILD/libdigidoc-3.10.2/build/libdigidoc && /usr/bin/x86_64-pld-linux-gcc -DBUILD_DATE=\"14.09.2018\" -DBUILD_VER=0 -DDOMAINURL=\"ria.ee\" -DMAJOR_VER=3 -DMINOR_VER=10 -DORG=\"RIA\" -DRELEASE_VER=1 -DVER_SUFFIX=\"\" -Ddigidoc_EXPORTS -I/tmp/B.TBk3hR/BUILD/libdigidoc-3.10.2 -I/tmp/B.TBk3hR/BUILD/libdigidoc-3.10.2/build -I/usr/include/libxml2 -fvisibility=hidden -O2 -fwrapv -pipe -Wformat -Werror=format-security -gdwarf-4 -fno-debug-types-section -fvar-tracking-assignments -g2 -Wp,-D_FORTIFY_SOURCE=2 -fstack-protector-strong --param=ssp-buffer-size=4 -fPIC -march=x86-64 -gdwarf-4 -fno-debug-types-section -fvar-tracking-assignments -g2 -DNDEBUG -DQT_NO_DEBUG -fPIC -o CMakeFiles/digidoc.dir/DigiDocStack.c.o -c /tmp/B.TBk3hR/BUILD/libdigidoc-3.10.2/libdigidoc/DigiDocStack.c make[2]: Leaving directory '/tmp/B.TBk3hR/BUILD/libdigidoc-3.10.2/build' make[2]: Entering directory '/tmp/B.TBk3hR/BUILD/libdigidoc-3.10.2/build' [ 8%] Building C object libdigidoc/CMakeFiles/digidoc.dir/DigiDocPKCS11.c.o cd /tmp/B.TBk3hR/BUILD/libdigidoc-3.10.2/build/libdigidoc && /usr/bin/x86_64-pld-linux-gcc -DBUILD_DATE=\"14.09.2018\" -DBUILD_VER=0 -DDOMAINURL=\"ria.ee\" -DMAJOR_VER=3 -DMINOR_VER=10 -DORG=\"RIA\" -DRELEASE_VER=1 -DVER_SUFFIX=\"\" -Ddigidoc_EXPORTS -I/tmp/B.TBk3hR/BUILD/libdigidoc-3.10.2 -I/tmp/B.TBk3hR/BUILD/libdigidoc-3.10.2/build -I/usr/include/libxml2 -fvisibility=hidden -O2 -fwrapv -pipe -Wformat -Werror=format-security -gdwarf-4 -fno-debug-types-section -fvar-tracking-assignments -g2 -Wp,-D_FORTIFY_SOURCE=2 -fstack-protector-strong --param=ssp-buffer-size=4 -fPIC -march=x86-64 -gdwarf-4 -fno-debug-types-section -fvar-tracking-assignments -g2 -DNDEBUG -DQT_NO_DEBUG -fPIC -o CMakeFiles/digidoc.dir/DigiDocPKCS11.c.o -c /tmp/B.TBk3hR/BUILD/libdigidoc-3.10.2/libdigidoc/DigiDocPKCS11.c make[2]: Leaving directory '/tmp/B.TBk3hR/BUILD/libdigidoc-3.10.2/build' make[2]: Entering directory '/tmp/B.TBk3hR/BUILD/libdigidoc-3.10.2/build' [ 20%] Building C object libdigidoc/CMakeFiles/digidoc.dir/DigiDocParser.c.o cd /tmp/B.TBk3hR/BUILD/libdigidoc-3.10.2/build/libdigidoc && /usr/bin/x86_64-pld-linux-gcc -DBUILD_DATE=\"14.09.2018\" -DBUILD_VER=0 -DDOMAINURL=\"ria.ee\" -DMAJOR_VER=3 -DMINOR_VER=10 -DORG=\"RIA\" -DRELEASE_VER=1 -DVER_SUFFIX=\"\" -Ddigidoc_EXPORTS -I/tmp/B.TBk3hR/BUILD/libdigidoc-3.10.2 -I/tmp/B.TBk3hR/BUILD/libdigidoc-3.10.2/build -I/usr/include/libxml2 -fvisibility=hidden -O2 -fwrapv -pipe -Wformat -Werror=format-security -gdwarf-4 -fno-debug-types-section -fvar-tracking-assignments -g2 -Wp,-D_FORTIFY_SOURCE=2 -fstack-protector-strong --param=ssp-buffer-size=4 -fPIC -march=x86-64 -gdwarf-4 -fno-debug-types-section -fvar-tracking-assignments -g2 -DNDEBUG -DQT_NO_DEBUG -fPIC -o CMakeFiles/digidoc.dir/DigiDocParser.c.o -c /tmp/B.TBk3hR/BUILD/libdigidoc-3.10.2/libdigidoc/DigiDocParser.c make[2]: Leaving directory '/tmp/B.TBk3hR/BUILD/libdigidoc-3.10.2/build' make[2]: Entering directory '/tmp/B.TBk3hR/BUILD/libdigidoc-3.10.2/build' [ 12%] Building C object libdigidoc/CMakeFiles/digidoc.dir/DigiDocConfig.c.o cd /tmp/B.TBk3hR/BUILD/libdigidoc-3.10.2/build/libdigidoc && /usr/bin/x86_64-pld-linux-gcc -DBUILD_DATE=\"14.09.2018\" -DBUILD_VER=0 -DDOMAINURL=\"ria.ee\" -DMAJOR_VER=3 -DMINOR_VER=10 -DORG=\"RIA\" -DRELEASE_VER=1 -DVER_SUFFIX=\"\" -Ddigidoc_EXPORTS -I/tmp/B.TBk3hR/BUILD/libdigidoc-3.10.2 -I/tmp/B.TBk3hR/BUILD/libdigidoc-3.10.2/build -I/usr/include/libxml2 -fvisibility=hidden -O2 -fwrapv -pipe -Wformat -Werror=format-security -gdwarf-4 -fno-debug-types-section -fvar-tracking-assignments -g2 -Wp,-D_FORTIFY_SOURCE=2 -fstack-protector-strong --param=ssp-buffer-size=4 -fPIC -march=x86-64 -gdwarf-4 -fno-debug-types-section -fvar-tracking-assignments -g2 -DNDEBUG -DQT_NO_DEBUG -fPIC -o CMakeFiles/digidoc.dir/DigiDocConfig.c.o -c /tmp/B.TBk3hR/BUILD/libdigidoc-3.10.2/libdigidoc/DigiDocConfig.c make[2]: Leaving directory '/tmp/B.TBk3hR/BUILD/libdigidoc-3.10.2/build' make[1]: *** [CMakeFiles/Makefile2:128: libdigidoc/CMakeFiles/digidoc.dir/all] Error 2 make: *** [Makefile:133: all] Error 2 error: Bad exit status from /tmp/B.TBk3hR/BUILD/tmp/rpm-tmp.66765 (%build) RPM build errors: Bad exit status from /tmp/B.TBk3hR/BUILD/tmp/rpm-tmp.66765 (%build) ended at: Fri Sep 14 20:14:06 2018, done in 0:00:02.206796 error: No files produced. mesg: ttyname failed: Inappropriate ioctl for device + chmod -R u+rwX /tmp/B.TBk3hR/BUILD + rm -rf /tmp/B.TBk3hR/tmp /tmp/B.TBk3hR/BUILD mesg: ttyname failed: Inappropriate ioctl for device + rm -rf /tmp/B.TBk3hR Begin-PLD-Builder-Info Build-Time: user:4.59s sys:0.96s real:4.99s (faults io:0 non-io:306736) End-PLD-Builder-Info
[Back to list of logs] [View rpm -qa of builder]