FailedOk

th/SRPMS[OK]
th/x32[OK]
th/i686[OK]
th/x86_64[OK]

ac/SRPMS[OK]
ac/i386[OK]
ac/i586[OK]
ac/i686[OK]
ac/alpha[OK]
ac/amd64[OK]
ac/athlon[OK]
ac/ppc[OK]
ac/sparc[OK]
ac/sparc64[OK]

Advanced Search
main()
Powered by PLD Linux
(c) 2002-2018 PLD Team
$Revision: 1.37 $
Powered by brain.
Your IP: 54.82.93.116

libdomainkeys 6dc3445f-422b-4c55-b968-cf0c49b58304

Status:Failed
Source URL:ftp://buildlogs.pld-linux.org/th/x86_64/FAIL/libdomainkeys,6dc3445f-422b-4c55-b968-cf0c49b58304.bz2
text/plain URL:View!
full text:View!
rpm -qa of builder:View!
Date:2018/09/14 20:14:15
Runtime:0:00:00.536739

Toc:

  • error 1
  • domainkeys.c:123:14: error: field 'mdctx' has incomplete type
  • error 2
  • error: Bad exit status from /tmp/B.uyokO2/BUILD/tmp/rpm-tmp.92054 (%build)
  • error 3
  • RPM build errors:
  • error 4
  • error: No files produced.

Content:

checking if we should skip the build
started at: Fri Sep 14 20:14:12 2018
killing old processes on a builder
mesg: ttyname failed: Inappropriate ioctl for device
sending signal 9 to pid -1
Killed
cleaning up /tmp
mesg: ttyname failed: Inappropriate ioctl for device
fetching https://srcbuilder.pld-linux.org/th//srpms/6dc3445f-422b-4c55-b968-cf0c49b58304/libdomainkeys-0.69-2.src.rpm
fetched 52304 bytes, 155.5 K/s
installing srpm: libdomainkeys-0.69-2.src.rpm
mesg: ttyname failed: Inappropriate ioctl for device
+ install -d /tmp/B.uyokO2/BUILD /tmp/B.uyokO2/RPMS
+ LC_ALL=en_US.UTF-8
+ rpm -qp --changelog libdomainkeys-0.69-2.src.rpm
* Fri Sep 14 2018 PLD Linux Team <feedback@pld-linux.org>
- For complete changelog see: http://git.pld-linux.org/?p=packages/libdomainkeys.git;a=log;h=master
* Fri Sep 14 2018 Arkadiusz Miśkiewicz <arekm@maven.pl> d95079b
- release 2 (by relup.sh) * Sun Nov 19 2017 Jakub Bogusz <qboosh@pld-linux.org> 917cf19
- updated to 0.69 - updated libtool patch, drop unnecessary libstdc++ dependency + rpm -Uhv --nodeps --define '_topdir /tmp/B.uyokO2' --define '_specdir %{_topdir}' --define '_sourcedir %{_specdir}' --define '_rpmdir %{_topdir}/RPMS' --define '_builddir %{_topdir}/BUILD' libdomainkeys-0.69-2.src.rpm Preparing... ################################################## libdomainkeys ################################################## + rm -f libdomainkeys-0.69-2.src.rpm mesg: ttyname failed: Inappropriate ioctl for device + install -m 700 -d /tmp/B.uyokO2/BUILD/tmp mesg: ttyname failed: Inappropriate ioctl for device + TMPDIR=/tmp/B.uyokO2/BUILD/tmp + exec nice -n 0 rpmbuild -bp --short-circuit --nodeps --define '_topdir /tmp/B.uyokO2' --define '_specdir %{_topdir}' --define '_sourcedir %{_specdir}' --define '_rpmdir %{_topdir}/RPMS' --define '_builddir %{_topdir}/BUILD' --target x86_64-pld-linux --define 'prep exit 0' /tmp/B.uyokO2/libdomainkeys.spec Building target platforms: x86_64-pld-linux checking BuildConflict-ing packages no BuildConflicts found checking BR rpm: Building target platforms: x86_64-pld-linux no BR needed building RPM using: set -ex; : build-id: 6dc3445f-422b-4c55-b968-cf0c49b58304; TMPDIR=/tmp/B.uyokO2/BUILD/tmp exec nice -n 0 rpmbuild -bb --define '_smp_mflags -j9' --define '_make_opts -Otarget' --define '_pld_builder 1' --define '_topdir /tmp/B.uyokO2' --define '_specdir %{_topdir}' --define '_sourcedir %{_specdir}' --define '_rpmdir %{_topdir}/RPMS' --define '_builddir %{_topdir}/BUILD' --target x86_64-pld-linux /tmp/B.uyokO2/libdomainkeys.spec mesg: ttyname failed: Inappropriate ioctl for device + : build-id: 6dc3445f-422b-4c55-b968-cf0c49b58304 + TMPDIR=/tmp/B.uyokO2/BUILD/tmp + exec nice -n 0 rpmbuild -bb --define '_smp_mflags -j9' --define '_make_opts -Otarget' --define '_pld_builder 1' --define '_topdir /tmp/B.uyokO2' --define '_specdir %{_topdir}' --define '_sourcedir %{_specdir}' --define '_rpmdir %{_topdir}/RPMS' --define '_builddir %{_topdir}/BUILD' --target x86_64-pld-linux /tmp/B.uyokO2/libdomainkeys.spec Building target platforms: x86_64-pld-linux Executing(%prep): /bin/sh -e /tmp/B.uyokO2/BUILD/tmp/rpm-tmp.92054 + umask 022 + cd /tmp/B.uyokO2/BUILD + cd /tmp/B.uyokO2/BUILD + rm -rf libdomainkeys-0.69 + /usr/bin/gzip -dc /tmp/B.uyokO2/libdomainkeys-0.69.tar.gz + /bin/tar -xf - + STATUS=0 + '[' 0 -ne 0 ']' + cd libdomainkeys-0.69 + /bin/id -u + '[' 1000 '=' 0 ']' + /bin/id -u + '[' 1000 '=' 0 ']' + /bin/chmod -Rf a+rX,u+w,g-w,o-w . + echo 'Patch #0 (libdomainkeys-libtool.patch):' Patch #0 (libdomainkeys-libtool.patch): + '[' -f /tmp/B.uyokO2/libdomainkeys-libtool.patch ']' + /bin/cat /tmp/B.uyokO2/libdomainkeys-libtool.patch + /usr/bin/patch -s -p1 + echo 'Patch #1 (libdomainkeys-segv.patch):' Patch #1 (libdomainkeys-segv.patch): + '[' -f /tmp/B.uyokO2/libdomainkeys-segv.patch ']' + /bin/cat /tmp/B.uyokO2/libdomainkeys-segv.patch + /usr/bin/patch -s -p1 + echo 'Patch #2 (libdomainkeys-dknewkey.patch):' Patch #2 (libdomainkeys-dknewkey.patch): + '[' -f /tmp/B.uyokO2/libdomainkeys-dknewkey.patch ']' + /bin/cat /tmp/B.uyokO2/libdomainkeys-dknewkey.patch + /usr/bin/patch -s -p1 + exit 0 Executing(%build): /bin/sh -e /tmp/B.uyokO2/BUILD/tmp/rpm-tmp.92054 TMP=/home/users/builder/tmp HOME=/home/users/builder PATH=/home/users/builder/GNUstep/Tools:/usr/local/bin:/usr/bin:/bin:/home/users/builder/bin TMPDIR=/tmp/B.uyokO2/BUILD/tmp + umask 022 + cd /tmp/B.uyokO2/BUILD + cd libdomainkeys-0.69 + /usr/bin/make -Otarget -j9 'CC=x86_64-pld-linux-gcc' 'CFLAGS=-O2 -fwrapv -pipe -Wformat -Werror=format-security -gdwarf-4 -fno-debug-types-section -fvar-tracking-assignments -g2 -Wp,-D_FORTIFY_SOURCE=2 -fstack-protector-strong --param=ssp-buffer-size=4 -fPIC -march=x86-64 -gdwarf-4 -fno-debug-types-section -fvar-tracking-assignments -g2 -DBIND_8_COMPAT' 'LDFLAGS=-Wl,--as-needed -Wl,--no-copy-dt-needed-entries -Wl,-z,relro -Wl,-z,combreloc ' x86_64-pld-linux-gcc -O2 -fwrapv -pipe -Wformat -Werror=format-security -gdwarf-4 -fno-debug-types-section -fvar-tracking-assignments -g2 -Wp,-D_FORTIFY_SOURCE=2 -fstack-protector-strong --param=ssp-buffer-size=4 -fPIC -march=x86-64 -gdwarf-4 -fno-debug-types-section -fvar-tracking-assignments -g2 -DBIND_8_COMPAT -o makeheader makeheader.c ./makeheader <domainkeys.c >domainkeys.h libtool --mode=compile --tag=CC x86_64-pld-linux-gcc -O2 -fwrapv -pipe -Wformat -Werror=format-security -gdwarf-4 -fno-debug-types-section -fvar-tracking-assignments -g2 -Wp,-D_FORTIFY_SOURCE=2 -fstack-protector-strong --param=ssp-buffer-size=4 -fPIC -march=x86-64 -gdwarf-4 -fno-debug-types-section -fvar-tracking-assignments -g2 -DBIND_8_COMPAT -c domainkeys.c -o domainkeys.lo -I. libtool: compile: x86_64-pld-linux-gcc -O2 -fwrapv -pipe -Wformat -Werror=format-security -gdwarf-4 -fno-debug-types-section -fvar-tracking-assignments -g2 -Wp,-D_FORTIFY_SOURCE=2 -fstack-protector-strong --param=ssp-buffer-size=4 -fPIC -march=x86-64 -gdwarf-4 -fno-debug-types-section -fvar-tracking-assignments -g2 -DBIND_8_COMPAT -c domainkeys.c -I. -fPIC -DPIC -o .libs/domainkeys.o domainkeys.c:123:14: error: field 'mdctx' has incomplete type EVP_MD_CTX mdctx; /* the hash */ ^~~~~ domainkeys.c: In function 'dkheaders': domainkeys.c:1285:5: warning: cast to pointer from integer of different size [-Wint-to-pointer-cast] (void *)dk_headers(dk, dk->headers); ^ domainkeys.c: In function 'dk_free': domainkeys.c:2158:3: warning: implicit declaration of function 'EVP_MD_CTX_cleanup'; did you mean 'EVP_MD_CTX_create'? [-Wimplicit-function-declaration] EVP_MD_CTX_cleanup(&dk->mdctx); ^~~~~~~~~~~~~~~~~~ EVP_MD_CTX_create domainkeys.c:2165:6: warning: 'ERR_remove_state' is deprecated [-Wdeprecated-declarations] ERR_remove_state(0); ^~~~~~~~~~~~~~~~ In file included from /usr/include/openssl/evp.h:13, from domainkeys.c:27: /usr/include/openssl/err.h:260:1: note: declared here DEPRECATEDIN_1_0_0(void ERR_remove_state(unsigned long pid)) ^~~~~~~~~~~~~~~~~~ make: *** [Makefile:24: domainkeys.lo] Error 1 make: *** Waiting for unfinished jobs.... libtool --mode=compile --tag=CC x86_64-pld-linux-gcc -O2 -fwrapv -pipe -Wformat -Werror=format-security -gdwarf-4 -fno-debug-types-section -fvar-tracking-assignments -g2 -Wp,-D_FORTIFY_SOURCE=2 -fstack-protector-strong --param=ssp-buffer-size=4 -fPIC -march=x86-64 -gdwarf-4 -fno-debug-types-section -fvar-tracking-assignments -g2 -DBIND_8_COMPAT -c dns_txt.c -o dns_txt.lo -I. libtool: compile: x86_64-pld-linux-gcc -O2 -fwrapv -pipe -Wformat -Werror=format-security -gdwarf-4 -fno-debug-types-section -fvar-tracking-assignments -g2 -Wp,-D_FORTIFY_SOURCE=2 -fstack-protector-strong --param=ssp-buffer-size=4 -fPIC -march=x86-64 -gdwarf-4 -fno-debug-types-section -fvar-tracking-assignments -g2 -DBIND_8_COMPAT -c dns_txt.c -I. -fPIC -DPIC -o .libs/dns_txt.o libtool: compile: x86_64-pld-linux-gcc -O2 -fwrapv -pipe -Wformat -Werror=format-security -gdwarf-4 -fno-debug-types-section -fvar-tracking-assignments -g2 -Wp,-D_FORTIFY_SOURCE=2 -fstack-protector-strong --param=ssp-buffer-size=4 -fPIC -march=x86-64 -gdwarf-4 -fno-debug-types-section -fvar-tracking-assignments -g2 -DBIND_8_COMPAT -c dns_txt.c -I. -o dns_txt.o >/dev/null 2>&1 libtool --mode=compile --tag=CC x86_64-pld-linux-gcc -O2 -fwrapv -pipe -Wformat -Werror=format-security -gdwarf-4 -fno-debug-types-section -fvar-tracking-assignments -g2 -Wp,-D_FORTIFY_SOURCE=2 -fstack-protector-strong --param=ssp-buffer-size=4 -fPIC -march=x86-64 -gdwarf-4 -fno-debug-types-section -fvar-tracking-assignments -g2 -DBIND_8_COMPAT -c dktrace.c -o dktrace.lo -I. libtool: compile: x86_64-pld-linux-gcc -O2 -fwrapv -pipe -Wformat -Werror=format-security -gdwarf-4 -fno-debug-types-section -fvar-tracking-assignments -g2 -Wp,-D_FORTIFY_SOURCE=2 -fstack-protector-strong --param=ssp-buffer-size=4 -fPIC -march=x86-64 -gdwarf-4 -fno-debug-types-section -fvar-tracking-assignments -g2 -DBIND_8_COMPAT -c dktrace.c -I. -fPIC -DPIC -o .libs/dktrace.o libtool: compile: x86_64-pld-linux-gcc -O2 -fwrapv -pipe -Wformat -Werror=format-security -gdwarf-4 -fno-debug-types-section -fvar-tracking-assignments -g2 -Wp,-D_FORTIFY_SOURCE=2 -fstack-protector-strong --param=ssp-buffer-size=4 -fPIC -march=x86-64 -gdwarf-4 -fno-debug-types-section -fvar-tracking-assignments -g2 -DBIND_8_COMPAT -c dktrace.c -I. -o dktrace.o >/dev/null 2>&1 x86_64-pld-linux-gcc -O2 -fwrapv -pipe -Wformat -Werror=format-security -gdwarf-4 -fno-debug-types-section -fvar-tracking-assignments -g2 -Wp,-D_FORTIFY_SOURCE=2 -fstack-protector-strong --param=ssp-buffer-size=4 -fPIC -march=x86-64 -gdwarf-4 -fno-debug-types-section -fvar-tracking-assignments -g2 -DBIND_8_COMPAT -c dktest.c -I. dktest.c: In function 'main': dktest.c:288:14: warning: format '%d' expects argument of type 'int', but argument 2 has type 'size_t' {aka 'long unsigned int'} [-Wformat=] printf("%d %d\n",dk_siglen(privkey), strlen(advice)); /* TC39 */ ~^ ~~~~~~~~~~~~~~~~~~ %ld dktest.c:288:17: warning: format '%d' expects argument of type 'int', but argument 3 has type 'size_t' {aka 'long unsigned int'} [-Wformat=] printf("%d %d\n",dk_siglen(privkey), strlen(advice)); /* TC39 */ ~^ ~~~~~~~~~~~~~~ %ld error: Bad exit status from /tmp/B.uyokO2/BUILD/tmp/rpm-tmp.92054 (%build) RPM build errors: Bad exit status from /tmp/B.uyokO2/BUILD/tmp/rpm-tmp.92054 (%build) ended at: Fri Sep 14 20:14:15 2018, done in 0:00:00.536739 error: No files produced. mesg: ttyname failed: Inappropriate ioctl for device + chmod -R u+rwX /tmp/B.uyokO2/BUILD + rm -rf /tmp/B.uyokO2/tmp /tmp/B.uyokO2/BUILD mesg: ttyname failed: Inappropriate ioctl for device + rm -rf /tmp/B.uyokO2 Begin-PLD-Builder-Info Build-Time: user:2.53s sys:0.38s real:3.56s (faults io:0 non-io:171794) End-PLD-Builder-Info
[Back to list of logs] [View rpm -qa of builder]