FailedOk

th/SRPMS[OK]
th/x32[OK]
th/i686[OK]
th/x86_64[OK]

ac/SRPMS[OK]
ac/i386[OK]
ac/i586[OK]
ac/i686[OK]
ac/alpha[OK]
ac/amd64[OK]
ac/athlon[OK]
ac/ppc[OK]
ac/sparc[OK]
ac/sparc64[OK]

Advanced Search
main()
Powered by PLD Linux
(c) 2002-2019 PLD Team
$Revision: 1.37 $
Powered by ufo.
Your IP: 100.24.209.47

libextractor 7d36b3cb-a847-421a-aeaf-bc91ea8b3b39

Status:Failed
Source URL:ftp://buildlogs.pld-linux.org/th/x86_64/FAIL/libextractor,7d36b3cb-a847-421a-aeaf-bc91ea8b3b39.bz2
text/plain URL:View!
full text:View!
rpm -qa of builder:View!
Date:2019/02/10 11:57:04
Runtime:0:00:29.029164

Toc:

  • error 1
  • exiv2_extractor.cc:183:40: error: missing binary operator before token "("
  • error 2
  • exiv2_extractor.cc:452:40: error: missing binary operator before token "("
  • error 3
  • exiv2_extractor.cc:700:23: error: missing binary operator before token "("
  • error 4
  • exiv2_extractor.cc:186:20: error: conflicting return type specified for 'virtual long int ExtractorIO::size() const'
  • error 5
  • exiv2_extractor.cc:319:55: error: no matching function for call to 'Exiv2::BasicError<char>::BasicError(int)'
  • error 6
  • exiv2_extractor.cc:319:55: error: invalid conversion from 'int' to 'Exiv2::ErrorCode' [-fpermissive]
  • error 7
  • exiv2_extractor.cc:374:53: error: no matching function for call to 'Exiv2::BasicError<char>::BasicError(int)'
  • error 8
  • exiv2_extractor.cc:374:53: error: invalid conversion from 'int' to 'Exiv2::ErrorCode' [-fpermissive]
  • error 9
  • exiv2_extractor.cc:419:53: error: no matching function for call to 'Exiv2::BasicError<char>::BasicError(int)'
  • error 10
  • exiv2_extractor.cc:419:53: error: invalid conversion from 'int' to 'Exiv2::ErrorCode' [-fpermissive]
  • error 11
  • exiv2_extractor.cc:507:53: error: no matching function for call to 'Exiv2::BasicError<char>::BasicError(int)'
  • error 12
  • exiv2_extractor.cc:507:53: error: invalid conversion from 'int' to 'Exiv2::ErrorCode' [-fpermissive]
  • error 13
  • exiv2_extractor.cc:534:53: error: no matching function for call to 'Exiv2::BasicError<char>::BasicError(int)'
  • error 14
  • exiv2_extractor.cc:534:53: error: invalid conversion from 'int' to 'Exiv2::ErrorCode' [-fpermissive]
  • error 15
  • make[4]: *** [Makefile:2326: exiv2_extractor.lo] Error 1
  • error 16
  • make[3]: *** [Makefile:2345: all-recursive] Error 1
  • error 17
  • make[2]: *** [Makefile:428: all-recursive] Error 1
  • error 18
  • make[1]: *** [Makefile:548: all-recursive] Error 1
  • error 19
  • error: Bad exit status from /tmp/B.kCwTuV/BUILD/tmp/rpm-tmp.59445 (%build)
  • error 20
  • RPM build errors:
  • error 21
  • error: No files produced.

Content:

 void av_free_packet(AVPacket *pkt);
      ^~~~~~~~~~~~~~
thumbnailffmpeg_extractor.c: In function 'extract_image':
thumbnailffmpeg_extractor.c:544:7: warning: 'avcodec_decode_video2' is deprecated [-Wdeprecated-declarations]
       avcodec_decode_video2 (codec_ctx, frame, &frame_finished, &avpkt);
       ^~~~~~~~~~~~~~~~~~~~~
In file included from /usr/include/libavformat/avformat.h:319,
                 from thumbnailffmpeg_extractor.c:47:
/usr/include/libavcodec/avcodec.h:4771:5: note: declared here
 int avcodec_decode_video2(AVCodecContext *avctx, AVFrame *picture,
     ^~~~~~~~~~~~~~~~~~~~~
thumbnailffmpeg_extractor.c: In function 'extract_video':
thumbnailffmpeg_extractor.c:672:7: warning: 'codec' is deprecated [-Wdeprecated-declarations]
       codec_ctx = format_ctx->streams[i]->codec;
       ^~~~~~~~~
In file included from thumbnailffmpeg_extractor.c:47:
/usr/include/libavformat/avformat.h:878:21: note: declared here
     AVCodecContext *codec;
                     ^~~~~
thumbnailffmpeg_extractor.c:751:11: warning: 'avcodec_decode_video2' is deprecated [-Wdeprecated-declarations]
           avcodec_decode_video2 (codec_ctx,
           ^~~~~~~~~~~~~~~~~~~~~
In file included from /usr/include/libavformat/avformat.h:319,
                 from thumbnailffmpeg_extractor.c:47:
/usr/include/libavcodec/avcodec.h:4771:5: note: declared here
 int avcodec_decode_video2(AVCodecContext *avctx, AVFrame *picture,
     ^~~~~~~~~~~~~~~~~~~~~
thumbnailffmpeg_extractor.c:757:15: warning: 'av_free_packet' is deprecated [-Wdeprecated-declarations]
               av_free_packet (&packet);
               ^~~~~~~~~~~~~~
In file included from /usr/include/libavformat/avformat.h:319,
                 from thumbnailffmpeg_extractor.c:47:
/usr/include/libavcodec/avcodec.h:4416:6: note: declared here
 void av_free_packet(AVPacket *pkt);
      ^~~~~~~~~~~~~~
thumbnailffmpeg_extractor.c:761:7: warning: 'av_free_packet' is deprecated [-Wdeprecated-declarations]
       av_free_packet (&packet);
       ^~~~~~~~~~~~~~
In file included from /usr/include/libavformat/avformat.h:319,
                 from thumbnailffmpeg_extractor.c:47:
/usr/include/libavcodec/avcodec.h:4416:6: note: declared here
 void av_free_packet(AVPacket *pkt);
      ^~~~~~~~~~~~~~
thumbnailffmpeg_extractor.c: In function 'thumbnailffmpeg_lib_init':
thumbnailffmpeg_extractor.c:944:3: warning: 'av_register_all' is deprecated [-Wdeprecated-declarations]
   av_register_all ();
   ^~~~~~~~~~~~~~~
In file included from thumbnailffmpeg_extractor.c:47:
/usr/include/libavformat/avformat.h:2043:6: note: declared here
 void av_register_all(void);
      ^~~~~~~~~~~~~~~
libtool: compile:  x86_64-pld-linux-gcc -DHAVE_CONFIG_H -I. -I../.. -I../../src/include -I../../src/common -I/usr/include/rpm -O2 -fwrapv -pipe -Wformat -Werror=format-security -gdwarf-4 -fno-debug-types-section -fvar-tracking-assignments -g2 -Wp,-D_FORTIFY_SOURCE=2 -fstack-protector-strong --param=ssp-buffer-size=4 -fPIC -march=x86-64 -gdwarf-4 -fno-debug-types-section -fvar-tracking-assignments -g2 -MT thumbnailffmpeg_extractor.lo -MD -MP -MF .deps/thumbnailffmpeg_extractor.Tpo -c thumbnailffmpeg_extractor.c -o thumbnailffmpeg_extractor.o >/dev/null 2>&1
mv -f .deps/thumbnailffmpeg_extractor.Tpo .deps/thumbnailffmpeg_extractor.Plo
make[4]: Leaving directory '/tmp/B.kCwTuV/BUILD/libextractor-1.8/src/plugins'
make[4]: Entering directory '/tmp/B.kCwTuV/BUILD/libextractor-1.8/src/plugins'
/bin/sh ../../libtool  --tag=CC   --mode=compile x86_64-pld-linux-gcc -DHAVE_CONFIG_H -I. -I../..  -I../../src/include -I../../src/common -I/usr/include/rpm  -I/usr/include/glib-2.0 -I/usr/lib64/glib-2.0/include -O2 -fwrapv -pipe -Wformat -Werror=format-security -gdwarf-4 -fno-debug-types-section -fvar-tracking-assignments -g2 -Wp,-D_FORTIFY_SOURCE=2 -fstack-protector-strong --param=ssp-buffer-size=4 -fPIC -march=x86-64 -gdwarf-4 -fno-debug-types-section -fvar-tracking-assignments -g2  -MT libextractor_midi_la-midi_extractor.lo -MD -MP -MF .deps/libextractor_midi_la-midi_extractor.Tpo -c -o libextractor_midi_la-midi_extractor.lo `test -f 'midi_extractor.c' || echo './'`midi_extractor.c
libtool: compile:  x86_64-pld-linux-gcc -DHAVE_CONFIG_H -I. -I../.. -I../../src/include -I../../src/common -I/usr/include/rpm -I/usr/include/glib-2.0 -I/usr/lib64/glib-2.0/include -O2 -fwrapv -pipe -Wformat -Werror=format-security -gdwarf-4 -fno-debug-types-section -fvar-tracking-assignments -g2 -Wp,-D_FORTIFY_SOURCE=2 -fstack-protector-strong --param=ssp-buffer-size=4 -fPIC -march=x86-64 -gdwarf-4 -fno-debug-types-section -fvar-tracking-assignments -g2 -MT libextractor_midi_la-midi_extractor.lo -MD -MP -MF .deps/libextractor_midi_la-midi_extractor.Tpo -c midi_extractor.c  -fPIC -DPIC -o .libs/libextractor_midi_la-midi_extractor.o
libtool: compile:  x86_64-pld-linux-gcc -DHAVE_CONFIG_H -I. -I../.. -I../../src/include -I../../src/common -I/usr/include/rpm -I/usr/include/glib-2.0 -I/usr/lib64/glib-2.0/include -O2 -fwrapv -pipe -Wformat -Werror=format-security -gdwarf-4 -fno-debug-types-section -fvar-tracking-assignments -g2 -Wp,-D_FORTIFY_SOURCE=2 -fstack-protector-strong --param=ssp-buffer-size=4 -fPIC -march=x86-64 -gdwarf-4 -fno-debug-types-section -fvar-tracking-assignments -g2 -MT libextractor_midi_la-midi_extractor.lo -MD -MP -MF .deps/libextractor_midi_la-midi_extractor.Tpo -c midi_extractor.c -o libextractor_midi_la-midi_extractor.o >/dev/null 2>&1
mv -f .deps/libextractor_midi_la-midi_extractor.Tpo .deps/libextractor_midi_la-midi_extractor.Plo
make[4]: Leaving directory '/tmp/B.kCwTuV/BUILD/libextractor-1.8/src/plugins'
make[4]: Entering directory '/tmp/B.kCwTuV/BUILD/libextractor-1.8/src/plugins'
/bin/sh ../../libtool  --tag=CC   --mode=compile x86_64-pld-linux-gcc -DHAVE_CONFIG_H -I. -I../..  -I../../src/include -I../../src/common -I/usr/include/rpm   -O2 -fwrapv -pipe -Wformat -Werror=format-security -gdwarf-4 -fno-debug-types-section -fvar-tracking-assignments -g2 -Wp,-D_FORTIFY_SOURCE=2 -fstack-protector-strong --param=ssp-buffer-size=4 -fPIC -march=x86-64 -gdwarf-4 -fno-debug-types-section -fvar-tracking-assignments -g2  -MT mime_extractor.lo -MD -MP -MF .deps/mime_extractor.Tpo -c -o mime_extractor.lo mime_extractor.c
libtool: compile:  x86_64-pld-linux-gcc -DHAVE_CONFIG_H -I. -I../.. -I../../src/include -I../../src/common -I/usr/include/rpm -O2 -fwrapv -pipe -Wformat -Werror=format-security -gdwarf-4 -fno-debug-types-section -fvar-tracking-assignments -g2 -Wp,-D_FORTIFY_SOURCE=2 -fstack-protector-strong --param=ssp-buffer-size=4 -fPIC -march=x86-64 -gdwarf-4 -fno-debug-types-section -fvar-tracking-assignments -g2 -MT mime_extractor.lo -MD -MP -MF .deps/mime_extractor.Tpo -c mime_extractor.c  -fPIC -DPIC -o .libs/mime_extractor.o
libtool: compile:  x86_64-pld-linux-gcc -DHAVE_CONFIG_H -I. -I../.. -I../../src/include -I../../src/common -I/usr/include/rpm -O2 -fwrapv -pipe -Wformat -Werror=format-security -gdwarf-4 -fno-debug-types-section -fvar-tracking-assignments -g2 -Wp,-D_FORTIFY_SOURCE=2 -fstack-protector-strong --param=ssp-buffer-size=4 -fPIC -march=x86-64 -gdwarf-4 -fno-debug-types-section -fvar-tracking-assignments -g2 -MT mime_extractor.lo -MD -MP -MF .deps/mime_extractor.Tpo -c mime_extractor.c -o mime_extractor.o >/dev/null 2>&1
mv -f .deps/mime_extractor.Tpo .deps/mime_extractor.Plo
make[4]: Leaving directory '/tmp/B.kCwTuV/BUILD/libextractor-1.8/src/plugins'
make[4]: Entering directory '/tmp/B.kCwTuV/BUILD/libextractor-1.8/src/plugins'
/bin/sh ../../libtool  --tag=CC   --mode=compile x86_64-pld-linux-gcc -DHAVE_CONFIG_H -I. -I../..  -I../../src/include -I../../src/common -I/usr/include/rpm   -O2 -fwrapv -pipe -Wformat -Werror=format-security -gdwarf-4 -fno-debug-types-section -fvar-tracking-assignments -g2 -Wp,-D_FORTIFY_SOURCE=2 -fstack-protector-strong --param=ssp-buffer-size=4 -fPIC -march=x86-64 -gdwarf-4 -fno-debug-types-section -fvar-tracking-assignments -g2  -MT mp4_extractor.lo -MD -MP -MF .deps/mp4_extractor.Tpo -c -o mp4_extractor.lo mp4_extractor.c
libtool: compile:  x86_64-pld-linux-gcc -DHAVE_CONFIG_H -I. -I../.. -I../../src/include -I../../src/common -I/usr/include/rpm -O2 -fwrapv -pipe -Wformat -Werror=format-security -gdwarf-4 -fno-debug-types-section -fvar-tracking-assignments -g2 -Wp,-D_FORTIFY_SOURCE=2 -fstack-protector-strong --param=ssp-buffer-size=4 -fPIC -march=x86-64 -gdwarf-4 -fno-debug-types-section -fvar-tracking-assignments -g2 -MT mp4_extractor.lo -MD -MP -MF .deps/mp4_extractor.Tpo -c mp4_extractor.c  -fPIC -DPIC -o .libs/mp4_extractor.o
libtool: compile:  x86_64-pld-linux-gcc -DHAVE_CONFIG_H -I. -I../.. -I../../src/include -I../../src/common -I/usr/include/rpm -O2 -fwrapv -pipe -Wformat -Werror=format-security -gdwarf-4 -fno-debug-types-section -fvar-tracking-assignments -g2 -Wp,-D_FORTIFY_SOURCE=2 -fstack-protector-strong --param=ssp-buffer-size=4 -fPIC -march=x86-64 -gdwarf-4 -fno-debug-types-section -fvar-tracking-assignments -g2 -MT mp4_extractor.lo -MD -MP -MF .deps/mp4_extractor.Tpo -c mp4_extractor.c -o mp4_extractor.o >/dev/null 2>&1
mv -f .deps/mp4_extractor.Tpo .deps/mp4_extractor.Plo
make[4]: Leaving directory '/tmp/B.kCwTuV/BUILD/libextractor-1.8/src/plugins'
make[4]: Entering directory '/tmp/B.kCwTuV/BUILD/libextractor-1.8/src/plugins'
/bin/sh ../../libtool  --tag=CC   --mode=compile x86_64-pld-linux-gcc -DHAVE_CONFIG_H -I. -I../..  -I../../src/include -I../../src/common -I/usr/include/rpm  -pthread -I/usr/include/gdk-pixbuf-2.0 -I/usr/include/libmount -I/usr/include/blkid -I/usr/include/uuid -I/usr/include/glib-2.0 -I/usr/lib64/glib-2.0/include -O2 -fwrapv -pipe -Wformat -Werror=format-security -gdwarf-4 -fno-debug-types-section -fvar-tracking-assignments -g2 -Wp,-D_FORTIFY_SOURCE=2 -fstack-protector-strong --param=ssp-buffer-size=4 -fPIC -march=x86-64 -gdwarf-4 -fno-debug-types-section -fvar-tracking-assignments -g2  -MT libextractor_thumbnailgtk_la-thumbnailgtk_extractor.lo -MD -MP -MF .deps/libextractor_thumbnailgtk_la-thumbnailgtk_extractor.Tpo -c -o libextractor_thumbnailgtk_la-thumbnailgtk_extractor.lo `test -f 'thumbnailgtk_extractor.c' || echo './'`thumbnailgtk_extractor.c
libtool: compile:  x86_64-pld-linux-gcc -DHAVE_CONFIG_H -I. -I../.. -I../../src/include -I../../src/common -I/usr/include/rpm -pthread -I/usr/include/gdk-pixbuf-2.0 -I/usr/include/libmount -I/usr/include/blkid -I/usr/include/uuid -I/usr/include/glib-2.0 -I/usr/lib64/glib-2.0/include -O2 -fwrapv -pipe -Wformat -Werror=format-security -gdwarf-4 -fno-debug-types-section -fvar-tracking-assignments -g2 -Wp,-D_FORTIFY_SOURCE=2 -fstack-protector-strong --param=ssp-buffer-size=4 -fPIC -march=x86-64 -gdwarf-4 -fno-debug-types-section -fvar-tracking-assignments -g2 -MT libextractor_thumbnailgtk_la-thumbnailgtk_extractor.lo -MD -MP -MF .deps/libextractor_thumbnailgtk_la-thumbnailgtk_extractor.Tpo -c thumbnailgtk_extractor.c  -fPIC -DPIC -o .libs/libextractor_thumbnailgtk_la-thumbnailgtk_extractor.o
libtool: compile:  x86_64-pld-linux-gcc -DHAVE_CONFIG_H -I. -I../.. -I../../src/include -I../../src/common -I/usr/include/rpm -pthread -I/usr/include/gdk-pixbuf-2.0 -I/usr/include/libmount -I/usr/include/blkid -I/usr/include/uuid -I/usr/include/glib-2.0 -I/usr/lib64/glib-2.0/include -O2 -fwrapv -pipe -Wformat -Werror=format-security -gdwarf-4 -fno-debug-types-section -fvar-tracking-assignments -g2 -Wp,-D_FORTIFY_SOURCE=2 -fstack-protector-strong --param=ssp-buffer-size=4 -fPIC -march=x86-64 -gdwarf-4 -fno-debug-types-section -fvar-tracking-assignments -g2 -MT libextractor_thumbnailgtk_la-thumbnailgtk_extractor.lo -MD -MP -MF .deps/libextractor_thumbnailgtk_la-thumbnailgtk_extractor.Tpo -c thumbnailgtk_extractor.c -o libextractor_thumbnailgtk_la-thumbnailgtk_extractor.o >/dev/null 2>&1
mv -f .deps/libextractor_thumbnailgtk_la-thumbnailgtk_extractor.Tpo .deps/libextractor_thumbnailgtk_la-thumbnailgtk_extractor.Plo
make[4]: Leaving directory '/tmp/B.kCwTuV/BUILD/libextractor-1.8/src/plugins'
make[4]: Entering directory '/tmp/B.kCwTuV/BUILD/libextractor-1.8/src/plugins'
/bin/sh ../../libtool  --tag=CC   --mode=compile x86_64-pld-linux-gcc -DHAVE_CONFIG_H -I. -I../..  -I../../src/include -I../../src/common -I/usr/include/rpm   -O2 -fwrapv -pipe -Wformat -Werror=format-security -gdwarf-4 -fno-debug-types-section -fvar-tracking-assignments -g2 -Wp,-D_FORTIFY_SOURCE=2 -fstack-protector-strong --param=ssp-buffer-size=4 -fPIC -march=x86-64 -gdwarf-4 -fno-debug-types-section -fvar-tracking-assignments -g2  -MT mpeg_extractor.lo -MD -MP -MF .deps/mpeg_extractor.Tpo -c -o mpeg_extractor.lo mpeg_extractor.c
libtool: compile:  x86_64-pld-linux-gcc -DHAVE_CONFIG_H -I. -I../.. -I../../src/include -I../../src/common -I/usr/include/rpm -O2 -fwrapv -pipe -Wformat -Werror=format-security -gdwarf-4 -fno-debug-types-section -fvar-tracking-assignments -g2 -Wp,-D_FORTIFY_SOURCE=2 -fstack-protector-strong --param=ssp-buffer-size=4 -fPIC -march=x86-64 -gdwarf-4 -fno-debug-types-section -fvar-tracking-assignments -g2 -MT mpeg_extractor.lo -MD -MP -MF .deps/mpeg_extractor.Tpo -c mpeg_extractor.c  -fPIC -DPIC -o .libs/mpeg_extractor.o
libtool: compile:  x86_64-pld-linux-gcc -DHAVE_CONFIG_H -I. -I../.. -I../../src/include -I../../src/common -I/usr/include/rpm -O2 -fwrapv -pipe -Wformat -Werror=format-security -gdwarf-4 -fno-debug-types-section -fvar-tracking-assignments -g2 -Wp,-D_FORTIFY_SOURCE=2 -fstack-protector-strong --param=ssp-buffer-size=4 -fPIC -march=x86-64 -gdwarf-4 -fno-debug-types-section -fvar-tracking-assignments -g2 -MT mpeg_extractor.lo -MD -MP -MF .deps/mpeg_extractor.Tpo -c mpeg_extractor.c -o mpeg_extractor.o >/dev/null 2>&1
mv -f .deps/mpeg_extractor.Tpo .deps/mpeg_extractor.Plo
make[4]: Leaving directory '/tmp/B.kCwTuV/BUILD/libextractor-1.8/src/plugins'
make[4]: Entering directory '/tmp/B.kCwTuV/BUILD/libextractor-1.8/src/plugins'
/bin/sh ../../libtool  --tag=CC   --mode=compile x86_64-pld-linux-gcc -DHAVE_CONFIG_H -I. -I../..  -I../../src/include -I../../src/common -I/usr/include/rpm   -O2 -fwrapv -pipe -Wformat -Werror=format-security -gdwarf-4 -fno-debug-types-section -fvar-tracking-assignments -g2 -Wp,-D_FORTIFY_SOURCE=2 -fstack-protector-strong --param=ssp-buffer-size=4 -fPIC -march=x86-64 -gdwarf-4 -fno-debug-types-section -fvar-tracking-assignments -g2  -MT ogg_extractor.lo -MD -MP -MF .deps/ogg_extractor.Tpo -c -o ogg_extractor.lo ogg_extractor.c
libtool: compile:  x86_64-pld-linux-gcc -DHAVE_CONFIG_H -I. -I../.. -I../../src/include -I../../src/common -I/usr/include/rpm -O2 -fwrapv -pipe -Wformat -Werror=format-security -gdwarf-4 -fno-debug-types-section -fvar-tracking-assignments -g2 -Wp,-D_FORTIFY_SOURCE=2 -fstack-protector-strong --param=ssp-buffer-size=4 -fPIC -march=x86-64 -gdwarf-4 -fno-debug-types-section -fvar-tracking-assignments -g2 -MT ogg_extractor.lo -MD -MP -MF .deps/ogg_extractor.Tpo -c ogg_extractor.c  -fPIC -DPIC -o .libs/ogg_extractor.o
libtool: compile:  x86_64-pld-linux-gcc -DHAVE_CONFIG_H -I. -I../.. -I../../src/include -I../../src/common -I/usr/include/rpm -O2 -fwrapv -pipe -Wformat -Werror=format-security -gdwarf-4 -fno-debug-types-section -fvar-tracking-assignments -g2 -Wp,-D_FORTIFY_SOURCE=2 -fstack-protector-strong --param=ssp-buffer-size=4 -fPIC -march=x86-64 -gdwarf-4 -fno-debug-types-section -fvar-tracking-assignments -g2 -MT ogg_extractor.lo -MD -MP -MF .deps/ogg_extractor.Tpo -c ogg_extractor.c -o ogg_extractor.o >/dev/null 2>&1
mv -f .deps/ogg_extractor.Tpo .deps/ogg_extractor.Plo
make[4]: Leaving directory '/tmp/B.kCwTuV/BUILD/libextractor-1.8/src/plugins'
make[4]: Entering directory '/tmp/B.kCwTuV/BUILD/libextractor-1.8/src/plugins'
/bin/sh ../../libtool  --tag=CC   --mode=compile x86_64-pld-linux-gcc -DHAVE_CONFIG_H -I. -I../..  -I../../src/include -I../../src/common -I/usr/include/rpm   -O2 -fwrapv -pipe -Wformat -Werror=format-security -gdwarf-4 -fno-debug-types-section -fvar-tracking-assignments -g2 -Wp,-D_FORTIFY_SOURCE=2 -fstack-protector-strong --param=ssp-buffer-size=4 -fPIC -march=x86-64 -gdwarf-4 -fno-debug-types-section -fvar-tracking-assignments -g2  -MT pdf_extractor.lo -MD -MP -MF .deps/pdf_extractor.Tpo -c -o pdf_extractor.lo pdf_extractor.c
libtool: compile:  x86_64-pld-linux-gcc -DHAVE_CONFIG_H -I. -I../.. -I../../src/include -I../../src/common -I/usr/include/rpm -O2 -fwrapv -pipe -Wformat -Werror=format-security -gdwarf-4 -fno-debug-types-section -fvar-tracking-assignments -g2 -Wp,-D_FORTIFY_SOURCE=2 -fstack-protector-strong --param=ssp-buffer-size=4 -fPIC -march=x86-64 -gdwarf-4 -fno-debug-types-section -fvar-tracking-assignments -g2 -MT pdf_extractor.lo -MD -MP -MF .deps/pdf_extractor.Tpo -c pdf_extractor.c  -fPIC -DPIC -o .libs/pdf_extractor.o
libtool: compile:  x86_64-pld-linux-gcc -DHAVE_CONFIG_H -I. -I../.. -I../../src/include -I../../src/common -I/usr/include/rpm -O2 -fwrapv -pipe -Wformat -Werror=format-security -gdwarf-4 -fno-debug-types-section -fvar-tracking-assignments -g2 -Wp,-D_FORTIFY_SOURCE=2 -fstack-protector-strong --param=ssp-buffer-size=4 -fPIC -march=x86-64 -gdwarf-4 -fno-debug-types-section -fvar-tracking-assignments -g2 -MT pdf_extractor.lo -MD -MP -MF .deps/pdf_extractor.Tpo -c pdf_extractor.c -o pdf_extractor.o >/dev/null 2>&1
mv -f .deps/pdf_extractor.Tpo .deps/pdf_extractor.Plo
make[4]: Leaving directory '/tmp/B.kCwTuV/BUILD/libextractor-1.8/src/plugins'
make[4]: Entering directory '/tmp/B.kCwTuV/BUILD/libextractor-1.8/src/plugins'
/bin/sh ../../libtool  --tag=CXX   --mode=compile x86_64-pld-linux-g++ -DHAVE_CONFIG_H -I. -I../..  -I../../src/include -I../../src/common -I/usr/include/rpm   -O2 -fwrapv -pipe -Wformat -Werror=format-security -gdwarf-4 -fno-debug-types-section -fvar-tracking-assignments -g2 -Wp,-D_FORTIFY_SOURCE=2 -fstack-protector-strong --param=ssp-buffer-size=4 -fPIC -march=x86-64 -gdwarf-4 -fno-debug-types-section -fvar-tracking-assignments -g2  -MT exiv2_extractor.lo -MD -MP -MF .deps/exiv2_extractor.Tpo -c -o exiv2_extractor.lo exiv2_extractor.cc
libtool: compile:  x86_64-pld-linux-g++ -DHAVE_CONFIG_H -I. -I../.. -I../../src/include -I../../src/common -I/usr/include/rpm -O2 -fwrapv -pipe -Wformat -Werror=format-security -gdwarf-4 -fno-debug-types-section -fvar-tracking-assignments -g2 -Wp,-D_FORTIFY_SOURCE=2 -fstack-protector-strong --param=ssp-buffer-size=4 -fPIC -march=x86-64 -gdwarf-4 -fno-debug-types-section -fvar-tracking-assignments -g2 -MT exiv2_extractor.lo -MD -MP -MF .deps/exiv2_extractor.Tpo -c exiv2_extractor.cc  -fPIC -DPIC -o .libs/exiv2_extractor.o
exiv2_extractor.cc:183:40: error: missing binary operator before token "("
 #if EXIV2_VERSION >= EXIV2_MAKE_VERSION(0,26,0)
                                        ^
exiv2_extractor.cc:452:40: error: missing binary operator before token "("
 #if EXIV2_VERSION >= EXIV2_MAKE_VERSION(0,26,0)
                                        ^
exiv2_extractor.cc:700:23: error: missing binary operator before token "("
 #if EXIV2_MAKE_VERSION(0,23,0) <= EXIV2_VERSION
                       ^
exiv2_extractor.cc:186:20: error: conflicting return type specified for 'virtual long int ExtractorIO::size() const'
   virtual long int size (void) const;
                    ^~~~
In file included from /usr/include/exiv2/image.hpp:29,
                 from exiv2_extractor.cc:32:
/usr/include/exiv2/basicio.hpp:217:24: note: overridden function is 'virtual size_t Exiv2::BasicIo::size() const'
         virtual size_t size() const = 0;
                        ^~~~
exiv2_extractor.cc: In member function 'virtual int ExtractorIO::getb()':
exiv2_extractor.cc:319:55: error: no matching function for call to 'Exiv2::BasicError<char>::BasicError(int)'
     throw Exiv2::BasicError<char> (42 /* error code */);
                                                       ^
In file included from exiv2_extractor.cc:31:
/usr/include/exiv2/error.hpp:280:9: note: candidate: 'template<class A, class B, class C> Exiv2::BasicError<charT>::BasicError(Exiv2::ErrorCode, const A&, const B&, const C&)'
         BasicError(ErrorCode code, const A& arg1, const B& arg2, const C& arg3);
         ^~~~~~~~~~
/usr/include/exiv2/error.hpp:280:9: note:   template argument deduction/substitution failed:
exiv2_extractor.cc:319:55: note:   candidate expects 4 arguments, 1 provided
     throw Exiv2::BasicError<char> (42 /* error code */);
                                                       ^
In file included from exiv2_extractor.cc:31:
/usr/include/exiv2/error.hpp:276:9: note: candidate: 'template<class A, class B> Exiv2::BasicError<charT>::BasicError(Exiv2::ErrorCode, const A&, const B&)'
         BasicError(ErrorCode code, const A& arg1, const B& arg2);
         ^~~~~~~~~~
/usr/include/exiv2/error.hpp:276:9: note:   template argument deduction/substitution failed:
exiv2_extractor.cc:319:55: note:   candidate expects 3 arguments, 1 provided
     throw Exiv2::BasicError<char> (42 /* error code */);
                                                       ^
In file included from exiv2_extractor.cc:31:
/usr/include/exiv2/error.hpp:272:9: note: candidate: 'template<class A> Exiv2::BasicError<charT>::BasicError(Exiv2::ErrorCode, const A&)'
         BasicError(ErrorCode code, const A& arg1);
         ^~~~~~~~~~
/usr/include/exiv2/error.hpp:272:9: note:   template argument deduction/substitution failed:
exiv2_extractor.cc:319:55: note:   candidate expects 2 arguments, 1 provided
     throw Exiv2::BasicError<char> (42 /* error code */);
                                                       ^
In file included from exiv2_extractor.cc:31:
/usr/include/exiv2/error.hpp:336:5: note: candidate: 'Exiv2::BasicError<charT>::BasicError(Exiv2::ErrorCode) [with charT = char]' <near match>
     BasicError<charT>::BasicError(ErrorCode code)
     ^~~~~~~~~~~~~~~~~
/usr/include/exiv2/error.hpp:336:5: note:   conversion of argument 1 would be ill-formed:
exiv2_extractor.cc:319:55: error: invalid conversion from 'int' to 'Exiv2::ErrorCode' [-fpermissive]
     throw Exiv2::BasicError<char> (42 /* error code */);
                                                       ^
In file included from exiv2_extractor.cc:31:
/usr/include/exiv2/error.hpp:263:11: note: candidate: 'Exiv2::BasicError<char>::BasicError(const Exiv2::BasicError<char>&)'
     class BasicError : public AnyError {
           ^~~~~~~~~~
/usr/include/exiv2/error.hpp:263:11: note:   no known conversion for argument 1 from 'int' to 'const Exiv2::BasicError<char>&'
exiv2_extractor.cc: In member function 'virtual void ExtractorIO::transfer(Exiv2::BasicIo&)':
exiv2_extractor.cc:374:53: error: no matching function for call to 'Exiv2::BasicError<char>::BasicError(int)'
   throw Exiv2::BasicError<char> (42 /* error code */);
                                                     ^
In file included from exiv2_extractor.cc:31:
/usr/include/exiv2/error.hpp:280:9: note: candidate: 'template<class A, class B, class C> Exiv2::BasicError<charT>::BasicError(Exiv2::ErrorCode, const A&, const B&, const C&)'
         BasicError(ErrorCode code, const A& arg1, const B& arg2, const C& arg3);
         ^~~~~~~~~~
/usr/include/exiv2/error.hpp:280:9: note:   template argument deduction/substitution failed:
exiv2_extractor.cc:374:53: note:   candidate expects 4 arguments, 1 provided
   throw Exiv2::BasicError<char> (42 /* error code */);
                                                     ^
In file included from exiv2_extractor.cc:31:
/usr/include/exiv2/error.hpp:276:9: note: candidate: 'template<class A, class B> Exiv2::BasicError<charT>::BasicError(Exiv2::ErrorCode, const A&, const B&)'
         BasicError(ErrorCode code, const A& arg1, const B& arg2);
         ^~~~~~~~~~
/usr/include/exiv2/error.hpp:276:9: note:   template argument deduction/substitution failed:
exiv2_extractor.cc:374:53: note:   candidate expects 3 arguments, 1 provided
   throw Exiv2::BasicError<char> (42 /* error code */);
                                                     ^
In file included from exiv2_extractor.cc:31:
/usr/include/exiv2/error.hpp:272:9: note: candidate: 'template<class A> Exiv2::BasicError<charT>::BasicError(Exiv2::ErrorCode, const A&)'
         BasicError(ErrorCode code, const A& arg1);
         ^~~~~~~~~~
/usr/include/exiv2/error.hpp:272:9: note:   template argument deduction/substitution failed:
exiv2_extractor.cc:374:53: note:   candidate expects 2 arguments, 1 provided
   throw Exiv2::BasicError<char> (42 /* error code */);
                                                     ^
In file included from exiv2_extractor.cc:31:
/usr/include/exiv2/error.hpp:336:5: note: candidate: 'Exiv2::BasicError<charT>::BasicError(Exiv2::ErrorCode) [with charT = char]' <near match>
     BasicError<charT>::BasicError(ErrorCode code)
     ^~~~~~~~~~~~~~~~~
/usr/include/exiv2/error.hpp:336:5: note:   conversion of argument 1 would be ill-formed:
exiv2_extractor.cc:374:53: error: invalid conversion from 'int' to 'Exiv2::ErrorCode' [-fpermissive]
   throw Exiv2::BasicError<char> (42 /* error code */);
                                                     ^
In file included from exiv2_extractor.cc:31:
/usr/include/exiv2/error.hpp:263:11: note: candidate: 'Exiv2::BasicError<char>::BasicError(const Exiv2::BasicError<char>&)'
     class BasicError : public AnyError {
           ^~~~~~~~~~
/usr/include/exiv2/error.hpp:263:11: note:   no known conversion for argument 1 from 'int' to 'const Exiv2::BasicError<char>&'
exiv2_extractor.cc: In member function 'virtual Exiv2::byte* ExtractorIO::mmap(bool)':
exiv2_extractor.cc:419:53: error: no matching function for call to 'Exiv2::BasicError<char>::BasicError(int)'
   throw Exiv2::BasicError<char> (42 /* error code */);
                                                     ^
In file included from exiv2_extractor.cc:31:
/usr/include/exiv2/error.hpp:280:9: note: candidate: 'template<class A, class B, class C> Exiv2::BasicError<charT>::BasicError(Exiv2::ErrorCode, const A&, const B&, const C&)'
         BasicError(ErrorCode code, const A& arg1, const B& arg2, const C& arg3);
         ^~~~~~~~~~
/usr/include/exiv2/error.hpp:280:9: note:   template argument deduction/substitution failed:
exiv2_extractor.cc:419:53: note:   candidate expects 4 arguments, 1 provided
   throw Exiv2::BasicError<char> (42 /* error code */);
                                                     ^
In file included from exiv2_extractor.cc:31:
/usr/include/exiv2/error.hpp:276:9: note: candidate: 'template<class A, class B> Exiv2::BasicError<charT>::BasicError(Exiv2::ErrorCode, const A&, const B&)'
         BasicError(ErrorCode code, const A& arg1, const B& arg2);
         ^~~~~~~~~~
/usr/include/exiv2/error.hpp:276:9: note:   template argument deduction/substitution failed:
exiv2_extractor.cc:419:53: note:   candidate expects 3 arguments, 1 provided
   throw Exiv2::BasicError<char> (42 /* error code */);
                                                     ^
In file included from exiv2_extractor.cc:31:
/usr/include/exiv2/error.hpp:272:9: note: candidate: 'template<class A> Exiv2::BasicError<charT>::BasicError(Exiv2::ErrorCode, const A&)'
         BasicError(ErrorCode code, const A& arg1);
         ^~~~~~~~~~
/usr/include/exiv2/error.hpp:272:9: note:   template argument deduction/substitution failed:
exiv2_extractor.cc:419:53: note:   candidate expects 2 arguments, 1 provided
   throw Exiv2::BasicError<char> (42 /* error code */);
                                                     ^
In file included from exiv2_extractor.cc:31:
/usr/include/exiv2/error.hpp:336:5: note: candidate: 'Exiv2::BasicError<charT>::BasicError(Exiv2::ErrorCode) [with charT = char]' <near match>
     BasicError<charT>::BasicError(ErrorCode code)
     ^~~~~~~~~~~~~~~~~
/usr/include/exiv2/error.hpp:336:5: note:   conversion of argument 1 would be ill-formed:
exiv2_extractor.cc:419:53: error: invalid conversion from 'int' to 'Exiv2::ErrorCode' [-fpermissive]
   throw Exiv2::BasicError<char> (42 /* error code */);
                                                     ^
In file included from exiv2_extractor.cc:31:
/usr/include/exiv2/error.hpp:263:11: note: candidate: 'Exiv2::BasicError<char>::BasicError(const Exiv2::BasicError<char>&)'
     class BasicError : public AnyError {
           ^~~~~~~~~~
/usr/include/exiv2/error.hpp:263:11: note:   no known conversion for argument 1 from 'int' to 'const Exiv2::BasicError<char>&'
exiv2_extractor.cc:420:1: warning: no return statement in function returning non-void [-Wreturn-type]
 }
 ^
exiv2_extractor.cc: In member function 'virtual std::__cxx11::string ExtractorIO::path() const':
exiv2_extractor.cc:507:53: error: no matching function for call to 'Exiv2::BasicError<char>::BasicError(int)'
   throw Exiv2::BasicError<char> (42 /* error code */);
                                                     ^
In file included from exiv2_extractor.cc:31:
/usr/include/exiv2/error.hpp:280:9: note: candidate: 'template<class A, class B, class C> Exiv2::BasicError<charT>::BasicError(Exiv2::ErrorCode, const A&, const B&, const C&)'
         BasicError(ErrorCode code, const A& arg1, const B& arg2, const C& arg3);
         ^~~~~~~~~~
/usr/include/exiv2/error.hpp:280:9: note:   template argument deduction/substitution failed:
exiv2_extractor.cc:507:53: note:   candidate expects 4 arguments, 1 provided
   throw Exiv2::BasicError<char> (42 /* error code */);
                                                     ^
In file included from exiv2_extractor.cc:31:
/usr/include/exiv2/error.hpp:276:9: note: candidate: 'template<class A, class B> Exiv2::BasicError<charT>::BasicError(Exiv2::ErrorCode, const A&, const B&)'
         BasicError(ErrorCode code, const A& arg1, const B& arg2);
         ^~~~~~~~~~
/usr/include/exiv2/error.hpp:276:9: note:   template argument deduction/substitution failed:
exiv2_extractor.cc:507:53: note:   candidate expects 3 arguments, 1 provided
   throw Exiv2::BasicError<char> (42 /* error code */);
                                                     ^
In file included from exiv2_extractor.cc:31:
/usr/include/exiv2/error.hpp:272:9: note: candidate: 'template<class A> Exiv2::BasicError<charT>::BasicError(Exiv2::ErrorCode, const A&)'
         BasicError(ErrorCode code, const A& arg1);
         ^~~~~~~~~~
/usr/include/exiv2/error.hpp:272:9: note:   template argument deduction/substitution failed:
exiv2_extractor.cc:507:53: note:   candidate expects 2 arguments, 1 provided
   throw Exiv2::BasicError<char> (42 /* error code */);
                                                     ^
In file included from exiv2_extractor.cc:31:
/usr/include/exiv2/error.hpp:336:5: note: candidate: 'Exiv2::BasicError<charT>::BasicError(Exiv2::ErrorCode) [with charT = char]' <near match>
     BasicError<charT>::BasicError(ErrorCode code)
     ^~~~~~~~~~~~~~~~~
/usr/include/exiv2/error.hpp:336:5: note:   conversion of argument 1 would be ill-formed:
exiv2_extractor.cc:507:53: error: invalid conversion from 'int' to 'Exiv2::ErrorCode' [-fpermissive]
   throw Exiv2::BasicError<char> (42 /* error code */);
                                                     ^
In file included from exiv2_extractor.cc:31:
/usr/include/exiv2/error.hpp:263:11: note: candidate: 'Exiv2::BasicError<char>::BasicError(const Exiv2::BasicError<char>&)'
     class BasicError : public AnyError {
           ^~~~~~~~~~
/usr/include/exiv2/error.hpp:263:11: note:   no known conversion for argument 1 from 'int' to 'const Exiv2::BasicError<char>&'
exiv2_extractor.cc:508:1: warning: no return statement in function returning non-void [-Wreturn-type]
 }
 ^
exiv2_extractor.cc: In member function 'virtual Exiv2::BasicIo::AutoPtr ExtractorIO::temporary() const':
exiv2_extractor.cc:534:53: error: no matching function for call to 'Exiv2::BasicError<char>::BasicError(int)'
   throw Exiv2::BasicError<char> (42 /* error code */);
                                                     ^
In file included from exiv2_extractor.cc:31:
/usr/include/exiv2/error.hpp:280:9: note: candidate: 'template<class A, class B, class C> Exiv2::BasicError<charT>::BasicError(Exiv2::ErrorCode, const A&, const B&, const C&)'
         BasicError(ErrorCode code, const A& arg1, const B& arg2, const C& arg3);
         ^~~~~~~~~~
/usr/include/exiv2/error.hpp:280:9: note:   template argument deduction/substitution failed:
exiv2_extractor.cc:534:53: note:   candidate expects 4 arguments, 1 provided
   throw Exiv2::BasicError<char> (42 /* error code */);
                                                     ^
In file included from exiv2_extractor.cc:31:
/usr/include/exiv2/error.hpp:276:9: note: candidate: 'template<class A, class B> Exiv2::BasicError<charT>::BasicError(Exiv2::ErrorCode, const A&, const B&)'
         BasicError(ErrorCode code, const A& arg1, const B& arg2);
         ^~~~~~~~~~
/usr/include/exiv2/error.hpp:276:9: note:   template argument deduction/substitution failed:
exiv2_extractor.cc:534:53: note:   candidate expects 3 arguments, 1 provided
   throw Exiv2::BasicError<char> (42 /* error code */);
                                                     ^
In file included from exiv2_extractor.cc:31:
/usr/include/exiv2/error.hpp:272:9: note: candidate: 'template<class A> Exiv2::BasicError<charT>::BasicError(Exiv2::ErrorCode, const A&)'
         BasicError(ErrorCode code, const A& arg1);
         ^~~~~~~~~~
/usr/include/exiv2/error.hpp:272:9: note:   template argument deduction/substitution failed:
exiv2_extractor.cc:534:53: note:   candidate expects 2 arguments, 1 provided
   throw Exiv2::BasicError<char> (42 /* error code */);
                                                     ^
In file included from exiv2_extractor.cc:31:
/usr/include/exiv2/error.hpp:336:5: note: candidate: 'Exiv2::BasicError<charT>::BasicError(Exiv2::ErrorCode) [with charT = char]' <near match>
     BasicError<charT>::BasicError(ErrorCode code)
     ^~~~~~~~~~~~~~~~~
/usr/include/exiv2/error.hpp:336:5: note:   conversion of argument 1 would be ill-formed:
exiv2_extractor.cc:534:53: error: invalid conversion from 'int' to 'Exiv2::ErrorCode' [-fpermissive]
   throw Exiv2::BasicError<char> (42 /* error code */);
                                                     ^
In file included from exiv2_extractor.cc:31:
/usr/include/exiv2/error.hpp:263:11: note: candidate: 'Exiv2::BasicError<char>::BasicError(const Exiv2::BasicError<char>&)'
     class BasicError : public AnyError {
           ^~~~~~~~~~
/usr/include/exiv2/error.hpp:263:11: note:   no known conversion for argument 1 from 'int' to 'const Exiv2::BasicError<char>&'
exiv2_extractor.cc:535:1: warning: no return statement in function returning non-void [-Wreturn-type]
 }
 ^
exiv2_extractor.cc: In function 'void EXTRACTOR_exiv2_extract_method(EXTRACTOR_ExtractContext*)':
exiv2_extractor.cc:703:12: warning: 'template<class> class std::auto_ptr' is deprecated [-Wdeprecated-declarations]
       std::auto_ptr<Exiv2::BasicIo> eio(new ExtractorIO (ec));
            ^~~~~~~~
In file included from /usr/include/c++/8.2.0/bits/locale_conv.h:41,
                 from /usr/include/c++/8.2.0/locale:43,
                 from /usr/include/c++/8.2.0/iomanip:43,
                 from exiv2_extractor.cc:26:
/usr/include/c++/8.2.0/bits/unique_ptr.h:53:28: note: declared here
   template<typename> class auto_ptr;
                            ^~~~~~~~
make[4]: *** [Makefile:2326: exiv2_extractor.lo] Error 1
make[4]: Leaving directory '/tmp/B.kCwTuV/BUILD/libextractor-1.8/src/plugins'
make[4]: *** Waiting for unfinished jobs....
make[4]: Entering directory '/tmp/B.kCwTuV/BUILD/libextractor-1.8/src/plugins'
/bin/sh ../../libtool  --tag=CC   --mode=compile x86_64-pld-linux-gcc -DHAVE_CONFIG_H -I. -I../..  -I/usr/include/libgsf-1 -I/usr/include/glib-2.0 -I/usr/lib64/glib-2.0/include -I/usr/include/libxml2 -DHAVE_GSF -I../../src/include -I../../src/common -I/usr/include/rpm  -I/usr/include/libgsf-1 -I/usr/include/glib-2.0 -I/usr/lib64/glib-2.0/include -I/usr/include/libxml2 -DHAVE_GSF -O2 -fwrapv -pipe -Wformat -Werror=format-security -gdwarf-4 -fno-debug-types-section -fvar-tracking-assignments -g2 -Wp,-D_FORTIFY_SOURCE=2 -fstack-protector-strong --param=ssp-buffer-size=4 -fPIC -march=x86-64 -gdwarf-4 -fno-debug-types-section -fvar-tracking-assignments -g2  -MT libextractor_ole2_la-ole2_extractor.lo -MD -MP -MF .deps/libextractor_ole2_la-ole2_extractor.Tpo -c -o libextractor_ole2_la-ole2_extractor.lo `test -f 'ole2_extractor.c' || echo './'`ole2_extractor.c
libtool: compile:  x86_64-pld-linux-gcc -DHAVE_CONFIG_H -I. -I../.. -I/usr/include/libgsf-1 -I/usr/include/glib-2.0 -I/usr/lib64/glib-2.0/include -I/usr/include/libxml2 -DHAVE_GSF -I../../src/include -I../../src/common -I/usr/include/rpm -I/usr/include/libgsf-1 -I/usr/include/glib-2.0 -I/usr/lib64/glib-2.0/include -I/usr/include/libxml2 -DHAVE_GSF -O2 -fwrapv -pipe -Wformat -Werror=format-security -gdwarf-4 -fno-debug-types-section -fvar-tracking-assignments -g2 -Wp,-D_FORTIFY_SOURCE=2 -fstack-protector-strong --param=ssp-buffer-size=4 -fPIC -march=x86-64 -gdwarf-4 -fno-debug-types-section -fvar-tracking-assignments -g2 -MT libextractor_ole2_la-ole2_extractor.lo -MD -MP -MF .deps/libextractor_ole2_la-ole2_extractor.Tpo -c ole2_extractor.c  -fPIC -DPIC -o .libs/libextractor_ole2_la-ole2_extractor.o
ole2_extractor.c: In function 'le_input_class_init':
ole2_extractor.c:841:3: warning: 'g_type_class_add_private' is deprecated [-Wdeprecated-declarations]
   g_type_class_add_private (class, sizeof (LeInputPrivate));
   ^~~~~~~~~~~~~~~~~~~~~~~~
In file included from /usr/include/glib-2.0/gobject/gobject.h:24,
                 from /usr/include/glib-2.0/gobject/gbinding.h:29,
                 from /usr/include/glib-2.0/glib-object.h:23,
                 from ole2_extractor.c:34:
/usr/include/glib-2.0/gobject/gtype.h:1303:10: note: declared here
 void     g_type_class_add_private       (gpointer                    g_class,
          ^~~~~~~~~~~~~~~~~~~~~~~~
libtool: compile:  x86_64-pld-linux-gcc -DHAVE_CONFIG_H -I. -I../.. -I/usr/include/libgsf-1 -I/usr/include/glib-2.0 -I/usr/lib64/glib-2.0/include -I/usr/include/libxml2 -DHAVE_GSF -I../../src/include -I../../src/common -I/usr/include/rpm -I/usr/include/libgsf-1 -I/usr/include/glib-2.0 -I/usr/lib64/glib-2.0/include -I/usr/include/libxml2 -DHAVE_GSF -O2 -fwrapv -pipe -Wformat -Werror=format-security -gdwarf-4 -fno-debug-types-section -fvar-tracking-assignments -g2 -Wp,-D_FORTIFY_SOURCE=2 -fstack-protector-strong --param=ssp-buffer-size=4 -fPIC -march=x86-64 -gdwarf-4 -fno-debug-types-section -fvar-tracking-assignments -g2 -MT libextractor_ole2_la-ole2_extractor.lo -MD -MP -MF .deps/libextractor_ole2_la-ole2_extractor.Tpo -c ole2_extractor.c -o libextractor_ole2_la-ole2_extractor.o >/dev/null 2>&1
mv -f .deps/libextractor_ole2_la-ole2_extractor.Tpo .deps/libextractor_ole2_la-ole2_extractor.Plo
make[4]: Leaving directory '/tmp/B.kCwTuV/BUILD/libextractor-1.8/src/plugins'
make[4]: Entering directory '/tmp/B.kCwTuV/BUILD/libextractor-1.8/src/plugins'
/bin/sh ../../libtool  --tag=CC   --mode=compile x86_64-pld-linux-gcc -DHAVE_CONFIG_H -I. -I../..  -I../../src/include -I../../src/common -I/usr/include/rpm   -O2 -fwrapv -pipe -Wformat -Werror=format-security -gdwarf-4 -fno-debug-types-section -fvar-tracking-assignments -g2 -Wp,-D_FORTIFY_SOURCE=2 -fstack-protector-strong --param=ssp-buffer-size=4 -fPIC -march=x86-64 -gdwarf-4 -fno-debug-types-section -fvar-tracking-assignments -g2  -MT tiff_extractor.lo -MD -MP -MF .deps/tiff_extractor.Tpo -c -o tiff_extractor.lo tiff_extractor.c
libtool: compile:  x86_64-pld-linux-gcc -DHAVE_CONFIG_H -I. -I../.. -I../../src/include -I../../src/common -I/usr/include/rpm -O2 -fwrapv -pipe -Wformat -Werror=format-security -gdwarf-4 -fno-debug-types-section -fvar-tracking-assignments -g2 -Wp,-D_FORTIFY_SOURCE=2 -fstack-protector-strong --param=ssp-buffer-size=4 -fPIC -march=x86-64 -gdwarf-4 -fno-debug-types-section -fvar-tracking-assignments -g2 -MT tiff_extractor.lo -MD -MP -MF .deps/tiff_extractor.Tpo -c tiff_extractor.c  -fPIC -DPIC -o .libs/tiff_extractor.o
libtool: compile:  x86_64-pld-linux-gcc -DHAVE_CONFIG_H -I. -I../.. -I../../src/include -I../../src/common -I/usr/include/rpm -O2 -fwrapv -pipe -Wformat -Werror=format-security -gdwarf-4 -fno-debug-types-section -fvar-tracking-assignments -g2 -Wp,-D_FORTIFY_SOURCE=2 -fstack-protector-strong --param=ssp-buffer-size=4 -fPIC -march=x86-64 -gdwarf-4 -fno-debug-types-section -fvar-tracking-assignments -g2 -MT tiff_extractor.lo -MD -MP -MF .deps/tiff_extractor.Tpo -c tiff_extractor.c -o tiff_extractor.o >/dev/null 2>&1
mv -f .deps/tiff_extractor.Tpo .deps/tiff_extractor.Plo
make[4]: Leaving directory '/tmp/B.kCwTuV/BUILD/libextractor-1.8/src/plugins'
make[4]: Entering directory '/tmp/B.kCwTuV/BUILD/libextractor-1.8/src/plugins'
/bin/sh ../../libtool  --tag=CC   --mode=compile x86_64-pld-linux-gcc -DHAVE_CONFIG_H -I. -I../..  -I../../src/include -I../../src/common -I/usr/include/rpm   -O2 -fwrapv -pipe -Wformat -Werror=format-security -gdwarf-4 -fno-debug-types-section -fvar-tracking-assignments -g2 -Wp,-D_FORTIFY_SOURCE=2 -fstack-protector-strong --param=ssp-buffer-size=4 -fPIC -march=x86-64 -gdwarf-4 -fno-debug-types-section -fvar-tracking-assignments -g2  -MT rpm_extractor.lo -MD -MP -MF .deps/rpm_extractor.Tpo -c -o rpm_extractor.lo rpm_extractor.c
libtool: compile:  x86_64-pld-linux-gcc -DHAVE_CONFIG_H -I. -I../.. -I../../src/include -I../../src/common -I/usr/include/rpm -O2 -fwrapv -pipe -Wformat -Werror=format-security -gdwarf-4 -fno-debug-types-section -fvar-tracking-assignments -g2 -Wp,-D_FORTIFY_SOURCE=2 -fstack-protector-strong --param=ssp-buffer-size=4 -fPIC -march=x86-64 -gdwarf-4 -fno-debug-types-section -fvar-tracking-assignments -g2 -MT rpm_extractor.lo -MD -MP -MF .deps/rpm_extractor.Tpo -c rpm_extractor.c  -fPIC -DPIC -o .libs/rpm_extractor.o
rpm_extractor.c: In function 'EXTRACTOR_rpm_extract_method':
rpm_extractor.c:307:8: warning: implicit declaration of function 'rpmReadPackageFile'; did you mean 'rpmReadConfigFiles'? [-Wimplicit-function-declaration]
   rc = rpmReadPackageFile (ts, fdi, "GNU libextractor", &hdr);
        ^~~~~~~~~~~~~~~~~~
        rpmReadConfigFiles
rpm_extractor.c:438:3: warning: implicit declaration of function 'headerFreeIterator'; did you mean 'rpmpsFreeIterator'? [-Wimplicit-function-declaration]
   headerFreeIterator (hi);
   ^~~~~~~~~~~~~~~~~~
   rpmpsFreeIterator
libtool: compile:  x86_64-pld-linux-gcc -DHAVE_CONFIG_H -I. -I../.. -I../../src/include -I../../src/common -I/usr/include/rpm -O2 -fwrapv -pipe -Wformat -Werror=format-security -gdwarf-4 -fno-debug-types-section -fvar-tracking-assignments -g2 -Wp,-D_FORTIFY_SOURCE=2 -fstack-protector-strong --param=ssp-buffer-size=4 -fPIC -march=x86-64 -gdwarf-4 -fno-debug-types-section -fvar-tracking-assignments -g2 -MT rpm_extractor.lo -MD -MP -MF .deps/rpm_extractor.Tpo -c rpm_extractor.c -o rpm_extractor.o >/dev/null 2>&1
mv -f .deps/rpm_extractor.Tpo .deps/rpm_extractor.Plo
make[4]: Leaving directory '/tmp/B.kCwTuV/BUILD/libextractor-1.8/src/plugins'
make[4]: Entering directory '/tmp/B.kCwTuV/BUILD/libextractor-1.8/src/plugins'
/bin/sh ../../libtool  --tag=CC   --mode=compile x86_64-pld-linux-gcc -DHAVE_CONFIG_H -I. -I../..  -I../../src/include -I../../src/common -I/usr/include/rpm   -O2 -fwrapv -pipe -Wformat -Werror=format-security -gdwarf-4 -fno-debug-types-section -fvar-tracking-assignments -g2 -Wp,-D_FORTIFY_SOURCE=2 -fstack-protector-strong --param=ssp-buffer-size=4 -fPIC -march=x86-64 -gdwarf-4 -fno-debug-types-section -fvar-tracking-assignments -g2  -MT deb_extractor.lo -MD -MP -MF .deps/deb_extractor.Tpo -c -o deb_extractor.lo deb_extractor.c
libtool: compile:  x86_64-pld-linux-gcc -DHAVE_CONFIG_H -I. -I../.. -I../../src/include -I../../src/common -I/usr/include/rpm -O2 -fwrapv -pipe -Wformat -Werror=format-security -gdwarf-4 -fno-debug-types-section -fvar-tracking-assignments -g2 -Wp,-D_FORTIFY_SOURCE=2 -fstack-protector-strong --param=ssp-buffer-size=4 -fPIC -march=x86-64 -gdwarf-4 -fno-debug-types-section -fvar-tracking-assignments -g2 -MT deb_extractor.lo -MD -MP -MF .deps/deb_extractor.Tpo -c deb_extractor.c  -fPIC -DPIC -o .libs/deb_extractor.o
libtool: compile:  x86_64-pld-linux-gcc -DHAVE_CONFIG_H -I. -I../.. -I../../src/include -I../../src/common -I/usr/include/rpm -O2 -fwrapv -pipe -Wformat -Werror=format-security -gdwarf-4 -fno-debug-types-section -fvar-tracking-assignments -g2 -Wp,-D_FORTIFY_SOURCE=2 -fstack-protector-strong --param=ssp-buffer-size=4 -fPIC -march=x86-64 -gdwarf-4 -fno-debug-types-section -fvar-tracking-assignments -g2 -MT deb_extractor.lo -MD -MP -MF .deps/deb_extractor.Tpo -c deb_extractor.c -o deb_extractor.o >/dev/null 2>&1
mv -f .deps/deb_extractor.Tpo .deps/deb_extractor.Plo
make[4]: Leaving directory '/tmp/B.kCwTuV/BUILD/libextractor-1.8/src/plugins'
make[4]: Entering directory '/tmp/B.kCwTuV/BUILD/libextractor-1.8/src/plugins'
/bin/sh ../../libtool  --tag=CC   --mode=compile x86_64-pld-linux-gcc -DHAVE_CONFIG_H -I. -I../..  -I../../src/include -I../../src/common -I/usr/include/rpm   -O2 -fwrapv -pipe -Wformat -Werror=format-security -gdwarf-4 -fno-debug-types-section -fvar-tracking-assignments -g2 -Wp,-D_FORTIFY_SOURCE=2 -fstack-protector-strong --param=ssp-buffer-size=4 -fPIC -march=x86-64 -gdwarf-4 -fno-debug-types-section -fvar-tracking-assignments -g2  -MT odf_extractor.lo -MD -MP -MF .deps/odf_extractor.Tpo -c -o odf_extractor.lo odf_extractor.c
libtool: compile:  x86_64-pld-linux-gcc -DHAVE_CONFIG_H -I. -I../.. -I../../src/include -I../../src/common -I/usr/include/rpm -O2 -fwrapv -pipe -Wformat -Werror=format-security -gdwarf-4 -fno-debug-types-section -fvar-tracking-assignments -g2 -Wp,-D_FORTIFY_SOURCE=2 -fstack-protector-strong --param=ssp-buffer-size=4 -fPIC -march=x86-64 -gdwarf-4 -fno-debug-types-section -fvar-tracking-assignments -g2 -MT odf_extractor.lo -MD -MP -MF .deps/odf_extractor.Tpo -c odf_extractor.c  -fPIC -DPIC -o .libs/odf_extractor.o
libtool: compile:  x86_64-pld-linux-gcc -DHAVE_CONFIG_H -I. -I../.. -I../../src/include -I../../src/common -I/usr/include/rpm -O2 -fwrapv -pipe -Wformat -Werror=format-security -gdwarf-4 -fno-debug-types-section -fvar-tracking-assignments -g2 -Wp,-D_FORTIFY_SOURCE=2 -fstack-protector-strong --param=ssp-buffer-size=4 -fPIC -march=x86-64 -gdwarf-4 -fno-debug-types-section -fvar-tracking-assignments -g2 -MT odf_extractor.lo -MD -MP -MF .deps/odf_extractor.Tpo -c odf_extractor.c -o odf_extractor.o >/dev/null 2>&1
mv -f .deps/odf_extractor.Tpo .deps/odf_extractor.Plo
make[4]: Leaving directory '/tmp/B.kCwTuV/BUILD/libextractor-1.8/src/plugins'
make[4]: Entering directory '/tmp/B.kCwTuV/BUILD/libextractor-1.8/src/plugins'
/bin/sh ../../libtool  --tag=CC   --mode=compile x86_64-pld-linux-gcc -DHAVE_CONFIG_H -I. -I../..  -I../../src/include -I../../src/common -I/usr/include/rpm  -pthread -I/usr/include/gstreamer-1.0 -I/usr/include/glib-2.0 -I/usr/lib64/glib-2.0/include -pthread -I/usr/include/gstreamer-1.0 -I/usr/include/glib-2.0 -I/usr/lib64/glib-2.0/include -pthread -I/usr/include/gstreamer-1.0 -I/usr/include/glib-2.0 -I/usr/lib64/glib-2.0/include  -O2 -fwrapv -pipe -Wformat -Werror=format-security -gdwarf-4 -fno-debug-types-section -fvar-tracking-assignments -g2 -Wp,-D_FORTIFY_SOURCE=2 -fstack-protector-strong --param=ssp-buffer-size=4 -fPIC -march=x86-64 -gdwarf-4 -fno-debug-types-section -fvar-tracking-assignments -g2  -MT libextractor_gstreamer_la-gstreamer_extractor.lo -MD -MP -MF .deps/libextractor_gstreamer_la-gstreamer_extractor.Tpo -c -o libextractor_gstreamer_la-gstreamer_extractor.lo `test -f 'gstreamer_extractor.c' || echo './'`gstreamer_extractor.c
libtool: compile:  x86_64-pld-linux-gcc -DHAVE_CONFIG_H -I. -I../.. -I../../src/include -I../../src/common -I/usr/include/rpm -pthread -I/usr/include/gstreamer-1.0 -I/usr/include/glib-2.0 -I/usr/lib64/glib-2.0/include -pthread -I/usr/include/gstreamer-1.0 -I/usr/include/glib-2.0 -I/usr/lib64/glib-2.0/include -pthread -I/usr/include/gstreamer-1.0 -I/usr/include/glib-2.0 -I/usr/lib64/glib-2.0/include -O2 -fwrapv -pipe -Wformat -Werror=format-security -gdwarf-4 -fno-debug-types-section -fvar-tracking-assignments -g2 -Wp,-D_FORTIFY_SOURCE=2 -fstack-protector-strong --param=ssp-buffer-size=4 -fPIC -march=x86-64 -gdwarf-4 -fno-debug-types-section -fvar-tracking-assignments -g2 -MT libextractor_gstreamer_la-gstreamer_extractor.lo -MD -MP -MF .deps/libextractor_gstreamer_la-gstreamer_extractor.Tpo -c gstreamer_extractor.c  -fPIC -DPIC -o .libs/libextractor_gstreamer_la-gstreamer_extractor.o
libtool: compile:  x86_64-pld-linux-gcc -DHAVE_CONFIG_H -I. -I../.. -I../../src/include -I../../src/common -I/usr/include/rpm -pthread -I/usr/include/gstreamer-1.0 -I/usr/include/glib-2.0 -I/usr/lib64/glib-2.0/include -pthread -I/usr/include/gstreamer-1.0 -I/usr/include/glib-2.0 -I/usr/lib64/glib-2.0/include -pthread -I/usr/include/gstreamer-1.0 -I/usr/include/glib-2.0 -I/usr/lib64/glib-2.0/include -O2 -fwrapv -pipe -Wformat -Werror=format-security -gdwarf-4 -fno-debug-types-section -fvar-tracking-assignments -g2 -Wp,-D_FORTIFY_SOURCE=2 -fstack-protector-strong --param=ssp-buffer-size=4 -fPIC -march=x86-64 -gdwarf-4 -fno-debug-types-section -fvar-tracking-assignments -g2 -MT libextractor_gstreamer_la-gstreamer_extractor.lo -MD -MP -MF .deps/libextractor_gstreamer_la-gstreamer_extractor.Tpo -c gstreamer_extractor.c -o libextractor_gstreamer_la-gstreamer_extractor.o >/dev/null 2>&1
mv -f .deps/libextractor_gstreamer_la-gstreamer_extractor.Tpo .deps/libextractor_gstreamer_la-gstreamer_extractor.Plo
make[4]: Leaving directory '/tmp/B.kCwTuV/BUILD/libextractor-1.8/src/plugins'
make[4]: Entering directory '/tmp/B.kCwTuV/BUILD/libextractor-1.8/src/plugins'
/bin/sh ../../libtool  --tag=CC   --mode=compile x86_64-pld-linux-gcc -DHAVE_CONFIG_H -I. -I../..  -I../../src/include -I../../src/common -I/usr/include/rpm   -O2 -fwrapv -pipe -Wformat -Werror=format-security -gdwarf-4 -fno-debug-types-section -fvar-tracking-assignments -g2 -Wp,-D_FORTIFY_SOURCE=2 -fstack-protector-strong --param=ssp-buffer-size=4 -fPIC -march=x86-64 -gdwarf-4 -fno-debug-types-section -fvar-tracking-assignments -g2  -MT previewopus_extractor.lo -MD -MP -MF .deps/previewopus_extractor.Tpo -c -o previewopus_extractor.lo previewopus_extractor.c
libtool: compile:  x86_64-pld-linux-gcc -DHAVE_CONFIG_H -I. -I../.. -I../../src/include -I../../src/common -I/usr/include/rpm -O2 -fwrapv -pipe -Wformat -Werror=format-security -gdwarf-4 -fno-debug-types-section -fvar-tracking-assignments -g2 -Wp,-D_FORTIFY_SOURCE=2 -fstack-protector-strong --param=ssp-buffer-size=4 -fPIC -march=x86-64 -gdwarf-4 -fno-debug-types-section -fvar-tracking-assignments -g2 -MT previewopus_extractor.lo -MD -MP -MF .deps/previewopus_extractor.Tpo -c previewopus_extractor.c  -fPIC -DPIC -o .libs/previewopus_extractor.o
previewopus_extractor.c: In function 'open_output_file':
previewopus_extractor.c:258:5: warning: 'codec' is deprecated [-Wdeprecated-declarations]
     *output_codec_context = stream->codec;
     ^
In file included from previewopus_extractor.c:53:
/usr/include/libavformat/avformat.h:878:21: note: declared here
     AVCodecContext *codec;
                     ^~~~~
previewopus_extractor.c: In function 'init_resampler':
previewopus_extractor.c:331:8: warning: 'avresample_alloc_context' is deprecated [-Wdeprecated-declarations]
        if (!(*resample_context = avresample_alloc_context())) {
        ^~
In file included from previewopus_extractor.c:69:
/usr/include/libavresample/avresample.h:194:25: note: declared here
 AVAudioResampleContext *avresample_alloc_context(void);
                         ^~~~~~~~~~~~~~~~~~~~~~~~
previewopus_extractor.c:359:9: warning: 'avresample_open' is deprecated [-Wdeprecated-declarations]
         if ((error = avresample_open(*resample_context)) < 0) {
         ^~
In file included from previewopus_extractor.c:69:
/usr/include/libavresample/avresample.h:214:5: note: declared here
 int avresample_open(AVAudioResampleContext *avr);
     ^~~~~~~~~~~~~~~
previewopus_extractor.c:363:13: warning: 'avresample_free' is deprecated [-Wdeprecated-declarations]
             avresample_free(resample_context);
             ^~~~~~~~~~~~~~~
In file included from previewopus_extractor.c:69:
/usr/include/libavresample/avresample.h:258:6: note: declared here
 void avresample_free(AVAudioResampleContext **avr);
      ^~~~~~~~~~~~~~~
previewopus_extractor.c: In function 'decode_audio_frame':
previewopus_extractor.c:437:5: warning: 'avcodec_decode_audio4' is deprecated [-Wdeprecated-declarations]
     if ((error = avcodec_decode_audio4(input_codec_context, frame,
     ^~
In file included from /usr/include/libavformat/avformat.h:319,
                 from previewopus_extractor.c:53:
/usr/include/libavcodec/avcodec.h:4722:5: note: declared here
 int avcodec_decode_audio4(AVCodecContext *avctx, AVFrame *frame,
     ^~~~~~~~~~~~~~~~~~~~~
previewopus_extractor.c:443:9: warning: 'av_free_packet' is deprecated [-Wdeprecated-declarations]
         av_free_packet(&input_packet);
         ^~~~~~~~~~~~~~
In file included from /usr/include/libavformat/avformat.h:319,
                 from previewopus_extractor.c:53:
/usr/include/libavcodec/avcodec.h:4416:6: note: declared here
 void av_free_packet(AVPacket *pkt);
      ^~~~~~~~~~~~~~
previewopus_extractor.c:453:5: warning: 'av_free_packet' is deprecated [-Wdeprecated-declarations]
     av_free_packet(&input_packet);
     ^~~~~~~~~~~~~~
In file included from /usr/include/libavformat/avformat.h:319,
                 from previewopus_extractor.c:53:
/usr/include/libavcodec/avcodec.h:4416:6: note: declared here
 void av_free_packet(AVPacket *pkt);
      ^~~~~~~~~~~~~~
previewopus_extractor.c: In function 'convert_samples':
previewopus_extractor.c:513:4: warning: 'avresample_convert' is deprecated [-Wdeprecated-declarations]
    if ((error = avresample_convert(resample_context, converted_data, out_linesize,
    ^~
In file included from previewopus_extractor.c:69:
/usr/include/libavresample/avresample.h:451:5: note: declared here
 int avresample_convert(AVAudioResampleContext *avr, uint8_t **output,
     ^~~~~~~~~~~~~~~~~~
previewopus_extractor.c:528:5: warning: 'avresample_available' is deprecated [-Wdeprecated-declarations]
     if (avresample_available(resample_context)) {
     ^~
In file included from previewopus_extractor.c:69:
/usr/include/libavresample/avresample.h:494:5: note: declared here
 int avresample_available(AVAudioResampleContext *avr);
     ^~~~~~~~~~~~~~~~~~~~
previewopus_extractor.c: In function 'read_decode_convert_and_store':
previewopus_extractor.c:619:3: warning: 'avresample_available' is deprecated [-Wdeprecated-declarations]
   int out_samples = avresample_available(resampler_context) + avresample_get_delay(resampler_context) + input_frame->nb_samples;
   ^~~
In file included from previewopus_extractor.c:69:
/usr/include/libavresample/avresample.h:494:5: note: declared here
 int avresample_available(AVAudioResampleContext *avr);
     ^~~~~~~~~~~~~~~~~~~~
previewopus_extractor.c:619:3: warning: 'avresample_get_delay' is deprecated [-Wdeprecated-declarations]
   int out_samples = avresample_available(resampler_context) + avresample_get_delay(resampler_context) + input_frame->nb_samples;
   ^~~
In file included from previewopus_extractor.c:69:
/usr/include/libavresample/avresample.h:473:5: note: declared here
 int avresample_get_delay(AVAudioResampleContext *avr);
     ^~~~~~~~~~~~~~~~~~~~
previewopus_extractor.c: In function 'encode_audio_frame':
previewopus_extractor.c:745:5: warning: 'avcodec_encode_audio2' is deprecated [-Wdeprecated-declarations]
     if ((error = avcodec_encode_audio2(output_codec_context, &output_packet,
     ^~
In file included from /usr/include/libavformat/avformat.h:319,
                 from previewopus_extractor.c:53:
/usr/include/libavcodec/avcodec.h:5363:5: note: declared here
 int avcodec_encode_audio2(AVCodecContext *avctx, AVPacket *avpkt,
     ^~~~~~~~~~~~~~~~~~~~~
previewopus_extractor.c:751:9: warning: 'av_free_packet' is deprecated [-Wdeprecated-declarations]
         av_free_packet(&output_packet);
         ^~~~~~~~~~~~~~
In file included from /usr/include/libavformat/avformat.h:319,
                 from previewopus_extractor.c:53:
/usr/include/libavcodec/avcodec.h:4416:6: note: declared here
 void av_free_packet(AVPacket *pkt);
      ^~~~~~~~~~~~~~
previewopus_extractor.c:763:13: warning: 'av_free_packet' is deprecated [-Wdeprecated-declarations]
             av_free_packet(&output_packet);
             ^~~~~~~~~~~~~~
In file included from /usr/include/libavformat/avformat.h:319,
                 from previewopus_extractor.c:53:
/usr/include/libavcodec/avcodec.h:4416:6: note: declared here
 void av_free_packet(AVPacket *pkt);
      ^~~~~~~~~~~~~~
previewopus_extractor.c:767:9: warning: 'av_free_packet' is deprecated [-Wdeprecated-declarations]
         av_free_packet(&output_packet);
         ^~~~~~~~~~~~~~
In file included from /usr/include/libavformat/avformat.h:319,
                 from previewopus_extractor.c:53:
/usr/include/libavcodec/avcodec.h:4416:6: note: declared here
 void av_free_packet(AVPacket *pkt);
      ^~~~~~~~~~~~~~
previewopus_extractor.c: In function 'extract_audio':
previewopus_extractor.c:911:7: warning: 'codec' is deprecated [-Wdeprecated-declarations]
       codec_ctx = format_ctx->streams[i]->codec;
       ^~~~~~~~~
In file included from previewopus_extractor.c:53:
/usr/include/libavformat/avformat.h:878:21: note: declared here
     AVCodecContext *codec;
                     ^~~~~
previewopus_extractor.c:1124:3: warning: 'avresample_close' is deprecated [-Wdeprecated-declarations]
   avresample_close(resample_context);
   ^~~~~~~~~~~~~~~~
In file included from previewopus_extractor.c:69:
/usr/include/libavresample/avresample.h:245:6: note: declared here
 void avresample_close(AVAudioResampleContext *avr);
      ^~~~~~~~~~~~~~~~
previewopus_extractor.c:1125:3: warning: 'avresample_free' is deprecated [-Wdeprecated-declarations]
   avresample_free(&resample_context);
   ^~~~~~~~~~~~~~~
In file included from previewopus_extractor.c:69:
/usr/include/libavresample/avresample.h:258:6: note: declared here
 void avresample_free(AVAudioResampleContext **avr);
      ^~~~~~~~~~~~~~~
previewopus_extractor.c: In function 'previewopus_lib_init':
previewopus_extractor.c:1191:3: warning: 'av_register_all' is deprecated [-Wdeprecated-declarations]
   av_register_all ();
   ^~~~~~~~~~~~~~~
In file included from previewopus_extractor.c:53:
/usr/include/libavformat/avformat.h:2043:6: note: declared here
 void av_register_all(void);
      ^~~~~~~~~~~~~~~
libtool: compile:  x86_64-pld-linux-gcc -DHAVE_CONFIG_H -I. -I../.. -I../../src/include -I../../src/common -I/usr/include/rpm -O2 -fwrapv -pipe -Wformat -Werror=format-security -gdwarf-4 -fno-debug-types-section -fvar-tracking-assignments -g2 -Wp,-D_FORTIFY_SOURCE=2 -fstack-protector-strong --param=ssp-buffer-size=4 -fPIC -march=x86-64 -gdwarf-4 -fno-debug-types-section -fvar-tracking-assignments -g2 -MT previewopus_extractor.lo -MD -MP -MF .deps/previewopus_extractor.Tpo -c previewopus_extractor.c -o previewopus_extractor.o >/dev/null 2>&1
mv -f .deps/previewopus_extractor.Tpo .deps/previewopus_extractor.Plo
make[4]: Leaving directory '/tmp/B.kCwTuV/BUILD/libextractor-1.8/src/plugins'
make[4]: Entering directory '/tmp/B.kCwTuV/BUILD/libextractor-1.8/src/plugins'
/bin/sh ../../libtool  --tag=CC   --mode=compile x86_64-pld-linux-gcc -DHAVE_CONFIG_H -I. -I../..  -I../../src/include -I../../src/common -I/usr/include/rpm   -O2 -fwrapv -pipe -Wformat -Werror=format-security -gdwarf-4 -fno-debug-types-section -fvar-tracking-assignments -g2 -Wp,-D_FORTIFY_SOURCE=2 -fstack-protector-strong --param=ssp-buffer-size=4 -fPIC -march=x86-64 -gdwarf-4 -fno-debug-types-section -fvar-tracking-assignments -g2  -MT png_extractor.lo -MD -MP -MF .deps/png_extractor.Tpo -c -o png_extractor.lo png_extractor.c
libtool: compile:  x86_64-pld-linux-gcc -DHAVE_CONFIG_H -I. -I../.. -I../../src/include -I../../src/common -I/usr/include/rpm -O2 -fwrapv -pipe -Wformat -Werror=format-security -gdwarf-4 -fno-debug-types-section -fvar-tracking-assignments -g2 -Wp,-D_FORTIFY_SOURCE=2 -fstack-protector-strong --param=ssp-buffer-size=4 -fPIC -march=x86-64 -gdwarf-4 -fno-debug-types-section -fvar-tracking-assignments -g2 -MT png_extractor.lo -MD -MP -MF .deps/png_extractor.Tpo -c png_extractor.c  -fPIC -DPIC -o .libs/png_extractor.o
libtool: compile:  x86_64-pld-linux-gcc -DHAVE_CONFIG_H -I. -I../.. -I../../src/include -I../../src/common -I/usr/include/rpm -O2 -fwrapv -pipe -Wformat -Werror=format-security -gdwarf-4 -fno-debug-types-section -fvar-tracking-assignments -g2 -Wp,-D_FORTIFY_SOURCE=2 -fstack-protector-strong --param=ssp-buffer-size=4 -fPIC -march=x86-64 -gdwarf-4 -fno-debug-types-section -fvar-tracking-assignments -g2 -MT png_extractor.lo -MD -MP -MF .deps/png_extractor.Tpo -c png_extractor.c -o png_extractor.o >/dev/null 2>&1
mv -f .deps/png_extractor.Tpo .deps/png_extractor.Plo
make[4]: Leaving directory '/tmp/B.kCwTuV/BUILD/libextractor-1.8/src/plugins'
make[3]: *** [Makefile:2345: all-recursive] Error 1
make[2]: *** [Makefile:428: all-recursive] Error 1
make[1]: *** [Makefile:548: all-recursive] Error 1
make: *** [Makefile:455: all] Error 2
error: Bad exit status from /tmp/B.kCwTuV/BUILD/tmp/rpm-tmp.59445 (%build)


RPM build errors:
    Bad exit status from /tmp/B.kCwTuV/BUILD/tmp/rpm-tmp.59445 (%build)
ended at: Sun Feb 10 11:57:03 2019, done in 0:00:29.029164
error: No files produced.
+ chmod -R u+rwX /tmp/B.kCwTuV/BUILD
+ rm -rf /tmp/B.kCwTuV/tmp /tmp/B.kCwTuV/BUILD
+ rm -rf /tmp/B.kCwTuV
Begin-PLD-Builder-Info
Build-Time: user:34.73s sys:6.51s real:32.67s (faults io:0 non-io:2735720)

End-PLD-Builder-Info
[Back to list of logs] [View rpm -qa of builder]