FailedOk

th/SRPMS[OK]
th/x32[OK]
th/i686[OK]
th/x86_64[OK]

ac/SRPMS[OK]
ac/i386[OK]
ac/i586[OK]
ac/i686[OK]
ac/alpha[OK]
ac/amd64[OK]
ac/athlon[OK]
ac/ppc[OK]
ac/sparc[OK]
ac/sparc64[OK]

Advanced Search
main()
Powered by PLD Linux
(c) 2002-2018 PLD Team
$Revision: 1.37 $
Powered by Star Treck.
Your IP: 54.162.239.233

libmsn c40a1f54-6994-43a3-9811-62bd2e897466

Status:Failed
Source URL:ftp://buildlogs.pld-linux.org/th/x86_64/FAIL/libmsn,c40a1f54-6994-43a3-9811-62bd2e897466.bz2
text/plain URL:View!
full text:View!
rpm -qa of builder:View!
Date:2018/09/14 20:29:30
Runtime:0:00:11.888779

Toc:

  • error 1
  • /tmp/B.u6s9_Y/BUILD/libmsn-4.2.1/msn/util.cpp:263:9: error: 'des_key_schedule' was not declared in this scope
  • error 2
  • /tmp/B.u6s9_Y/BUILD/libmsn-4.2.1/msn/util.cpp:269:22: error: 'C_Block' was not declared in this scope
  • error 3
  • /tmp/B.u6s9_Y/BUILD/libmsn-4.2.1/msn/util.cpp:269:31: error: expected primary-expression before ')' token
  • error 4
  • /tmp/B.u6s9_Y/BUILD/libmsn-4.2.1/msn/util.cpp:269:36: error: 'ks1' was not declared in this scope
  • error 5
  • /tmp/B.u6s9_Y/BUILD/libmsn-4.2.1/msn/util.cpp:269:9: error: 'des_set_key' was not declared in this scope
  • error 6
  • /tmp/B.u6s9_Y/BUILD/libmsn-4.2.1/msn/util.cpp:270:31: error: expected primary-expression before ')' token
  • error 7
  • /tmp/B.u6s9_Y/BUILD/libmsn-4.2.1/msn/util.cpp:270:36: error: 'ks2' was not declared in this scope
  • error 8
  • /tmp/B.u6s9_Y/BUILD/libmsn-4.2.1/msn/util.cpp:271:31: error: expected primary-expression before ')' token
  • error 9
  • /tmp/B.u6s9_Y/BUILD/libmsn-4.2.1/msn/util.cpp:271:38: error: 'ks3' was not declared in this scope
  • error 10
  • /tmp/B.u6s9_Y/BUILD/libmsn-4.2.1/msn/util.cpp:282:121: error: expected primary-expression before ')' token
  • error 11
  • make[2]: *** [msn/CMakeFiles/msn.dir/build.make:131: msn/CMakeFiles/msn.dir/util.cpp.o] Error 1
  • error 12
  • make[1]: *** [CMakeFiles/Makefile2:89: msn/CMakeFiles/msn.dir/all] Error 2
  • error 13
  • error: Bad exit status from /tmp/B.u6s9_Y/BUILD/tmp/rpm-tmp.24902 (%build)
  • error 14
  • RPM build errors:
  • error 15
  • error: No files produced.

Content:

+ cd /tmp/B.u6s9_Y/BUILD
+ cd /tmp/B.u6s9_Y/BUILD
+ rm -rf libmsn-4.2.1
+ /usr/bin/bzip2 -dc /tmp/B.u6s9_Y/libmsn-4.2.1.tar.bz2
+ /bin/tar -xf -
+ STATUS=0 
+ '[' 0 -ne 0 ']'
+ cd libmsn-4.2.1
+ /bin/id -u
+ '[' 1000 '=' 0 ']'
+ /bin/id -u
+ '[' 1000 '=' 0 ']'
+ /bin/chmod -Rf a+rX,u+w,g-w,o-w .
+ echo 'Patch #0 (c++.patch):'
Patch #0 (c++.patch):
+ '[' -f /tmp/B.u6s9_Y/c++.patch ']'
+ /bin/cat /tmp/B.u6s9_Y/c++.patch
+ /usr/bin/patch -s -p1
+ exit 0
Executing(%build): /bin/sh -e /tmp/B.u6s9_Y/BUILD/tmp/rpm-tmp.24902
TMP=/home/users/builder/tmp
HOME=/home/users/builder
PATH=/home/users/builder/GNUstep/Tools:/usr/local/bin:/usr/bin:/bin:/home/users/builder/bin
TMPDIR=/tmp/B.u6s9_Y/BUILD/tmp
+ umask 022
+ cd /tmp/B.u6s9_Y/BUILD
+ cd libmsn-4.2.1
+ install -d build
+ cd build
+ CC=x86_64-pld-linux-gcc CXX=x86_64-pld-linux-g++ CPPFLAGS= /usr/bin/cmake '-DCMAKE_VERBOSE_MAKEFILE=ON' '-DCMAKE_BUILD_TYPE=PLD' '-DCMAKE_INSTALL_BINDIR:PATH=/usr/bin' '-DCMAKE_INSTALL_SBINDIR:PATH=/usr/sbin' '-DCMAKE_INSTALL_LIBEXECDIR:PATH=/usr/libexec' '-DCMAKE_INSTALL_SYSCONFDIR:PATH=/etc' '-DCMAKE_INSTALL_SHAREDSTATEDIRPATH:PATH=/var/lib' '-DCMAKE_INSTALL_LOCALSTATEDIRPATH:PATH=/var' '-DCMAKE_INSTALL_LIBDIR:PATH=/usr/lib64' '-DCMAKE_INSTALL_INCLUDEDIR:PATH=/usr/include' '-DCMAKE_INSTALL_OLDINCLUDEDIR:PATH=/usr/include' '-DCMAKE_INSTALL_DATAROOTDIR:PATH=/usr/share' '-DCMAKE_INSTALL_DATADIR:PATH=/usr/share' '-DCMAKE_INSTALL_INFODIR:PATH=/usr/share/info' '-DCMAKE_INSTALL_LOCALEDIR:PATH=/usr/share/locale' '-DCMAKE_INSTALL_MANDIR:PATH=/usr/share/man' '-DCMAKE_INSTALL_DOCDIR:PATH=/usr/share/doc' '-DCMAKE_INSTALL_PREFIX:PATH=/usr' '-DSYSCONF_INSTALL_DIR:PATH=/etc' '-DCMAKE_CXX_FLAGS_PLD=-O2 -fwrapv -pipe -Wformat -Werror=format-security -gdwarf-4 -fno-debug-types-section -fvar-tracking-assignments -g2 -Wp,-D_FORTIFY_SOURCE=2 -fstack-protector-strong --param=ssp-buffer-size=4 -fPIC -march=x86-64 -gdwarf-4 -fno-debug-types-section -fvar-tracking-assignments -g2  -DNDEBUG -DQT_NO_DEBUG' '-DCMAKE_C_FLAGS_PLD=-O2 -fwrapv -pipe -Wformat -Werror=format-security -gdwarf-4 -fno-debug-types-section -fvar-tracking-assignments -g2 -Wp,-D_FORTIFY_SOURCE=2 -fstack-protector-strong --param=ssp-buffer-size=4 -fPIC -march=x86-64 -gdwarf-4 -fno-debug-types-section -fvar-tracking-assignments -g2  -DNDEBUG -DQT_NO_DEBUG' '-DCMAKE_Fortran_FLAGS_PLD=-O2 -fwrapv -pipe -Wformat -Werror=format-security -gdwarf-4 -fno-debug-types-section -fvar-tracking-assignments -g2 -Wp,-D_FORTIFY_SOURCE=2 -fstack-protector-strong --param=ssp-buffer-size=4 -fPIC -march=x86-64 -gdwarf-4 -fno-debug-types-section -fvar-tracking-assignments -g2  -DNDEBUG -DQT_NO_DEBUG' '-DCMAKE_EXE_LINKER_FLAGS_PLD=-Wl,--as-needed -Wl,--no-copy-dt-needed-entries -Wl,-z,relro -Wl,-z,combreloc ' '-DCMAKE_SHARED_LINKER_FLAGS_PLD=-Wl,--as-needed -Wl,--no-copy-dt-needed-entries -Wl,-z,relro -Wl,-z,combreloc ' '-DCMAKE_MODULE_LINKER_FLAGS_PLD=-Wl,--as-needed -Wl,--no-copy-dt-needed-entries -Wl,-z,relro -Wl,-z,combreloc ' '-DLIB_SUFFIX=64' '-DBUILD_SHARED_LIBS:BOOL=ON' '-DCMAKE_INSTALL_PREFIX=/usr' '-DLIB_SUFFIX=64' ../
-- The C compiler identification is GNU 8.2.0
-- The CXX compiler identification is GNU 8.2.0
-- Check for working C compiler: /usr/bin/x86_64-pld-linux-gcc
-- Check for working C compiler: /usr/bin/x86_64-pld-linux-gcc -- works
-- Detecting C compiler ABI info
-- Detecting C compiler ABI info - done
-- Detecting C compile features
-- Detecting C compile features - done
-- Check for working CXX compiler: /usr/bin/x86_64-pld-linux-g++
-- Check for working CXX compiler: /usr/bin/x86_64-pld-linux-g++ -- works
-- Detecting CXX compiler ABI info
-- Detecting CXX compiler ABI info - done
-- Detecting CXX compile features
-- Detecting CXX compile features - done
-- Found OpenSSL: /usr/lib64/libssl.so
-- Configuring done
-- Generating done
CMake Warning:
  Manually-specified variables were not used by the project:

    CMAKE_Fortran_FLAGS_PLD
    CMAKE_INSTALL_BINDIR
    CMAKE_INSTALL_DATADIR
    CMAKE_INSTALL_DATAROOTDIR
    CMAKE_INSTALL_DOCDIR
    CMAKE_INSTALL_INCLUDEDIR
    CMAKE_INSTALL_INFODIR
    CMAKE_INSTALL_LIBDIR
    CMAKE_INSTALL_LIBEXECDIR
    CMAKE_INSTALL_LOCALEDIR
    CMAKE_INSTALL_LOCALSTATEDIRPATH
    CMAKE_INSTALL_MANDIR
    CMAKE_INSTALL_OLDINCLUDEDIR
    CMAKE_INSTALL_SBINDIR
    CMAKE_INSTALL_SHAREDSTATEDIRPATH
    CMAKE_INSTALL_SYSCONFDIR
    SYSCONF_INSTALL_DIR


-- Build files have been written to: /tmp/B.u6s9_Y/BUILD/libmsn-4.2.1/build
+ /usr/bin/make -Otarget -j9
/usr/bin/cmake -H/tmp/B.u6s9_Y/BUILD/libmsn-4.2.1 -B/tmp/B.u6s9_Y/BUILD/libmsn-4.2.1/build --check-build-system CMakeFiles/Makefile.cmake 0
/usr/bin/cmake -E cmake_progress_start /tmp/B.u6s9_Y/BUILD/libmsn-4.2.1/build/CMakeFiles /tmp/B.u6s9_Y/BUILD/libmsn-4.2.1/build/CMakeFiles/progress.marks
/usr/bin/make -f CMakeFiles/Makefile2 all
/usr/bin/make -f msn/CMakeFiles/msn.dir/build.make msn/CMakeFiles/msn.dir/depend
make[2]: Entering directory '/tmp/B.u6s9_Y/BUILD/libmsn-4.2.1/build'
cd /tmp/B.u6s9_Y/BUILD/libmsn-4.2.1/build && /usr/bin/cmake -E cmake_depends "Unix Makefiles" /tmp/B.u6s9_Y/BUILD/libmsn-4.2.1 /tmp/B.u6s9_Y/BUILD/libmsn-4.2.1/msn /tmp/B.u6s9_Y/BUILD/libmsn-4.2.1/build /tmp/B.u6s9_Y/BUILD/libmsn-4.2.1/build/msn /tmp/B.u6s9_Y/BUILD/libmsn-4.2.1/build/msn/CMakeFiles/msn.dir/DependInfo.cmake --color=
Scanning dependencies of target msn
make[2]: Leaving directory '/tmp/B.u6s9_Y/BUILD/libmsn-4.2.1/build'
/usr/bin/make -f msn/CMakeFiles/msn.dir/build.make msn/CMakeFiles/msn.dir/build
make[2]: Entering directory '/tmp/B.u6s9_Y/BUILD/libmsn-4.2.1/build'
[ 40%] Building CXX object msn/CMakeFiles/msn.dir/md5.cpp.o
cd /tmp/B.u6s9_Y/BUILD/libmsn-4.2.1/build/msn && /usr/bin/x86_64-pld-linux-g++  -Dmsn_EXPORTS -I/tmp/B.u6s9_Y/BUILD/libmsn-4.2.1 -I/tmp/B.u6s9_Y/BUILD/libmsn-4.2.1/msn -I/tmp/B.u6s9_Y/BUILD/libmsn-4.2.1/build  -O2 -fwrapv -pipe -Wformat -Werror=format-security -gdwarf-4 -fno-debug-types-section -fvar-tracking-assignments -g2 -Wp,-D_FORTIFY_SOURCE=2 -fstack-protector-strong --param=ssp-buffer-size=4 -fPIC -march=x86-64 -gdwarf-4 -fno-debug-types-section -fvar-tracking-assignments -g2  -DNDEBUG -DQT_NO_DEBUG -fPIC   -o CMakeFiles/msn.dir/md5.cpp.o -c /tmp/B.u6s9_Y/BUILD/libmsn-4.2.1/msn/md5.cpp
make[2]: Leaving directory '/tmp/B.u6s9_Y/BUILD/libmsn-4.2.1/build'
make[2]: Entering directory '/tmp/B.u6s9_Y/BUILD/libmsn-4.2.1/build'
[  4%] Building CXX object msn/CMakeFiles/msn.dir/authdata.cpp.o
cd /tmp/B.u6s9_Y/BUILD/libmsn-4.2.1/build/msn && /usr/bin/x86_64-pld-linux-g++  -Dmsn_EXPORTS -I/tmp/B.u6s9_Y/BUILD/libmsn-4.2.1 -I/tmp/B.u6s9_Y/BUILD/libmsn-4.2.1/msn -I/tmp/B.u6s9_Y/BUILD/libmsn-4.2.1/build  -O2 -fwrapv -pipe -Wformat -Werror=format-security -gdwarf-4 -fno-debug-types-section -fvar-tracking-assignments -g2 -Wp,-D_FORTIFY_SOURCE=2 -fstack-protector-strong --param=ssp-buffer-size=4 -fPIC -march=x86-64 -gdwarf-4 -fno-debug-types-section -fvar-tracking-assignments -g2  -DNDEBUG -DQT_NO_DEBUG -fPIC   -o CMakeFiles/msn.dir/authdata.cpp.o -c /tmp/B.u6s9_Y/BUILD/libmsn-4.2.1/msn/authdata.cpp
make[2]: Leaving directory '/tmp/B.u6s9_Y/BUILD/libmsn-4.2.1/build'
make[2]: Entering directory '/tmp/B.u6s9_Y/BUILD/libmsn-4.2.1/build'
[ 22%] Building CXX object msn/CMakeFiles/msn.dir/util.cpp.o
cd /tmp/B.u6s9_Y/BUILD/libmsn-4.2.1/build/msn && /usr/bin/x86_64-pld-linux-g++  -Dmsn_EXPORTS -I/tmp/B.u6s9_Y/BUILD/libmsn-4.2.1 -I/tmp/B.u6s9_Y/BUILD/libmsn-4.2.1/msn -I/tmp/B.u6s9_Y/BUILD/libmsn-4.2.1/build  -O2 -fwrapv -pipe -Wformat -Werror=format-security -gdwarf-4 -fno-debug-types-section -fvar-tracking-assignments -g2 -Wp,-D_FORTIFY_SOURCE=2 -fstack-protector-strong --param=ssp-buffer-size=4 -fPIC -march=x86-64 -gdwarf-4 -fno-debug-types-section -fvar-tracking-assignments -g2  -DNDEBUG -DQT_NO_DEBUG -fPIC   -o CMakeFiles/msn.dir/util.cpp.o -c /tmp/B.u6s9_Y/BUILD/libmsn-4.2.1/msn/util.cpp
In file included from /tmp/B.u6s9_Y/BUILD/libmsn-4.2.1/msn/util.cpp:25:
/tmp/B.u6s9_Y/BUILD/libmsn-4.2.1/msn/util.h:140:59: warning: dynamic exception specifications are deprecated in C++11 [-Wdeprecated]
     unsigned int decimalFromString(const std::string & s) throw (std::logic_error);
                                                           ^~~~~
/tmp/B.u6s9_Y/BUILD/libmsn-4.2.1/msn/util.cpp:164:59: warning: dynamic exception specifications are deprecated in C++11 [-Wdeprecated]
     unsigned int decimalFromString(const std::string & s) throw (std::logic_error)
                                                           ^~~~~
/tmp/B.u6s9_Y/BUILD/libmsn-4.2.1/msn/util.cpp: In function 'std::__cxx11::string MSN::mdi_encrypt(std::__cxx11::string, std::__cxx11::string)':
/tmp/B.u6s9_Y/BUILD/libmsn-4.2.1/msn/util.cpp:263:9: error: 'des_key_schedule' was not declared in this scope
         des_key_schedule ks1,ks2,ks3;
         ^~~~~~~~~~~~~~~~
/tmp/B.u6s9_Y/BUILD/libmsn-4.2.1/msn/util.cpp:263:9: note: suggested alternative: 'DES_key_schedule'
         des_key_schedule ks1,ks2,ks3;
         ^~~~~~~~~~~~~~~~
         DES_key_schedule
/tmp/B.u6s9_Y/BUILD/libmsn-4.2.1/msn/util.cpp:269:22: error: 'C_Block' was not declared in this scope
         des_set_key((C_Block *)one,ks1);
                      ^~~~~~~
/tmp/B.u6s9_Y/BUILD/libmsn-4.2.1/msn/util.cpp:269:22: note: suggested alternative: 'clock'
         des_set_key((C_Block *)one,ks1);
                      ^~~~~~~
                      clock
/tmp/B.u6s9_Y/BUILD/libmsn-4.2.1/msn/util.cpp:269:31: error: expected primary-expression before ')' token
         des_set_key((C_Block *)one,ks1);
                               ^
/tmp/B.u6s9_Y/BUILD/libmsn-4.2.1/msn/util.cpp:269:36: error: 'ks1' was not declared in this scope
         des_set_key((C_Block *)one,ks1);
                                    ^~~
/tmp/B.u6s9_Y/BUILD/libmsn-4.2.1/msn/util.cpp:269:36: note: suggested alternative: 'key1'
         des_set_key((C_Block *)one,ks1);
                                    ^~~
                                    key1
/tmp/B.u6s9_Y/BUILD/libmsn-4.2.1/msn/util.cpp:269:9: error: 'des_set_key' was not declared in this scope
         des_set_key((C_Block *)one,ks1);
         ^~~~~~~~~~~
/tmp/B.u6s9_Y/BUILD/libmsn-4.2.1/msn/util.cpp:269:9: note: suggested alternative: 'DES_set_key'
         des_set_key((C_Block *)one,ks1);
         ^~~~~~~~~~~
         DES_set_key
/tmp/B.u6s9_Y/BUILD/libmsn-4.2.1/msn/util.cpp:270:31: error: expected primary-expression before ')' token
         des_set_key((C_Block *)two,ks2);
                               ^
/tmp/B.u6s9_Y/BUILD/libmsn-4.2.1/msn/util.cpp:270:36: error: 'ks2' was not declared in this scope
         des_set_key((C_Block *)two,ks2);
                                    ^~~
/tmp/B.u6s9_Y/BUILD/libmsn-4.2.1/msn/util.cpp:270:36: note: suggested alternative: 'key2'
         des_set_key((C_Block *)two,ks2);
                                    ^~~
                                    key2
/tmp/B.u6s9_Y/BUILD/libmsn-4.2.1/msn/util.cpp:271:31: error: expected primary-expression before ')' token
         des_set_key((C_Block *)three,ks3);
                               ^
/tmp/B.u6s9_Y/BUILD/libmsn-4.2.1/msn/util.cpp:271:38: error: 'ks3' was not declared in this scope
         des_set_key((C_Block *)three,ks3);
                                      ^~~
/tmp/B.u6s9_Y/BUILD/libmsn-4.2.1/msn/util.cpp:271:38: note: suggested alternative: 'key3'
         des_set_key((C_Block *)three,ks3);
                                      ^~~
                                      key3
/tmp/B.u6s9_Y/BUILD/libmsn-4.2.1/msn/util.cpp:282:121: error: expected primary-expression before ')' token
         DES_ede3_cbc_encrypt((const unsigned char*)buf_.str().c_str(),output,buf_.str().size(),&ks1,&ks2,&ks3,(C_Block *)workvec,DES_ENCRYPT);
                                                                                                                         ^
/tmp/B.u6s9_Y/BUILD/libmsn-4.2.1/msn/util.cpp: In function 'void MSN::libmsn_Siren7_DecodeVoiceClip(std::__cxx11::string)':
/tmp/B.u6s9_Y/BUILD/libmsn-4.2.1/msn/util.cpp:471:15: warning: ignoring return value of 'size_t fread(void*, size_t, size_t, FILE*)', declared with attribute warn_unused_result [-Wunused-result]
         fread (&riff_header, sizeof (riff_data), 1, input);
         ~~~~~~^~~~~~~~~~~~~~~~~~~~~~~~~~~~~~~~~~~~~~~~~~~~
/tmp/B.u6s9_Y/BUILD/libmsn-4.2.1/msn/util.cpp:482:23: warning: ignoring return value of 'size_t fread(void*, size_t, size_t, FILE*)', declared with attribute warn_unused_result [-Wunused-result]
                 fread (&current_chunk, sizeof (wav_data), 1, input);
                 ~~~~~~^~~~~~~~~~~~~~~~~~~~~~~~~~~~~~~~~~~~~~~~~~~~~
/tmp/B.u6s9_Y/BUILD/libmsn-4.2.1/msn/util.cpp:490:27: warning: ignoring return value of 'size_t fread(void*, size_t, size_t, FILE*)', declared with attribute warn_unused_result [-Wunused-result]
                     fread (&fmt_info, sizeof (fmt_chunk), 1, input);
                     ~~~~~~^~~~~~~~~~~~~~~~~~~~~~~~~~~~~~~~~~~~~~~~~
/tmp/B.u6s9_Y/BUILD/libmsn-4.2.1/msn/util.cpp:494:31: warning: ignoring return value of 'size_t fread(void*, size_t, size_t, FILE*)', declared with attribute warn_unused_result [-Wunused-result]
                         fread (&(fmt_info.extra_size), sizeof (short), 1, input);
                         ~~~~~~^~~~~~~~~~~~~~~~~~~~~~~~~~~~~~~~~~~~~~~~~~~~~~~~~~
/tmp/B.u6s9_Y/BUILD/libmsn-4.2.1/msn/util.cpp:497:31: warning: ignoring return value of 'size_t fread(void*, size_t, size_t, FILE*)', declared with attribute warn_unused_result [-Wunused-result]
                         fread (fmt_info.extra_content, fmt_info.extra_size, 1, input);
                         ~~~~~~^~~~~~~~~~~~~~~~~~~~~~~~~~~~~~~~~~~~~~~~~~~~~~~~~~~~~~~
/tmp/B.u6s9_Y/BUILD/libmsn-4.2.1/msn/util.cpp:511:31: warning: ignoring return value of 'size_t fread(void*, size_t, size_t, FILE*)', declared with attribute warn_unused_result [-Wunused-result]
                         fread (in_buffer, 1, 40, input);
                         ~~~~~~^~~~~~~~~~~~~~~~~~~~~~~~~
/tmp/B.u6s9_Y/BUILD/libmsn-4.2.1/msn/util.cpp:516:27: warning: ignoring return value of 'size_t fread(void*, size_t, size_t, FILE*)', declared with attribute warn_unused_result [-Wunused-result]
                     fread (in_buffer, 1, current_chunk.chunk_size - chunk_offset, input);
                     ~~~~~~^~~~~~~~~~~~~~~~~~~~~~~~~~~~~~~~~~~~~~~~~~~~~~~~~~~~~~~~~~~~~~
/tmp/B.u6s9_Y/BUILD/libmsn-4.2.1/msn/util.cpp: In function 'void MSN::libmsn_Siren7_EncodeVoiceClip(std::__cxx11::string)':
/tmp/B.u6s9_Y/BUILD/libmsn-4.2.1/msn/util.cpp:566:14: warning: ignoring return value of 'size_t fread(void*, size_t, size_t, FILE*)', declared with attribute warn_unused_result [-Wunused-result]
         fread(&riff_header, sizeof(riff_data), 1, input);
         ~~~~~^~~~~~~~~~~~~~~~~~~~~~~~~~~~~~~~~~~~~~~~~~~
/tmp/B.u6s9_Y/BUILD/libmsn-4.2.1/msn/util.cpp:575:26: warning: ignoring return value of 'size_t fread(void*, size_t, size_t, FILE*)', declared with attribute warn_unused_result [-Wunused-result]
                     fread(&current_chunk, sizeof(wav_data), 1, input);
                     ~~~~~^~~~~~~~~~~~~~~~~~~~~~~~~~~~~~~~~~~~~~~~~~~~
/tmp/B.u6s9_Y/BUILD/libmsn-4.2.1/msn/util.cpp:582:32: warning: ignoring return value of 'size_t fread(void*, size_t, size_t, FILE*)', declared with attribute warn_unused_result [-Wunused-result]
                           fread(&fmt_info, sizeof(fmt_chunk), 1, input);
                           ~~~~~^~~~~~~~~~~~~~~~~~~~~~~~~~~~~~~~~~~~~~~~
/tmp/B.u6s9_Y/BUILD/libmsn-4.2.1/msn/util.cpp:585:38: warning: ignoring return value of 'size_t fread(void*, size_t, size_t, FILE*)', declared with attribute warn_unused_result [-Wunused-result]
                                 fread(&(fmt_info.extra_size), sizeof(short), 1, input);
                                 ~~~~~^~~~~~~~~~~~~~~~~~~~~~~~~~~~~~~~~~~~~~~~~~~~~~~~~
/tmp/B.u6s9_Y/BUILD/libmsn-4.2.1/msn/util.cpp:588:38: warning: ignoring return value of 'size_t fread(void*, size_t, size_t, FILE*)', declared with attribute warn_unused_result [-Wunused-result]
                                 fread(fmt_info.extra_content, fmt_info.extra_size, 1, input);
                                 ~~~~~^~~~~~~~~~~~~~~~~~~~~~~~~~~~~~~~~~~~~~~~~~~~~~~~~~~~~~~
/tmp/B.u6s9_Y/BUILD/libmsn-4.2.1/msn/util.cpp:597:38: warning: ignoring return value of 'size_t fread(void*, size_t, size_t, FILE*)', declared with attribute warn_unused_result [-Wunused-result]
                                 fread(InBuffer, 1, 640, input);
                                 ~~~~~^~~~~~~~~~~~~~~~~~~~~~~~~
/tmp/B.u6s9_Y/BUILD/libmsn-4.2.1/msn/util.cpp:602:32: warning: ignoring return value of 'size_t fread(void*, size_t, size_t, FILE*)', declared with attribute warn_unused_result [-Wunused-result]
                           fread(InBuffer, 1, current_chunk.chunk_size - chunkOffset, input);
                           ~~~~~^~~~~~~~~~~~~~~~~~~~~~~~~~~~~~~~~~~~~~~~~~~~~~~~~~~~~~~~~~~~
make[2]: *** [msn/CMakeFiles/msn.dir/build.make:131: msn/CMakeFiles/msn.dir/util.cpp.o] Error 1
make[2]: Leaving directory '/tmp/B.u6s9_Y/BUILD/libmsn-4.2.1/build'
make[2]: *** Waiting for unfinished jobs....
make[2]: Entering directory '/tmp/B.u6s9_Y/BUILD/libmsn-4.2.1/build'
[ 13%] Building CXX object msn/CMakeFiles/msn.dir/connection.cpp.o
cd /tmp/B.u6s9_Y/BUILD/libmsn-4.2.1/build/msn && /usr/bin/x86_64-pld-linux-g++  -Dmsn_EXPORTS -I/tmp/B.u6s9_Y/BUILD/libmsn-4.2.1 -I/tmp/B.u6s9_Y/BUILD/libmsn-4.2.1/msn -I/tmp/B.u6s9_Y/BUILD/libmsn-4.2.1/build  -O2 -fwrapv -pipe -Wformat -Werror=format-security -gdwarf-4 -fno-debug-types-section -fvar-tracking-assignments -g2 -Wp,-D_FORTIFY_SOURCE=2 -fstack-protector-strong --param=ssp-buffer-size=4 -fPIC -march=x86-64 -gdwarf-4 -fno-debug-types-section -fvar-tracking-assignments -g2  -DNDEBUG -DQT_NO_DEBUG -fPIC   -o CMakeFiles/msn.dir/connection.cpp.o -c /tmp/B.u6s9_Y/BUILD/libmsn-4.2.1/msn/connection.cpp
In file included from /tmp/B.u6s9_Y/BUILD/libmsn-4.2.1/msn/connection.cpp:25:
/tmp/B.u6s9_Y/BUILD/libmsn-4.2.1/msn/connection.h:97:60: warning: dynamic exception specifications are deprecated in C++11 [-Wdeprecated]
         virtual size_t write(std::string s, bool log=true) throw (std::runtime_error);
                                                            ^~~~~
/tmp/B.u6s9_Y/BUILD/libmsn-4.2.1/msn/connection.h:108:69: warning: dynamic exception specifications are deprecated in C++11 [-Wdeprecated]
         virtual size_t write(std::ostringstream & s, bool log=true) throw (std::runtime_error);
                                                                     ^~~~~
In file included from /tmp/B.u6s9_Y/BUILD/libmsn-4.2.1/msn/switchboardserver.h:28,
                 from /tmp/B.u6s9_Y/BUILD/libmsn-4.2.1/msn/errorcodes.h:30,
                 from /tmp/B.u6s9_Y/BUILD/libmsn-4.2.1/msn/connection.cpp:26:
/tmp/B.u6s9_Y/BUILD/libmsn-4.2.1/msn/message.h:206:66: warning: dynamic exception specifications are deprecated in C++11 [-Wdeprecated]
         std::map<std::string, std::string> getFormatInfo() const throw (std::runtime_error);
                                                                  ^~~~~
In file included from /tmp/B.u6s9_Y/BUILD/libmsn-4.2.1/msn/p2p.h:31,
                 from /tmp/B.u6s9_Y/BUILD/libmsn-4.2.1/msn/switchboardserver.h:32,
                 from /tmp/B.u6s9_Y/BUILD/libmsn-4.2.1/msn/errorcodes.h:30,
                 from /tmp/B.u6s9_Y/BUILD/libmsn-4.2.1/msn/connection.cpp:26:
/tmp/B.u6s9_Y/BUILD/libmsn-4.2.1/msn/util.h:140:59: warning: dynamic exception specifications are deprecated in C++11 [-Wdeprecated]
     unsigned int decimalFromString(const std::string & s) throw (std::logic_error);
                                                           ^~~~~
In file included from /tmp/B.u6s9_Y/BUILD/libmsn-4.2.1/msn/connection.cpp:30:
/tmp/B.u6s9_Y/BUILD/libmsn-4.2.1/msn/notificationserver.h:243:83: warning: dynamic exception specifications are deprecated in C++11 [-Wdeprecated]
         void setFriendlyName(std::string friendlyName, bool updateServer = false) throw (std::runtime_error);
                                                                                   ^~~~~
/tmp/B.u6s9_Y/BUILD/libmsn-4.2.1/msn/connection.cpp:160:55: warning: dynamic exception specifications are deprecated in C++11 [-Wdeprecated]
     size_t Connection::write(std::string s, bool log) throw (std::runtime_error)
                                                       ^~~~~
/tmp/B.u6s9_Y/BUILD/libmsn-4.2.1/msn/connection.cpp:182:65: warning: dynamic exception specifications are deprecated in C++11 [-Wdeprecated]
     size_t Connection::write(std::ostringstream & ss, bool log) throw (std::runtime_error)
                                                                 ^~~~~
make[2]: Leaving directory '/tmp/B.u6s9_Y/BUILD/libmsn-4.2.1/build'
make[2]: Entering directory '/tmp/B.u6s9_Y/BUILD/libmsn-4.2.1/build'
[ 45%] Building CXX object msn/CMakeFiles/msn.dir/xmlParser.cpp.o
cd /tmp/B.u6s9_Y/BUILD/libmsn-4.2.1/build/msn && /usr/bin/x86_64-pld-linux-g++  -Dmsn_EXPORTS -I/tmp/B.u6s9_Y/BUILD/libmsn-4.2.1 -I/tmp/B.u6s9_Y/BUILD/libmsn-4.2.1/msn -I/tmp/B.u6s9_Y/BUILD/libmsn-4.2.1/build  -O2 -fwrapv -pipe -Wformat -Werror=format-security -gdwarf-4 -fno-debug-types-section -fvar-tracking-assignments -g2 -Wp,-D_FORTIFY_SOURCE=2 -fstack-protector-strong --param=ssp-buffer-size=4 -fPIC -march=x86-64 -gdwarf-4 -fno-debug-types-section -fvar-tracking-assignments -g2  -DNDEBUG -DQT_NO_DEBUG -fPIC   -o CMakeFiles/msn.dir/xmlParser.cpp.o -c /tmp/B.u6s9_Y/BUILD/libmsn-4.2.1/msn/xmlParser.cpp
/tmp/B.u6s9_Y/BUILD/libmsn-4.2.1/msn/xmlParser.cpp: In static member function 'static XMLNode XMLNode::parseFile(const char*, const char*, XMLResults*)':
/tmp/B.u6s9_Y/BUILD/libmsn-4.2.1/msn/xmlParser.cpp:1689:10: warning: ignoring return value of 'size_t fread(void*, size_t, size_t, FILE*)', declared with attribute warn_unused_result [-Wunused-result]
     fread(buf,l,1,f);
     ~~~~~^~~~~~~~~~~
make[2]: Leaving directory '/tmp/B.u6s9_Y/BUILD/libmsn-4.2.1/build'
make[2]: Entering directory '/tmp/B.u6s9_Y/BUILD/libmsn-4.2.1/build'
[ 50%] Building CXX object msn/CMakeFiles/msn.dir/msnobject.cpp.o
cd /tmp/B.u6s9_Y/BUILD/libmsn-4.2.1/build/msn && /usr/bin/x86_64-pld-linux-g++  -Dmsn_EXPORTS -I/tmp/B.u6s9_Y/BUILD/libmsn-4.2.1 -I/tmp/B.u6s9_Y/BUILD/libmsn-4.2.1/msn -I/tmp/B.u6s9_Y/BUILD/libmsn-4.2.1/build  -O2 -fwrapv -pipe -Wformat -Werror=format-security -gdwarf-4 -fno-debug-types-section -fvar-tracking-assignments -g2 -Wp,-D_FORTIFY_SOURCE=2 -fstack-protector-strong --param=ssp-buffer-size=4 -fPIC -march=x86-64 -gdwarf-4 -fno-debug-types-section -fvar-tracking-assignments -g2  -DNDEBUG -DQT_NO_DEBUG -fPIC   -o CMakeFiles/msn.dir/msnobject.cpp.o -c /tmp/B.u6s9_Y/BUILD/libmsn-4.2.1/msn/msnobject.cpp
In file included from /tmp/B.u6s9_Y/BUILD/libmsn-4.2.1/msn/msnobject.cpp:22:
/tmp/B.u6s9_Y/BUILD/libmsn-4.2.1/msn/util.h:140:59: warning: dynamic exception specifications are deprecated in C++11 [-Wdeprecated]
     unsigned int decimalFromString(const std::string & s) throw (std::logic_error);
                                                           ^~~~~
make[2]: Leaving directory '/tmp/B.u6s9_Y/BUILD/libmsn-4.2.1/build'
make[2]: Entering directory '/tmp/B.u6s9_Y/BUILD/libmsn-4.2.1/build'
[  9%] Building CXX object msn/CMakeFiles/msn.dir/message.cpp.o
cd /tmp/B.u6s9_Y/BUILD/libmsn-4.2.1/build/msn && /usr/bin/x86_64-pld-linux-g++  -Dmsn_EXPORTS -I/tmp/B.u6s9_Y/BUILD/libmsn-4.2.1 -I/tmp/B.u6s9_Y/BUILD/libmsn-4.2.1/msn -I/tmp/B.u6s9_Y/BUILD/libmsn-4.2.1/build  -O2 -fwrapv -pipe -Wformat -Werror=format-security -gdwarf-4 -fno-debug-types-section -fvar-tracking-assignments -g2 -Wp,-D_FORTIFY_SOURCE=2 -fstack-protector-strong --param=ssp-buffer-size=4 -fPIC -march=x86-64 -gdwarf-4 -fno-debug-types-section -fvar-tracking-assignments -g2  -DNDEBUG -DQT_NO_DEBUG -fPIC   -o CMakeFiles/msn.dir/message.cpp.o -c /tmp/B.u6s9_Y/BUILD/libmsn-4.2.1/msn/message.cpp
In file included from /tmp/B.u6s9_Y/BUILD/libmsn-4.2.1/msn/message.cpp:26:
/tmp/B.u6s9_Y/BUILD/libmsn-4.2.1/msn/message.h:206:66: warning: dynamic exception specifications are deprecated in C++11 [-Wdeprecated]
         std::map<std::string, std::string> getFormatInfo() const throw (std::runtime_error);
                                                                  ^~~~~
In file included from /tmp/B.u6s9_Y/BUILD/libmsn-4.2.1/msn/switchboardserver.h:30,
                 from /tmp/B.u6s9_Y/BUILD/libmsn-4.2.1/msn/errorcodes.h:30,
                 from /tmp/B.u6s9_Y/BUILD/libmsn-4.2.1/msn/message.cpp:27:
/tmp/B.u6s9_Y/BUILD/libmsn-4.2.1/msn/connection.h:97:60: warning: dynamic exception specifications are deprecated in C++11 [-Wdeprecated]
         virtual size_t write(std::string s, bool log=true) throw (std::runtime_error);
                                                            ^~~~~
/tmp/B.u6s9_Y/BUILD/libmsn-4.2.1/msn/connection.h:108:69: warning: dynamic exception specifications are deprecated in C++11 [-Wdeprecated]
         virtual size_t write(std::ostringstream & s, bool log=true) throw (std::runtime_error);
                                                                     ^~~~~
In file included from /tmp/B.u6s9_Y/BUILD/libmsn-4.2.1/msn/p2p.h:31,
                 from /tmp/B.u6s9_Y/BUILD/libmsn-4.2.1/msn/switchboardserver.h:32,
                 from /tmp/B.u6s9_Y/BUILD/libmsn-4.2.1/msn/errorcodes.h:30,
                 from /tmp/B.u6s9_Y/BUILD/libmsn-4.2.1/msn/message.cpp:27:
/tmp/B.u6s9_Y/BUILD/libmsn-4.2.1/msn/util.h:140:59: warning: dynamic exception specifications are deprecated in C++11 [-Wdeprecated]
     unsigned int decimalFromString(const std::string & s) throw (std::logic_error);
                                                           ^~~~~
/tmp/B.u6s9_Y/BUILD/libmsn-4.2.1/msn/message.cpp:55:71: warning: dynamic exception specifications are deprecated in C++11 [-Wdeprecated]
     std::map<std::string, std::string> Message::getFormatInfo() const throw (std::runtime_error)
                                                                       ^~~~~
make[2]: Leaving directory '/tmp/B.u6s9_Y/BUILD/libmsn-4.2.1/build'
make[2]: Entering directory '/tmp/B.u6s9_Y/BUILD/libmsn-4.2.1/build'
[ 27%] Building CXX object msn/CMakeFiles/msn.dir/switchboardserver.cpp.o
cd /tmp/B.u6s9_Y/BUILD/libmsn-4.2.1/build/msn && /usr/bin/x86_64-pld-linux-g++  -Dmsn_EXPORTS -I/tmp/B.u6s9_Y/BUILD/libmsn-4.2.1 -I/tmp/B.u6s9_Y/BUILD/libmsn-4.2.1/msn -I/tmp/B.u6s9_Y/BUILD/libmsn-4.2.1/build  -O2 -fwrapv -pipe -Wformat -Werror=format-security -gdwarf-4 -fno-debug-types-section -fvar-tracking-assignments -g2 -Wp,-D_FORTIFY_SOURCE=2 -fstack-protector-strong --param=ssp-buffer-size=4 -fPIC -march=x86-64 -gdwarf-4 -fno-debug-types-section -fvar-tracking-assignments -g2  -DNDEBUG -DQT_NO_DEBUG -fPIC   -o CMakeFiles/msn.dir/switchboardserver.cpp.o -c /tmp/B.u6s9_Y/BUILD/libmsn-4.2.1/msn/switchboardserver.cpp
In file included from /tmp/B.u6s9_Y/BUILD/libmsn-4.2.1/msn/switchboardserver.h:28,
                 from /tmp/B.u6s9_Y/BUILD/libmsn-4.2.1/msn/switchboardserver.cpp:25:
/tmp/B.u6s9_Y/BUILD/libmsn-4.2.1/msn/message.h:206:66: warning: dynamic exception specifications are deprecated in C++11 [-Wdeprecated]
         std::map<std::string, std::string> getFormatInfo() const throw (std::runtime_error);
                                                                  ^~~~~
In file included from /tmp/B.u6s9_Y/BUILD/libmsn-4.2.1/msn/switchboardserver.h:30,
                 from /tmp/B.u6s9_Y/BUILD/libmsn-4.2.1/msn/switchboardserver.cpp:25:
/tmp/B.u6s9_Y/BUILD/libmsn-4.2.1/msn/connection.h:97:60: warning: dynamic exception specifications are deprecated in C++11 [-Wdeprecated]
         virtual size_t write(std::string s, bool log=true) throw (std::runtime_error);
                                                            ^~~~~
/tmp/B.u6s9_Y/BUILD/libmsn-4.2.1/msn/connection.h:108:69: warning: dynamic exception specifications are deprecated in C++11 [-Wdeprecated]
         virtual size_t write(std::ostringstream & s, bool log=true) throw (std::runtime_error);
                                                                     ^~~~~
In file included from /tmp/B.u6s9_Y/BUILD/libmsn-4.2.1/msn/p2p.h:31,
                 from /tmp/B.u6s9_Y/BUILD/libmsn-4.2.1/msn/switchboardserver.h:32,
                 from /tmp/B.u6s9_Y/BUILD/libmsn-4.2.1/msn/switchboardserver.cpp:25:
/tmp/B.u6s9_Y/BUILD/libmsn-4.2.1/msn/util.h:140:59: warning: dynamic exception specifications are deprecated in C++11 [-Wdeprecated]
     unsigned int decimalFromString(const std::string & s) throw (std::logic_error);
                                                           ^~~~~
In file included from /tmp/B.u6s9_Y/BUILD/libmsn-4.2.1/msn/switchboardserver.cpp:26:
/tmp/B.u6s9_Y/BUILD/libmsn-4.2.1/msn/notificationserver.h:243:83: warning: dynamic exception specifications are deprecated in C++11 [-Wdeprecated]
         void setFriendlyName(std::string friendlyName, bool updateServer = false) throw (std::runtime_error);
                                                                                   ^~~~~
make[2]: Leaving directory '/tmp/B.u6s9_Y/BUILD/libmsn-4.2.1/build'
make[2]: Entering directory '/tmp/B.u6s9_Y/BUILD/libmsn-4.2.1/build'
[ 36%] Building CXX object msn/CMakeFiles/msn.dir/p2p.cpp.o
cd /tmp/B.u6s9_Y/BUILD/libmsn-4.2.1/build/msn && /usr/bin/x86_64-pld-linux-g++  -Dmsn_EXPORTS -I/tmp/B.u6s9_Y/BUILD/libmsn-4.2.1 -I/tmp/B.u6s9_Y/BUILD/libmsn-4.2.1/msn -I/tmp/B.u6s9_Y/BUILD/libmsn-4.2.1/build  -O2 -fwrapv -pipe -Wformat -Werror=format-security -gdwarf-4 -fno-debug-types-section -fvar-tracking-assignments -g2 -Wp,-D_FORTIFY_SOURCE=2 -fstack-protector-strong --param=ssp-buffer-size=4 -fPIC -march=x86-64 -gdwarf-4 -fno-debug-types-section -fvar-tracking-assignments -g2  -DNDEBUG -DQT_NO_DEBUG -fPIC   -o CMakeFiles/msn.dir/p2p.cpp.o -c /tmp/B.u6s9_Y/BUILD/libmsn-4.2.1/msn/p2p.cpp
In file included from /tmp/B.u6s9_Y/BUILD/libmsn-4.2.1/msn/notificationserver.h:28,
                 from /tmp/B.u6s9_Y/BUILD/libmsn-4.2.1/msn/p2p.cpp:23:
/tmp/B.u6s9_Y/BUILD/libmsn-4.2.1/msn/connection.h:97:60: warning: dynamic exception specifications are deprecated in C++11 [-Wdeprecated]
         virtual size_t write(std::string s, bool log=true) throw (std::runtime_error);
                                                            ^~~~~
/tmp/B.u6s9_Y/BUILD/libmsn-4.2.1/msn/connection.h:108:69: warning: dynamic exception specifications are deprecated in C++11 [-Wdeprecated]
         virtual size_t write(std::ostringstream & s, bool log=true) throw (std::runtime_error);
                                                                     ^~~~~
In file included from /tmp/B.u6s9_Y/BUILD/libmsn-4.2.1/msn/switchboardserver.h:28,
                 from /tmp/B.u6s9_Y/BUILD/libmsn-4.2.1/msn/errorcodes.h:30,
                 from /tmp/B.u6s9_Y/BUILD/libmsn-4.2.1/msn/notificationserver.h:30,
                 from /tmp/B.u6s9_Y/BUILD/libmsn-4.2.1/msn/p2p.cpp:23:
/tmp/B.u6s9_Y/BUILD/libmsn-4.2.1/msn/message.h:206:66: warning: dynamic exception specifications are deprecated in C++11 [-Wdeprecated]
         std::map<std::string, std::string> getFormatInfo() const throw (std::runtime_error);
                                                                  ^~~~~
In file included from /tmp/B.u6s9_Y/BUILD/libmsn-4.2.1/msn/p2p.h:31,
                 from /tmp/B.u6s9_Y/BUILD/libmsn-4.2.1/msn/switchboardserver.h:32,
                 from /tmp/B.u6s9_Y/BUILD/libmsn-4.2.1/msn/errorcodes.h:30,
                 from /tmp/B.u6s9_Y/BUILD/libmsn-4.2.1/msn/notificationserver.h:30,
                 from /tmp/B.u6s9_Y/BUILD/libmsn-4.2.1/msn/p2p.cpp:23:
/tmp/B.u6s9_Y/BUILD/libmsn-4.2.1/msn/util.h:140:59: warning: dynamic exception specifications are deprecated in C++11 [-Wdeprecated]
     unsigned int decimalFromString(const std::string & s) throw (std::logic_error);
                                                           ^~~~~
In file included from /tmp/B.u6s9_Y/BUILD/libmsn-4.2.1/msn/p2p.cpp:23:
/tmp/B.u6s9_Y/BUILD/libmsn-4.2.1/msn/notificationserver.h:243:83: warning: dynamic exception specifications are deprecated in C++11 [-Wdeprecated]
         void setFriendlyName(std::string friendlyName, bool updateServer = false) throw (std::runtime_error);
                                                                                   ^~~~~
make[2]: Leaving directory '/tmp/B.u6s9_Y/BUILD/libmsn-4.2.1/build'
make[2]: Entering directory '/tmp/B.u6s9_Y/BUILD/libmsn-4.2.1/build'
[ 18%] Building CXX object msn/CMakeFiles/msn.dir/notificationserver.cpp.o
cd /tmp/B.u6s9_Y/BUILD/libmsn-4.2.1/build/msn && /usr/bin/x86_64-pld-linux-g++  -Dmsn_EXPORTS -I/tmp/B.u6s9_Y/BUILD/libmsn-4.2.1 -I/tmp/B.u6s9_Y/BUILD/libmsn-4.2.1/msn -I/tmp/B.u6s9_Y/BUILD/libmsn-4.2.1/build  -O2 -fwrapv -pipe -Wformat -Werror=format-security -gdwarf-4 -fno-debug-types-section -fvar-tracking-assignments -g2 -Wp,-D_FORTIFY_SOURCE=2 -fstack-protector-strong --param=ssp-buffer-size=4 -fPIC -march=x86-64 -gdwarf-4 -fno-debug-types-section -fvar-tracking-assignments -g2  -DNDEBUG -DQT_NO_DEBUG -fPIC   -o CMakeFiles/msn.dir/notificationserver.cpp.o -c /tmp/B.u6s9_Y/BUILD/libmsn-4.2.1/msn/notificationserver.cpp
In file included from /tmp/B.u6s9_Y/BUILD/libmsn-4.2.1/msn/notificationserver.h:28,
                 from /tmp/B.u6s9_Y/BUILD/libmsn-4.2.1/msn/notificationserver.cpp:26:
/tmp/B.u6s9_Y/BUILD/libmsn-4.2.1/msn/connection.h:97:60: warning: dynamic exception specifications are deprecated in C++11 [-Wdeprecated]
         virtual size_t write(std::string s, bool log=true) throw (std::runtime_error);
                                                            ^~~~~
/tmp/B.u6s9_Y/BUILD/libmsn-4.2.1/msn/connection.h:108:69: warning: dynamic exception specifications are deprecated in C++11 [-Wdeprecated]
         virtual size_t write(std::ostringstream & s, bool log=true) throw (std::runtime_error);
                                                                     ^~~~~
In file included from /tmp/B.u6s9_Y/BUILD/libmsn-4.2.1/msn/switchboardserver.h:28,
                 from /tmp/B.u6s9_Y/BUILD/libmsn-4.2.1/msn/errorcodes.h:30,
                 from /tmp/B.u6s9_Y/BUILD/libmsn-4.2.1/msn/notificationserver.h:30,
                 from /tmp/B.u6s9_Y/BUILD/libmsn-4.2.1/msn/notificationserver.cpp:26:
/tmp/B.u6s9_Y/BUILD/libmsn-4.2.1/msn/message.h:206:66: warning: dynamic exception specifications are deprecated in C++11 [-Wdeprecated]
         std::map<std::string, std::string> getFormatInfo() const throw (std::runtime_error);
                                                                  ^~~~~
In file included from /tmp/B.u6s9_Y/BUILD/libmsn-4.2.1/msn/p2p.h:31,
                 from /tmp/B.u6s9_Y/BUILD/libmsn-4.2.1/msn/switchboardserver.h:32,
                 from /tmp/B.u6s9_Y/BUILD/libmsn-4.2.1/msn/errorcodes.h:30,
                 from /tmp/B.u6s9_Y/BUILD/libmsn-4.2.1/msn/notificationserver.h:30,
                 from /tmp/B.u6s9_Y/BUILD/libmsn-4.2.1/msn/notificationserver.cpp:26:
/tmp/B.u6s9_Y/BUILD/libmsn-4.2.1/msn/util.h:140:59: warning: dynamic exception specifications are deprecated in C++11 [-Wdeprecated]
     unsigned int decimalFromString(const std::string & s) throw (std::logic_error);
                                                           ^~~~~
In file included from /tmp/B.u6s9_Y/BUILD/libmsn-4.2.1/msn/notificationserver.cpp:26:
/tmp/B.u6s9_Y/BUILD/libmsn-4.2.1/msn/notificationserver.h:243:83: warning: dynamic exception specifications are deprecated in C++11 [-Wdeprecated]
         void setFriendlyName(std::string friendlyName, bool updateServer = false) throw (std::runtime_error);
                                                                                   ^~~~~
/tmp/B.u6s9_Y/BUILD/libmsn-4.2.1/msn/notificationserver.cpp:809:101: warning: dynamic exception specifications are deprecated in C++11 [-Wdeprecated]
     void NotificationServerConnection::setFriendlyName(std::string friendlyName, bool updateServer) throw (std::runtime_error)
                                                                                                     ^~~~~
make[2]: Leaving directory '/tmp/B.u6s9_Y/BUILD/libmsn-4.2.1/build'
make[2]: Entering directory '/tmp/B.u6s9_Y/BUILD/libmsn-4.2.1/build'
[ 36%] Building CXX object msn/CMakeFiles/msn.dir/soap.cpp.o
cd /tmp/B.u6s9_Y/BUILD/libmsn-4.2.1/build/msn && /usr/bin/x86_64-pld-linux-g++  -Dmsn_EXPORTS -I/tmp/B.u6s9_Y/BUILD/libmsn-4.2.1 -I/tmp/B.u6s9_Y/BUILD/libmsn-4.2.1/msn -I/tmp/B.u6s9_Y/BUILD/libmsn-4.2.1/build  -O2 -fwrapv -pipe -Wformat -Werror=format-security -gdwarf-4 -fno-debug-types-section -fvar-tracking-assignments -g2 -Wp,-D_FORTIFY_SOURCE=2 -fstack-protector-strong --param=ssp-buffer-size=4 -fPIC -march=x86-64 -gdwarf-4 -fno-debug-types-section -fvar-tracking-assignments -g2  -DNDEBUG -DQT_NO_DEBUG -fPIC   -o CMakeFiles/msn.dir/soap.cpp.o -c /tmp/B.u6s9_Y/BUILD/libmsn-4.2.1/msn/soap.cpp
In file included from /tmp/B.u6s9_Y/BUILD/libmsn-4.2.1/msn/notificationserver.h:28,
                 from /tmp/B.u6s9_Y/BUILD/libmsn-4.2.1/msn/soap.cpp:25:
/tmp/B.u6s9_Y/BUILD/libmsn-4.2.1/msn/connection.h:97:60: warning: dynamic exception specifications are deprecated in C++11 [-Wdeprecated]
         virtual size_t write(std::string s, bool log=true) throw (std::runtime_error);
                                                            ^~~~~
/tmp/B.u6s9_Y/BUILD/libmsn-4.2.1/msn/connection.h:108:69: warning: dynamic exception specifications are deprecated in C++11 [-Wdeprecated]
         virtual size_t write(std::ostringstream & s, bool log=true) throw (std::runtime_error);
                                                                     ^~~~~
In file included from /tmp/B.u6s9_Y/BUILD/libmsn-4.2.1/msn/switchboardserver.h:28,
                 from /tmp/B.u6s9_Y/BUILD/libmsn-4.2.1/msn/errorcodes.h:30,
                 from /tmp/B.u6s9_Y/BUILD/libmsn-4.2.1/msn/notificationserver.h:30,
                 from /tmp/B.u6s9_Y/BUILD/libmsn-4.2.1/msn/soap.cpp:25:
/tmp/B.u6s9_Y/BUILD/libmsn-4.2.1/msn/message.h:206:66: warning: dynamic exception specifications are deprecated in C++11 [-Wdeprecated]
         std::map<std::string, std::string> getFormatInfo() const throw (std::runtime_error);
                                                                  ^~~~~
In file included from /tmp/B.u6s9_Y/BUILD/libmsn-4.2.1/msn/p2p.h:31,
                 from /tmp/B.u6s9_Y/BUILD/libmsn-4.2.1/msn/switchboardserver.h:32,
                 from /tmp/B.u6s9_Y/BUILD/libmsn-4.2.1/msn/errorcodes.h:30,
                 from /tmp/B.u6s9_Y/BUILD/libmsn-4.2.1/msn/notificationserver.h:30,
                 from /tmp/B.u6s9_Y/BUILD/libmsn-4.2.1/msn/soap.cpp:25:
/tmp/B.u6s9_Y/BUILD/libmsn-4.2.1/msn/util.h:140:59: warning: dynamic exception specifications are deprecated in C++11 [-Wdeprecated]
     unsigned int decimalFromString(const std::string & s) throw (std::logic_error);
                                                           ^~~~~
In file included from /tmp/B.u6s9_Y/BUILD/libmsn-4.2.1/msn/soap.cpp:25:
/tmp/B.u6s9_Y/BUILD/libmsn-4.2.1/msn/notificationserver.h:243:83: warning: dynamic exception specifications are deprecated in C++11 [-Wdeprecated]
         void setFriendlyName(std::string friendlyName, bool updateServer = false) throw (std::runtime_error);
                                                                                   ^~~~~
make[2]: Leaving directory '/tmp/B.u6s9_Y/BUILD/libmsn-4.2.1/build'
make[1]: *** [CMakeFiles/Makefile2:89: msn/CMakeFiles/msn.dir/all] Error 2
make: *** [Makefile:133: all] Error 2
error: Bad exit status from /tmp/B.u6s9_Y/BUILD/tmp/rpm-tmp.24902 (%build)


RPM build errors:
    Bad exit status from /tmp/B.u6s9_Y/BUILD/tmp/rpm-tmp.24902 (%build)
ended at: Fri Sep 14 20:29:30 2018, done in 0:00:11.888779
error: No files produced.
mesg: ttyname failed: Inappropriate ioctl for device
+ chmod -R u+rwX /tmp/B.u6s9_Y/BUILD
+ rm -rf /tmp/B.u6s9_Y/tmp /tmp/B.u6s9_Y/BUILD
mesg: ttyname failed: Inappropriate ioctl for device
+ rm -rf /tmp/B.u6s9_Y
Begin-PLD-Builder-Info
Build-Time: user:39.55s sys:2.60s real:14.14s (faults io:0 non-io:815298)

End-PLD-Builder-Info
[Back to list of logs] [View rpm -qa of builder]