FailedOk

th/SRPMS[OK]
th/x32[OK]
th/i686[OK]
th/x86_64[OK]

ac/SRPMS[OK]
ac/i386[OK]
ac/i586[OK]
ac/i686[OK]
ac/alpha[OK]
ac/amd64[OK]
ac/athlon[OK]
ac/ppc[OK]
ac/sparc[OK]
ac/sparc64[OK]

Advanced Search
main()
Powered by PLD Linux
(c) 2002-2018 PLD Team
$Revision: 1.37 $
Powered by Multics.
Your IP: 54.158.52.166

libnasl 142a625e-bb6b-4c0d-8cad-f1ef35a33401

Status:Failed
Source URL:ftp://buildlogs.pld-linux.org/th/x86_64/FAIL/libnasl,142a625e-bb6b-4c0d-8cad-f1ef35a33401.bz2
text/plain URL:View!
rpm -qa of builder:View!
Date:2018/09/14 20:29:53
Runtime:0:00:14.007217

Toc:

  • prep
  • Executing(%prep): /bin/sh -e /tmp/B.9LFA3i/BUILD/tmp/rpm-tmp.78035
  • build
  • Executing(%build): /bin/sh -e /tmp/B.9LFA3i/BUILD/tmp/rpm-tmp.78035
  • error 1
  • nasl_crypto2.c:181:16: error: dereferencing pointer to incomplete type 'RSA' {aka 'struct rsa_st'}
  • error 2
  • nasl_crypto2.c:188:16: error: dereferencing pointer to incomplete type 'DSA' {aka 'struct dsa_st'}
  • error 3
  • nasl_crypto2.c:263:5: error: dereferencing pointer to incomplete type 'DH' {aka 'struct dh_st'}
  • error 4
  • nasl_crypto2.c:642:51: error: dereferencing pointer to incomplete type 'DSA_SIG' {aka 'struct DSA_SIG_st'}
  • error 5
  • make[1]: *** [Makefile:129: nasl_crypto2.o] Error 1
  • error 6
  • error: Bad exit status from /tmp/B.9LFA3i/BUILD/tmp/rpm-tmp.78035 (%build)
  • error 7
  • RPM build errors:
  • error 8
  • error: No files produced.

Content:

request from: arekm
checking if we should skip the build
started at: Fri Sep 14 20:29:36 2018
killing old processes on a builder
mesg: ttyname failed: Inappropriate ioctl for device
sending signal 9 to pid -1
Killed
cleaning up /tmp
mesg: ttyname failed: Inappropriate ioctl for device
fetching https://srcbuilder.pld-linux.org/th//srpms/142a625e-bb6b-4c0d-8cad-f1ef35a33401/libnasl-2.2.7-6.src.rpm
fetched 380041 bytes, 800.1 K/s
installing srpm: libnasl-2.2.7-6.src.rpm
mesg: ttyname failed: Inappropriate ioctl for device
+ install -d /tmp/B.9LFA3i/BUILD /tmp/B.9LFA3i/RPMS
+ LC_ALL=en_US.UTF-8
+ rpm -qp --changelog libnasl-2.2.7-6.src.rpm
* Fri Sep 14 2018 PLD Linux Team <feedback@pld-linux.org>
- For complete changelog see: http://git.pld-linux.org/?p=packages/libnasl.git;a=log;h=master
* Fri Sep 14 2018 Arkadiusz Miƛkiewicz <arekm@maven.pl> 530fc01
- release 6 (by relup.sh) + rpm -Uhv --nodeps --define '_topdir /tmp/B.9LFA3i' --define '_specdir %{_topdir}' --define '_sourcedir %{_specdir}' --define '_rpmdir %{_topdir}/RPMS' --define '_builddir %{_topdir}/BUILD' libnasl-2.2.7-6.src.rpm Preparing... ################################################## libnasl ################################################## + rm -f libnasl-2.2.7-6.src.rpm mesg: ttyname failed: Inappropriate ioctl for device + install -m 700 -d /tmp/B.9LFA3i/BUILD/tmp mesg: ttyname failed: Inappropriate ioctl for device + TMPDIR=/tmp/B.9LFA3i/BUILD/tmp + exec nice -n 0 rpmbuild -bp --short-circuit --nodeps --define '_topdir /tmp/B.9LFA3i' --define '_specdir %{_topdir}' --define '_sourcedir %{_specdir}' --define '_rpmdir %{_topdir}/RPMS' --define '_builddir %{_topdir}/BUILD' --target x86_64-pld-linux --define 'prep exit 0' /tmp/B.9LFA3i/libnasl.spec Building target platforms: x86_64-pld-linux checking BuildConflict-ing packages no BuildConflicts found checking BR rpm: Building target platforms: x86_64-pld-linux no BR needed building RPM using: set -ex; : build-id: 142a625e-bb6b-4c0d-8cad-f1ef35a33401; TMPDIR=/tmp/B.9LFA3i/BUILD/tmp exec nice -n 0 rpmbuild -bb --define '_smp_mflags -j9' --define '_make_opts -Otarget' --define '_pld_builder 1' --define '_topdir /tmp/B.9LFA3i' --define '_specdir %{_topdir}' --define '_sourcedir %{_specdir}' --define '_rpmdir %{_topdir}/RPMS' --define '_builddir %{_topdir}/BUILD' --target x86_64-pld-linux /tmp/B.9LFA3i/libnasl.spec mesg: ttyname failed: Inappropriate ioctl for device + : build-id: 142a625e-bb6b-4c0d-8cad-f1ef35a33401 + TMPDIR=/tmp/B.9LFA3i/BUILD/tmp + exec nice -n 0 rpmbuild -bb --define '_smp_mflags -j9' --define '_make_opts -Otarget' --define '_pld_builder 1' --define '_topdir /tmp/B.9LFA3i' --define '_specdir %{_topdir}' --define '_sourcedir %{_specdir}' --define '_rpmdir %{_topdir}/RPMS' --define '_builddir %{_topdir}/BUILD' --target x86_64-pld-linux /tmp/B.9LFA3i/libnasl.spec Building target platforms: x86_64-pld-linux Executing(%prep): /bin/sh -e /tmp/B.9LFA3i/BUILD/tmp/rpm-tmp.78035 + umask 022 + cd /tmp/B.9LFA3i/BUILD + cd /tmp/B.9LFA3i/BUILD + rm -rf libnasl + /usr/bin/gzip -dc /tmp/B.9LFA3i/libnasl-2.2.7.tar.gz + /bin/tar -xf - + STATUS=0 + '[' 0 -ne 0 ']' + cd libnasl + /bin/id -u + '[' 1000 '=' 0 ']' + /bin/id -u + '[' 1000 '=' 0 ']' + /bin/chmod -Rf a+rX,u+w,g-w,o-w . + echo 'Patch #0 (libnasl-ac_fix.patch):' Patch #0 (libnasl-ac_fix.patch): + '[' -f /tmp/B.9LFA3i/libnasl-ac_fix.patch ']' + /bin/cat /tmp/B.9LFA3i/libnasl-ac_fix.patch + /usr/bin/patch -s -p1 + echo 'Patch #1 (libnasl-linkshared.patch):' Patch #1 (libnasl-linkshared.patch): + '[' -f /tmp/B.9LFA3i/libnasl-linkshared.patch ']' + /bin/cat /tmp/B.9LFA3i/libnasl-linkshared.patch + /usr/bin/patch -s -p1 + echo 'Patch #2 (libnasl-libtool.patch):' Patch #2 (libnasl-libtool.patch): + '[' -f /tmp/B.9LFA3i/libnasl-libtool.patch ']' + /bin/cat /tmp/B.9LFA3i/libnasl-libtool.patch + /usr/bin/patch -s -p1 + exit 0 Executing(%build): /bin/sh -e /tmp/B.9LFA3i/BUILD/tmp/rpm-tmp.78035 TMP=/home/users/builder/tmp HOME=/home/users/builder PATH=/home/users/builder/GNUstep/Tools:/usr/local/bin:/usr/bin:/bin:/home/users/builder/bin TMPDIR=/tmp/B.9LFA3i/BUILD/tmp + umask 022 + cd /tmp/B.9LFA3i/BUILD + cd libnasl + libtoolize --copy --force --install libtoolize: putting auxiliary files in '.'. libtoolize: copying file './config.guess' libtoolize: copying file './config.sub' libtoolize: copying file './install-sh' libtoolize: copying file './ltmain.sh' libtoolize: You should add the contents of the following files to 'aclocal.m4': libtoolize: '/usr/share/aclocal/libtool.m4' libtoolize: '/usr/share/aclocal/ltoptions.m4' libtoolize: '/usr/share/aclocal/ltsugar.m4' libtoolize: '/usr/share/aclocal/ltversion.m4' libtoolize: '/usr/share/aclocal/lt~obsolete.m4' libtoolize: Consider adding 'AC_CONFIG_MACRO_DIRS([m4])' to configure.in, libtoolize: and rerunning libtoolize and aclocal. libtoolize: Consider adding '-I m4' to ACLOCAL_AMFLAGS in Makefile.am. + aclocal aclocal: warning: autoconf input should be named 'configure.ac', not 'configure.in' + autoconf + ./configure 'LDFLAGS=-Wl,--as-needed -Wl,--no-copy-dt-needed-entries -Wl,-z,relro -Wl,-z,combreloc ' 'CFLAGS=-O2 -fwrapv -pipe -Wformat -Werror=format-security -gdwarf-4 -fno-debug-types-section -fvar-tracking-assignments -g2 -Wp,-D_FORTIFY_SOURCE=2 -fstack-protector-strong --param=ssp-buffer-size=4 -fPIC -march=x86-64 -gdwarf-4 -fno-debug-types-section -fvar-tracking-assignments -g2 ' 'CXXFLAGS=-O2 -fwrapv -pipe -Wformat -Werror=format-security -gdwarf-4 -fno-debug-types-section -fvar-tracking-assignments -g2 -Wp,-D_FORTIFY_SOURCE=2 -fstack-protector-strong --param=ssp-buffer-size=4 -fPIC -march=x86-64 -gdwarf-4 -fno-debug-types-section -fvar-tracking-assignments -g2 ' 'FFLAGS=-O2 -fwrapv -pipe -Wformat -Werror=format-security -gdwarf-4 -fno-debug-types-section -fvar-tracking-assignments -g2 -Wp,-D_FORTIFY_SOURCE=2 -fstack-protector-strong --param=ssp-buffer-size=4 -fPIC -march=x86-64 -gdwarf-4 -fno-debug-types-section -fvar-tracking-assignments -g2 ' 'FCFLAGS=-O2 -fwrapv -pipe -Wformat -Werror=format-security -gdwarf-4 -fno-debug-types-section -fvar-tracking-assignments -g2 -Wp,-D_FORTIFY_SOURCE=2 -fstack-protector-strong --param=ssp-buffer-size=4 -fPIC -march=x86-64 -gdwarf-4 -fno-debug-types-section -fvar-tracking-assignments -g2 ' 'CPPFLAGS=' 'CC=x86_64-pld-linux-gcc' 'CXX=x86_64-pld-linux-g++' '--host=x86_64-pld-linux' '--build=x86_64-pld-linux' '--prefix=/usr' '--exec-prefix=/usr' '--bindir=/usr/bin' '--sbindir=/usr/sbin' '--sysconfdir=/etc' '--datadir=/usr/share' '--includedir=/usr/include' '--libdir=/usr/lib64' '--libexecdir=/usr/libexec' '--localstatedir=/var/lib' '--sharedstatedir=/var/lib' '--mandir=/usr/share/man' '--infodir=/usr/share/info' '--x-libraries=/usr/lib64' checking for x86_64-pld-linux-gcc... x86_64-pld-linux-gcc checking whether the C compiler works... yes checking for C compiler default output file name... a.out checking for suffix of executables... checking whether we are cross compiling... no checking for suffix of object files... o checking whether we are using the GNU C compiler... yes checking whether x86_64-pld-linux-gcc accepts -g... yes checking for x86_64-pld-linux-gcc option to accept ISO C89... none needed checking build system type... x86_64-pld-linux-gnu checking host system type... x86_64-pld-linux-gnu checking how to print strings... print -r checking for a sed that does not truncate output... /bin/sed checking for grep that handles long lines and -e... /bin/grep checking for egrep... /bin/grep -E checking for fgrep... /bin/grep -F checking for ld used by x86_64-pld-linux-gcc... /usr/bin/ld checking if the linker (/usr/bin/ld) is GNU ld... yes checking for BSD- or MS-compatible name lister (nm)... /usr/bin/nm -B checking the name lister (/usr/bin/nm -B) interface... BSD nm checking whether ln -s works... yes checking the maximum length of command line arguments... 1572864 checking how to convert x86_64-pld-linux-gnu file names to x86_64-pld-linux-gnu format... func_convert_file_noop checking how to convert x86_64-pld-linux-gnu file names to toolchain format... func_convert_file_noop checking for /usr/bin/ld option to reload object files... -r checking for x86_64-pld-linux-objdump... objdump checking how to recognize dependent libraries... pass_all checking for x86_64-pld-linux-dlltool... dlltool checking how to associate runtime and link libraries... print -r -- checking for x86_64-pld-linux-ar... no checking for ar... ar checking for archiver @FILE support... @ checking for x86_64-pld-linux-strip... no checking for strip... strip checking for x86_64-pld-linux-ranlib... no checking for ranlib... ranlib checking for mawk... mawk checking command to parse /usr/bin/nm -B output from x86_64-pld-linux-gcc object... ok checking for sysroot... no checking for a working dd... /bin/dd checking how to truncate binary pipes... /bin/dd bs=4096 count=1 checking for x86_64-pld-linux-mt... no checking for mt... no checking if : is a manifest tool... no checking how to run the C preprocessor... x86_64-pld-linux-gcc -E checking for ANSI C header files... yes checking for sys/types.h... yes checking for sys/stat.h... yes checking for stdlib.h... yes checking for string.h... yes checking for memory.h... yes checking for strings.h... yes checking for inttypes.h... yes checking for stdint.h... yes checking for unistd.h... yes checking for dlfcn.h... yes checking for objdir... .libs checking if x86_64-pld-linux-gcc supports -fno-rtti -fno-exceptions... no checking for x86_64-pld-linux-gcc option to produce PIC... -fPIC -DPIC checking if x86_64-pld-linux-gcc PIC flag -fPIC -DPIC works... yes checking if x86_64-pld-linux-gcc static flag -static works... yes checking if x86_64-pld-linux-gcc supports -c -o file.o... yes checking if x86_64-pld-linux-gcc supports -c -o file.o... (cached) yes checking whether the x86_64-pld-linux-gcc linker (/usr/bin/ld -m elf_x86_64) supports shared libraries... yes checking whether -lc should be explicitly linked in... no checking dynamic linker characteristics... GNU/Linux ld.so checking how to hardcode library paths into programs... immediate checking whether stripping libraries is possible... yes checking if libtool supports shared libraries... yes checking whether to build shared libraries... yes checking whether to build static libraries... yes checking whether make sets $(MAKE)... yes checking for a BSD-compatible install... /usr/bin/install -c checking if the compiler understands -pipe... yes checking for nessus-config... /usr/bin/nessus-config checking openssl/md2.h usability... yes checking openssl/md2.h presence... yes checking for openssl/md2.h... yes checking openssl/md4.h usability... yes checking openssl/md4.h presence... yes checking for openssl/md4.h... yes checking openssl/md5.h usability... yes checking openssl/md5.h presence... yes checking for openssl/md5.h... yes checking for bison... /usr/bin/bison checking for ANSI C header files... (cached) yes checking for sys/wait.h that is POSIX.1 compatible... yes checking whether time.h and sys/time.h may both be included... yes checking for dirent.h that defines DIR... yes checking for library containing opendir... none required checking for main in -lrpcsvc... yes checking /usr/ucbinclude/fcntl.h usability... no checking /usr/ucbinclude/fcntl.h presence... no checking for /usr/ucbinclude/fcntl.h... no checking for unistd.h... (cached) yes checking getopt.h usability... yes checking getopt.h presence... yes checking for getopt.h... yes checking for string.h... (cached) yes checking for strings.h... (cached) yes checking sys/sockio.h usability... no checking sys/sockio.h presence... no checking for sys/sockio.h... no checking sys/socketio.h usability... no checking sys/socketio.h presence... no checking for sys/socketio.h... no checking for netinet/in.h... yes checking for netinet/in_systm.h... yes checking for netinet/ip.h... yes checking for netinet/ip_icmp.h... yes checking for netinet/ip.h... (cached) yes checking for netinet/udp.h... yes checking for netinet/protocols.h... no checking for netinet/ip_udp.h... no checking for netinet/ip_tcp.h... no checking for netinet/tcpip.h... no checking sys/param.h usability... yes checking sys/param.h presence... yes checking for sys/param.h... yes checking sys/ioctl.h usability... yes checking sys/ioctl.h presence... yes checking for sys/ioctl.h... yes checking rpc/rpc.h usability... yes checking rpc/rpc.h presence... yes checking for rpc/rpc.h... yes checking for dlfcn.h... (cached) yes checking sys/un.h usability... yes checking sys/un.h presence... yes checking for sys/un.h... yes checking for memory.h... (cached) yes checking ctype.h usability... yes checking ctype.h presence... yes checking for ctype.h... yes checking errno.h usability... yes checking errno.h presence... yes checking for errno.h... yes checking for sys/types.h... (cached) yes checking for stdlib.h... (cached) yes checking stdio.h usability... yes checking stdio.h presence... yes checking for stdio.h... yes checking pthread.h usability... yes checking pthread.h presence... yes checking for pthread.h... yes checking sys/filio.h usability... no checking sys/filio.h presence... no checking for sys/filio.h... no checking pwd.h usability... yes checking pwd.h presence... yes checking for pwd.h... yes checking assert.h usability... yes checking assert.h presence... yes checking for assert.h... yes checking netdb.h usability... yes checking netdb.h presence... yes checking for netdb.h... yes checking for netinet/in.h... (cached) yes checking arpa/inet.h usability... yes checking arpa/inet.h presence... yes checking for arpa/inet.h... yes checking poll.h usability... yes checking poll.h presence... yes checking for poll.h... yes checking sys/poll.h usability... yes checking sys/poll.h presence... yes checking for sys/poll.h... yes checking for netinet/ip_tcp.h... (cached) no checking for sys/stat.h... (cached) yes checking stat.h usability... no checking stat.h presence... no checking for stat.h... no checking net/if.h usability... yes checking net/if.h presence... yes checking for net/if.h... yes checking sys/mman.h usability... yes checking sys/mman.h presence... yes checking for sys/mman.h... yes checking search.h usability... yes checking search.h presence... yes checking for search.h... yes checking locale.h usability... yes checking locale.h presence... yes checking for locale.h... yes checking sys/socket.h usability... yes checking sys/socket.h presence... yes checking for sys/socket.h... yes checking for netinet/ip.h... (cached) yes checking netinet/tcp.h usability... yes checking netinet/tcp.h presence... yes checking for netinet/tcp.h... yes checking for size_t... yes checking for working alloca.h... yes checking for alloca... yes checking for lstat... yes checking for memmove... yes checking for gettimeofday... yes checking for gethrtime... no checking for getrusage... yes checking for rand... yes checking for strchr... yes checking for memcpy... yes checking for select... yes checking for poll... yes checking for vsnprintf... yes checking for memmem... yes checking for bzero... yes checking for bcopy... yes checking for addr2ascii... no checking for inet_neta... no checking for signal... yes checking for sigaction... yes checking for wait... yes checking for wait3... yes checking for wait4... yes checking for waitpid... yes checking for lfind... yes checking for lfind in -lcompat... no checking whether byte ordering is bigendian... no checking for time_t... yes checking for pid_t... yes checking for size_t... (cached) yes checking for uid_t in sys/types.h... yes checking size of short... 2 checking size of int... 4 checking size of long... 8 checking struct ip contains ip_csum... no checking struct ip... yes checking struct ip has ip_hl... yes checking struct icmp... yes checking struct udphdr... yes checking BSD struct udphdr... yes checking struct tcphdr... yes checking struct tcphdr has th_off... yes checking struct tcphdr has th_x2_off... no checking for long file names... yes checking for inet_aton in -lc... yes checking for inet_aton in -lresolv... yes checking for inet_aton in -lsocket... no checking for inet_aton in -lnsl... yes checking if sockaddr{} has sa_len member... no checking for a working strndup implementation... no checking for pcap_restart in -lpcap... no checking for pcap_yyrestart in -lpcap... no checking for yyrestart in -lpcap... no no yacc restart func found perhaps libpcap wasn't compiled with bison/flex? configure: creating ./config.status config.status: creating nasl.tmpl config.status: WARNING: 'nasl.tmpl.in' seems to ignore the --datarootdir setting config.status: creating nasl-config config.status: creating include/config.h config.status: creating nasl/strutils.h config.status: executing libtool commands + /usr/bin/make -Otarget -j9 -j1 cd nasl && /usr/bin/make make[1]: Entering directory '/tmp/B.9LFA3i/BUILD/libnasl/nasl' /bin/sh /tmp/B.9LFA3i/BUILD/libnasl/libtool --silent --mode=compile x86_64-pld-linux-gcc -pipe -O2 -fwrapv -pipe -Wformat -Werror=format-security -gdwarf-4 -fno-debug-types-section -fvar-tracking-assignments -g2 -Wp,-D_FORTIFY_SOURCE=2 -fstack-protector-strong --param=ssp-buffer-size=4 -fPIC -march=x86-64 -gdwarf-4 -fno-debug-types-section -fvar-tracking-assignments -g2 `sh ./cflags` -c nasl_packet_forgery.c nasl_packet_forgery.c: In function 'nasl_tcp_ping': nasl_packet_forgery.c:1265:23: warning: implicit declaration of function 'bpf_next_tv'; did you mean 'bpf_next'? [-Wimplicit-function-declaration] if(bpf >= 0 && (pk = bpf_next_tv(bpf, &len, &tv)))flag++; ^~~~~~~~~~~ bpf_next nasl_packet_forgery.c:1265:21: warning: assignment to 'u_char *' {aka 'unsigned char *'} from 'int' makes pointer from integer without a cast [-Wint-conversion] if(bpf >= 0 && (pk = bpf_next_tv(bpf, &len, &tv)))flag++; ^ nasl_packet_forgery.c: In function 'nasl_pcap_next': nasl_packet_forgery.c:1407:2: warning: 'pcap_lookupdev' is deprecated: use 'pcap_findalldevs' and use the first device [-Wdeprecated-declarations] if( interface == NULL )interface = pcap_lookupdev(errbuf); ^~ In file included from /usr/include/pcap.h:43, from ../include/includes.h:223, from nasl_packet_forgery.c:19: /usr/include/pcap/pcap.h:326:16: note: declared here PCAP_API char *pcap_lookupdev(char *) ^~~~~~~~~~~~~~ nasl_packet_forgery.c: In function 'nasl_send_capture': nasl_packet_forgery.c:1493:2: warning: 'pcap_lookupdev' is deprecated: use 'pcap_findalldevs' and use the first device [-Wdeprecated-declarations] if( interface == NULL )interface = pcap_lookupdev(errbuf); ^~ In file included from /usr/include/pcap.h:43, from ../include/includes.h:223, from nasl_packet_forgery.c:19: /usr/include/pcap/pcap.h:326:16: note: declared here PCAP_API char *pcap_lookupdev(char *) ^~~~~~~~~~~~~~ /bin/sh /tmp/B.9LFA3i/BUILD/libnasl/libtool --silent --mode=compile x86_64-pld-linux-gcc -pipe -O2 -fwrapv -pipe -Wformat -Werror=format-security -gdwarf-4 -fno-debug-types-section -fvar-tracking-assignments -g2 -Wp,-D_FORTIFY_SOURCE=2 -fstack-protector-strong --param=ssp-buffer-size=4 -fPIC -march=x86-64 -gdwarf-4 -fno-debug-types-section -fvar-tracking-assignments -g2 `sh ./cflags` -c nasl_socket.c /bin/sh /tmp/B.9LFA3i/BUILD/libnasl/libtool --silent --mode=compile x86_64-pld-linux-gcc -pipe -O2 -fwrapv -pipe -Wformat -Werror=format-security -gdwarf-4 -fno-debug-types-section -fvar-tracking-assignments -g2 -Wp,-D_FORTIFY_SOURCE=2 -fstack-protector-strong --param=ssp-buffer-size=4 -fPIC -march=x86-64 -gdwarf-4 -fno-debug-types-section -fvar-tracking-assignments -g2 `sh ./cflags` -c nasl_crypto.c nasl_crypto.c: In function 'nasl_sha': nasl_crypto.c:115:2: warning: implicit declaration of function 'SHA'; did you mean 'SHA1'? [-Wimplicit-function-declaration] SHA((unsigned char*)data, len, (unsigned char*)md); ^~~ SHA1 nasl_crypto.c: In function 'nasl_hmac_sha': nasl_crypto.c:209:26: warning: implicit declaration of function 'EVP_sha'; did you mean 'EVP_sha1'? [-Wimplicit-function-declaration] return nasl_hmac(lexic, EVP_sha()); ^~~~~~~ EVP_sha1 nasl_crypto.c:209:26: warning: passing argument 2 of 'nasl_hmac' makes pointer from integer without a cast [-Wint-conversion] return nasl_hmac(lexic, EVP_sha()); ^~~~~~~~~ nasl_crypto.c:171:63: note: expected 'const EVP_MD *' {aka 'const struct evp_md_st *'} but argument is of type 'int' static tree_cell * nasl_hmac(lex_ctxt * lexic, const EVP_MD * evp_md) ~~~~~~~~~~~~~~~^~~~~~ nasl_crypto.c: In function 'nasl_hmac_dss': nasl_crypto.c:221:26: warning: implicit declaration of function 'EVP_dss'; did you mean 'EVP_rc4'? [-Wimplicit-function-declaration] return nasl_hmac(lexic, EVP_dss()); ^~~~~~~ EVP_rc4 nasl_crypto.c:221:26: warning: passing argument 2 of 'nasl_hmac' makes pointer from integer without a cast [-Wint-conversion] return nasl_hmac(lexic, EVP_dss()); ^~~~~~~~~ nasl_crypto.c:171:63: note: expected 'const EVP_MD *' {aka 'const struct evp_md_st *'} but argument is of type 'int' static tree_cell * nasl_hmac(lex_ctxt * lexic, const EVP_MD * evp_md) ~~~~~~~~~~~~~~~^~~~~~ /bin/sh /tmp/B.9LFA3i/BUILD/libnasl/libtool --silent --mode=compile x86_64-pld-linux-gcc -pipe -O2 -fwrapv -pipe -Wformat -Werror=format-security -gdwarf-4 -fno-debug-types-section -fvar-tracking-assignments -g2 -Wp,-D_FORTIFY_SOURCE=2 -fstack-protector-strong --param=ssp-buffer-size=4 -fPIC -march=x86-64 -gdwarf-4 -fno-debug-types-section -fvar-tracking-assignments -g2 `sh ./cflags` -c -DNESSUS_STATE_DIR=\"/var/lib\" nasl_crypto2.c nasl_crypto2.c: In function 'nasl_pem_to': nasl_crypto2.c:181:16: error: dereferencing pointer to incomplete type 'RSA' {aka 'struct rsa_st'} key = rsa->d; ^~ nasl_crypto2.c:188:16: error: dereferencing pointer to incomplete type 'DSA' {aka 'struct dsa_st'} key = dsa->priv_key; ^~ nasl_crypto2.c: In function 'nasl_dh_generate_key': nasl_crypto2.c:263:5: error: dereferencing pointer to incomplete type 'DH' {aka 'struct dh_st'} dh->p = BN_new(); ^~ nasl_crypto2.c: In function 'nasl_dsa_do_verify': nasl_crypto2.c:642:51: error: dereferencing pointer to incomplete type 'DSA_SIG' {aka 'struct DSA_SIG_st'} if (BN_bin2bn((const unsigned char*)r, rlen, sig->r) == 0) ^~ nasl_crypto2.c: In function 'generate_signed_script': nasl_crypto2.c:850:9: warning: too many arguments for format [-Wformat-extra-args] printf("\n", len); ^~~~ nasl_crypto2.c: In function 'verify_script_signature': nasl_crypto2.c:910:24: warning: cast from pointer to integer of different size [-Wpointer-to-int-cast] msg_len = msg_len - ( (int)t - (int)msg); ^ nasl_crypto2.c:910:33: warning: cast from pointer to integer of different size [-Wpointer-to-int-cast] msg_len = msg_len - ( (int)t - (int)msg); ^ make[1]: *** [Makefile:129: nasl_crypto2.o] Error 1 make[1]: Leaving directory '/tmp/B.9LFA3i/BUILD/libnasl/nasl' make: *** [Makefile:4: all] Error 2 error: Bad exit status from /tmp/B.9LFA3i/BUILD/tmp/rpm-tmp.78035 (%build) RPM build errors: Bad exit status from /tmp/B.9LFA3i/BUILD/tmp/rpm-tmp.78035 (%build) ended at: Fri Sep 14 20:29:53 2018, done in 0:00:14.007217 error: No files produced. mesg: ttyname failed: Inappropriate ioctl for device + chmod -R u+rwX /tmp/B.9LFA3i/BUILD + rm -rf /tmp/B.9LFA3i/tmp /tmp/B.9LFA3i/BUILD mesg: ttyname failed: Inappropriate ioctl for device + rm -rf /tmp/B.9LFA3i Begin-PLD-Builder-Info Build-Time: user:11.32s sys:2.33s real:17.54s (faults io:0 non-io:1170411) End-PLD-Builder-Info
[Back to list of logs] [View rpm -qa of builder]