FailedOk

th/SRPMS[OK]
th/x32[OK]
th/i686[OK]
th/x86_64[OK]

ac/SRPMS[OK]
ac/i386[OK]
ac/i586[OK]
ac/i686[OK]
ac/alpha[OK]
ac/amd64[OK]
ac/athlon[OK]
ac/ppc[OK]
ac/sparc[OK]
ac/sparc64[OK]

Advanced Search
main()
Powered by PLD Linux
(c) 2002-2018 PLD Team
$Revision: 1.37 $
Powered by voodoo magic.
Your IP: 54.158.52.166

libnasl 142a625e-bb6b-4c0d-8cad-f1ef35a33401

Status:Failed
Source URL:ftp://buildlogs.pld-linux.org/th/x86_64/FAIL/libnasl,142a625e-bb6b-4c0d-8cad-f1ef35a33401.bz2
text/plain URL:View!
full text:View!
rpm -qa of builder:View!
Date:2018/09/14 20:29:53
Runtime:0:00:14.007217

Toc:

  • error 1
  • nasl_crypto2.c:181:16: error: dereferencing pointer to incomplete type 'RSA' {aka 'struct rsa_st'}
  • error 2
  • nasl_crypto2.c:188:16: error: dereferencing pointer to incomplete type 'DSA' {aka 'struct dsa_st'}
  • error 3
  • nasl_crypto2.c:263:5: error: dereferencing pointer to incomplete type 'DH' {aka 'struct dh_st'}
  • error 4
  • nasl_crypto2.c:642:51: error: dereferencing pointer to incomplete type 'DSA_SIG' {aka 'struct DSA_SIG_st'}
  • error 5
  • make[1]: *** [Makefile:129: nasl_crypto2.o] Error 1
  • error 6
  • error: Bad exit status from /tmp/B.9LFA3i/BUILD/tmp/rpm-tmp.78035 (%build)
  • error 7
  • RPM build errors:
  • error 8
  • error: No files produced.

Content:

checking whether byte ordering is bigendian... no
checking for time_t... yes
checking for pid_t... yes
checking for size_t... (cached) yes
checking for uid_t in sys/types.h... yes
checking size of short... 2
checking size of int... 4
checking size of long... 8
checking struct ip contains ip_csum... no
checking struct ip... yes
checking struct ip has ip_hl... yes
checking struct icmp... yes
checking struct udphdr... yes
checking BSD struct udphdr... yes
checking struct tcphdr... yes
checking struct tcphdr has th_off... yes
checking struct tcphdr has th_x2_off... no
checking for long file names... yes
checking for inet_aton in -lc... yes
checking for inet_aton in -lresolv... yes
checking for inet_aton in -lsocket... no
checking for inet_aton in -lnsl... yes
checking if sockaddr{} has sa_len member... no
checking for a working strndup implementation... no
checking for pcap_restart in -lpcap... no
checking for pcap_yyrestart in -lpcap... no
checking for yyrestart in -lpcap... no
no yacc restart func found
perhaps libpcap wasn't compiled with bison/flex?
configure: creating ./config.status
config.status: creating nasl.tmpl
config.status: WARNING:  'nasl.tmpl.in' seems to ignore the --datarootdir setting
config.status: creating nasl-config
config.status: creating include/config.h
config.status: creating nasl/strutils.h
config.status: executing libtool commands
+ /usr/bin/make -Otarget -j9 -j1
cd nasl && /usr/bin/make
make[1]: Entering directory '/tmp/B.9LFA3i/BUILD/libnasl/nasl'
/bin/sh /tmp/B.9LFA3i/BUILD/libnasl/libtool --silent --mode=compile x86_64-pld-linux-gcc -pipe -O2 -fwrapv -pipe -Wformat -Werror=format-security -gdwarf-4 -fno-debug-types-section -fvar-tracking-assignments -g2 -Wp,-D_FORTIFY_SOURCE=2 -fstack-protector-strong --param=ssp-buffer-size=4 -fPIC -march=x86-64 -gdwarf-4 -fno-debug-types-section -fvar-tracking-assignments -g2   `sh ./cflags`  -c nasl_packet_forgery.c
nasl_packet_forgery.c: In function 'nasl_tcp_ping':
nasl_packet_forgery.c:1265:23: warning: implicit declaration of function 'bpf_next_tv'; did you mean 'bpf_next'? [-Wimplicit-function-declaration]
  if(bpf >= 0 && (pk = bpf_next_tv(bpf, &len, &tv)))flag++;
                       ^~~~~~~~~~~
                       bpf_next
nasl_packet_forgery.c:1265:21: warning: assignment to 'u_char *' {aka 'unsigned char *'} from 'int' makes pointer from integer without a cast [-Wint-conversion]
  if(bpf >= 0 && (pk = bpf_next_tv(bpf, &len, &tv)))flag++;
                     ^
nasl_packet_forgery.c: In function 'nasl_pcap_next':
nasl_packet_forgery.c:1407:2: warning: 'pcap_lookupdev' is deprecated: use 'pcap_findalldevs' and use the first device [-Wdeprecated-declarations]
  if( interface == NULL )interface = pcap_lookupdev(errbuf);
  ^~
In file included from /usr/include/pcap.h:43,
                 from ../include/includes.h:223,
                 from nasl_packet_forgery.c:19:
/usr/include/pcap/pcap.h:326:16: note: declared here
 PCAP_API char *pcap_lookupdev(char *)
                ^~~~~~~~~~~~~~
nasl_packet_forgery.c: In function 'nasl_send_capture':
nasl_packet_forgery.c:1493:2: warning: 'pcap_lookupdev' is deprecated: use 'pcap_findalldevs' and use the first device [-Wdeprecated-declarations]
  if( interface == NULL )interface = pcap_lookupdev(errbuf);
  ^~
In file included from /usr/include/pcap.h:43,
                 from ../include/includes.h:223,
                 from nasl_packet_forgery.c:19:
/usr/include/pcap/pcap.h:326:16: note: declared here
 PCAP_API char *pcap_lookupdev(char *)
                ^~~~~~~~~~~~~~
/bin/sh /tmp/B.9LFA3i/BUILD/libnasl/libtool --silent --mode=compile x86_64-pld-linux-gcc -pipe -O2 -fwrapv -pipe -Wformat -Werror=format-security -gdwarf-4 -fno-debug-types-section -fvar-tracking-assignments -g2 -Wp,-D_FORTIFY_SOURCE=2 -fstack-protector-strong --param=ssp-buffer-size=4 -fPIC -march=x86-64 -gdwarf-4 -fno-debug-types-section -fvar-tracking-assignments -g2   `sh ./cflags`  -c nasl_socket.c
/bin/sh /tmp/B.9LFA3i/BUILD/libnasl/libtool --silent --mode=compile x86_64-pld-linux-gcc -pipe -O2 -fwrapv -pipe -Wformat -Werror=format-security -gdwarf-4 -fno-debug-types-section -fvar-tracking-assignments -g2 -Wp,-D_FORTIFY_SOURCE=2 -fstack-protector-strong --param=ssp-buffer-size=4 -fPIC -march=x86-64 -gdwarf-4 -fno-debug-types-section -fvar-tracking-assignments -g2   `sh ./cflags`  -c nasl_crypto.c
nasl_crypto.c: In function 'nasl_sha':
nasl_crypto.c:115:2: warning: implicit declaration of function 'SHA'; did you mean 'SHA1'? [-Wimplicit-function-declaration]
  SHA((unsigned char*)data, len, (unsigned char*)md);
  ^~~
  SHA1
nasl_crypto.c: In function 'nasl_hmac_sha':
nasl_crypto.c:209:26: warning: implicit declaration of function 'EVP_sha'; did you mean 'EVP_sha1'? [-Wimplicit-function-declaration]
  return nasl_hmac(lexic, EVP_sha());
                          ^~~~~~~
                          EVP_sha1
nasl_crypto.c:209:26: warning: passing argument 2 of 'nasl_hmac' makes pointer from integer without a cast [-Wint-conversion]
  return nasl_hmac(lexic, EVP_sha());
                          ^~~~~~~~~
nasl_crypto.c:171:63: note: expected 'const EVP_MD *' {aka 'const struct evp_md_st *'} but argument is of type 'int'
 static tree_cell * nasl_hmac(lex_ctxt * lexic, const EVP_MD * evp_md)
                                                ~~~~~~~~~~~~~~~^~~~~~
nasl_crypto.c: In function 'nasl_hmac_dss':
nasl_crypto.c:221:26: warning: implicit declaration of function 'EVP_dss'; did you mean 'EVP_rc4'? [-Wimplicit-function-declaration]
  return nasl_hmac(lexic, EVP_dss());
                          ^~~~~~~
                          EVP_rc4
nasl_crypto.c:221:26: warning: passing argument 2 of 'nasl_hmac' makes pointer from integer without a cast [-Wint-conversion]
  return nasl_hmac(lexic, EVP_dss());
                          ^~~~~~~~~
nasl_crypto.c:171:63: note: expected 'const EVP_MD *' {aka 'const struct evp_md_st *'} but argument is of type 'int'
 static tree_cell * nasl_hmac(lex_ctxt * lexic, const EVP_MD * evp_md)
                                                ~~~~~~~~~~~~~~~^~~~~~
/bin/sh /tmp/B.9LFA3i/BUILD/libnasl/libtool --silent --mode=compile x86_64-pld-linux-gcc -pipe -O2 -fwrapv -pipe -Wformat -Werror=format-security -gdwarf-4 -fno-debug-types-section -fvar-tracking-assignments -g2 -Wp,-D_FORTIFY_SOURCE=2 -fstack-protector-strong --param=ssp-buffer-size=4 -fPIC -march=x86-64 -gdwarf-4 -fno-debug-types-section -fvar-tracking-assignments -g2   `sh ./cflags`  -c -DNESSUS_STATE_DIR=\"/var/lib\" nasl_crypto2.c
nasl_crypto2.c: In function 'nasl_pem_to':
nasl_crypto2.c:181:16: error: dereferencing pointer to incomplete type 'RSA' {aka 'struct rsa_st'}
       key = rsa->d;
                ^~
nasl_crypto2.c:188:16: error: dereferencing pointer to incomplete type 'DSA' {aka 'struct dsa_st'}
       key = dsa->priv_key;
                ^~
nasl_crypto2.c: In function 'nasl_dh_generate_key':
nasl_crypto2.c:263:5: error: dereferencing pointer to incomplete type 'DH' {aka 'struct dh_st'}
   dh->p = BN_new();
     ^~
nasl_crypto2.c: In function 'nasl_dsa_do_verify':
nasl_crypto2.c:642:51: error: dereferencing pointer to incomplete type 'DSA_SIG' {aka 'struct DSA_SIG_st'}
   if (BN_bin2bn((const unsigned char*)r, rlen, sig->r) == 0)
                                                   ^~
nasl_crypto2.c: In function 'generate_signed_script':
nasl_crypto2.c:850:9: warning: too many arguments for format [-Wformat-extra-args]
  printf("\n", len);
         ^~~~
nasl_crypto2.c: In function 'verify_script_signature':
nasl_crypto2.c:910:24: warning: cast from pointer to integer of different size [-Wpointer-to-int-cast]
  msg_len = msg_len - ( (int)t - (int)msg);
                        ^
nasl_crypto2.c:910:33: warning: cast from pointer to integer of different size [-Wpointer-to-int-cast]
  msg_len = msg_len - ( (int)t - (int)msg);
                                 ^
make[1]: *** [Makefile:129: nasl_crypto2.o] Error 1
make[1]: Leaving directory '/tmp/B.9LFA3i/BUILD/libnasl/nasl'
make: *** [Makefile:4: all] Error 2
error: Bad exit status from /tmp/B.9LFA3i/BUILD/tmp/rpm-tmp.78035 (%build)


RPM build errors:
    Bad exit status from /tmp/B.9LFA3i/BUILD/tmp/rpm-tmp.78035 (%build)
ended at: Fri Sep 14 20:29:53 2018, done in 0:00:14.007217
error: No files produced.
mesg: ttyname failed: Inappropriate ioctl for device
+ chmod -R u+rwX /tmp/B.9LFA3i/BUILD
+ rm -rf /tmp/B.9LFA3i/tmp /tmp/B.9LFA3i/BUILD
mesg: ttyname failed: Inappropriate ioctl for device
+ rm -rf /tmp/B.9LFA3i
Begin-PLD-Builder-Info
Build-Time: user:11.32s sys:2.33s real:17.54s (faults io:0 non-io:1170411)

End-PLD-Builder-Info
[Back to list of logs] [View rpm -qa of builder]