FailedOk

th/SRPMS[OK]
th/x32[OK]
th/i686[OK]
th/x86_64[OK]

ac/SRPMS[OK]
ac/i386[OK]
ac/i586[OK]
ac/i686[OK]
ac/alpha[OK]
ac/amd64[OK]
ac/athlon[OK]
ac/ppc[OK]
ac/sparc[OK]
ac/sparc64[OK]

Advanced Search
main()
Powered by PLD Linux
(c) 2002-2020 PLD Team
$Revision: 1.37 $
Powered by achelon.
Your IP: 34.201.9.19

libopenraw 78c72b39-1110-415b-8e47-29a0e7d3ad3d

Status:Failed
Source URL:https://buildlogs.pld-linux.org/pld/th/x86_64/FAIL/libopenraw,78c72b39-1110-415b-8e47-29a0e7d3ad3d.bz2
text/plain URL:View!
full text:View!
rpm -qa of builder:View!
Date:2020/10/18 18:07:36
Runtime:0:00:27.325795

Toc:

  • error 1
  • error: failed to get `byteorder` as a dependency of package `mp4parse_capi v0.11.2 (/tmp/B.j2EJpF/BUILD/libopenraw-0.2.3/lib/mp4/mp4parse_capi)`
  • error 2
  • make[2]: *** [Makefile:1585: /tmp/B.j2EJpF/BUILD/libopenraw-0.2.3/lib/mp4/target/release/libmp4.a] Error 101
  • error 3
  • make[1]: *** [Makefile:435: all-recursive] Error 1
  • error 4
  • error: Bad exit status from /tmp/B.j2EJpF/BUILD/tmp/rpm-tmp.24176 (%build)
  • error 5
  • RPM build errors:
  • error 6
  • error: No files produced.

Content:

checking if x86_64-pld-linux-g++ supports -c -o file.o... yes
checking if x86_64-pld-linux-g++ supports -c -o file.o... (cached) yes
checking whether the x86_64-pld-linux-g++ linker (/usr/bin/ld -m elf_x86_64) supports shared libraries... yes
checking dynamic linker characteristics... (cached) GNU/Linux ld.so
checking how to hardcode library paths into programs... immediate
checking whether x86_64-pld-linux-g++ supports C++11 features by default... yes
checking for Boost headers version >= 1.33.0... yes
checking for Boost's header version... 1_73
checking for the toolset name used by Boost for x86_64-pld-linux-g++... configure: WARNING: could not figure out which toolset name to use for x86_64-pld-linux-g++

checking boost/test/unit_test.hpp usability... yes
checking boost/test/unit_test.hpp presence... yes
checking for boost/test/unit_test.hpp... yes
checking for the Boost unit_test_framework library... yes
checking boost/algorithm/string.hpp usability... yes
checking boost/algorithm/string.hpp presence... yes
checking for boost/algorithm/string.hpp... yes
checking boost/variant/variant_fwd.hpp usability... yes
checking boost/variant/variant_fwd.hpp presence... yes
checking for boost/variant/variant_fwd.hpp... yes
checking boost/variant.hpp usability... yes
checking boost/variant.hpp presence... yes
checking for boost/variant.hpp... yes
checking jpeglib.h usability... yes
checking jpeglib.h presence... yes
checking for jpeglib.h... yes
checking for x86_64-pld-linux-pkg-config... no
checking for pkg-config... /usr/bin/pkg-config
checking pkg-config is at least version 0.9.0... yes
checking for libxml-2.0 >= 2.5.0... yes
checking for libcurl... yes
checking for get_current_dir_name... yes
checking for glib-2.0 >= 2.0.0... yes
checking for gdk-pixbuf-2.0 >= 2.0.0... yes
checking whether C++ compiler accepts -fvisibility=hidden... yes
checking whether C++ compiler accepts -Werror=unknown-warning-option... no
checking whether C++ compiler accepts -Wchar-subscripts... yes
checking whether C++ compiler accepts -Wcast-align... yes
checking whether C++ compiler accepts -Wextra... yes
checking whether C++ compiler accepts -Wexceptions... no
checking whether C++ compiler accepts -Wheader-guard... no
checking whether C++ compiler accepts -Wformat... yes
checking whether C++ compiler accepts -Wformat-nonliteral... yes
checking whether C++ compiler accepts -Wformat-security... yes
checking whether C++ compiler accepts -Wno-gnu-zero-variadic-macro-arguments... yes
checking whether C++ compiler accepts -Wlogical-not-parentheses... yes
checking whether C++ compiler accepts -Wmisleading-indentation... yes
checking whether C++ compiler accepts -Wmissing-noreturn... yes
checking whether C++ compiler accepts -Woverloaded-virtual... yes
checking whether C++ compiler accepts -Wpointer-arith... yes
checking whether C++ compiler accepts -Wredundant-decls... yes
checking whether C++ compiler accepts -Wpointer-bool-conversion... no
checking whether C++ compiler accepts -Wshadow... yes
checking whether C++ compiler accepts -Wsign-compare... yes
checking whether C++ compiler accepts -Wno-suggest-attribute=noreturn... yes
checking whether C++ compiler accepts -Wsuggest-override... yes
checking whether C++ compiler accepts -Wnull-conversion... no
checking whether C++ compiler accepts -Wunreachable-code... yes
checking whether C++ compiler accepts -Wunused... yes
checking whether C++ compiler accepts -Wwrite-strings... yes
checking for cargo... yes
checking for rustc... yes
checking that generated files are newer than configure... done
configure: creating ./config.status
config.status: creating Makefile
config.status: creating include/Makefile
config.status: creating include/libopenraw/Makefile
config.status: creating include/libopenraw++/Makefile
config.status: creating lib/Makefile
config.status: creating lib/libopenraw-0.2.pc
config.status: creating gnome/Makefile
config.status: creating gnome/libopenraw-gnome-0.2.pc
config.status: creating gnome/include/Makefile
config.status: creating gnome/include/libopenraw-gnome/Makefile
config.status: creating doc/Makefile
config.status: creating doc/Doxyfile
config.status: creating doc/doxygen/Makefile
config.status: creating test/Makefile
config.status: creating testsuite/Makefile
config.status: creating tools/Makefile
config.status: creating demo/Makefile
config.status: creating config.h
config.status: executing depfiles commands
config.status: executing libtool commands

Options:

  Gnome support:        yes
  Testsuite booststrap: yes

+ /usr/bin/make -Otarget -j9
/usr/bin/make  all-recursive
Making all in lib
make[2]: Entering directory '/tmp/B.j2EJpF/BUILD/libopenraw-0.2.3/lib'
cd ./mp4 && \
CARGO_TARGET_DIR=/tmp/B.j2EJpF/BUILD/libopenraw-0.2.3/lib/mp4/target cargo build  --release
    Updating crates.io index
warning: spurious network error (2 tries remaining): failed to resolve address for github.com: Temporary failure in name resolution; class=Net (12)
warning: spurious network error (1 tries remaining): failed to resolve address for github.com: Temporary failure in name resolution; class=Net (12)
error: failed to get `byteorder` as a dependency of package `mp4parse_capi v0.11.2 (/tmp/B.j2EJpF/BUILD/libopenraw-0.2.3/lib/mp4/mp4parse_capi)`
    ... which is depended on by `mp4 v0.1.0 (/tmp/B.j2EJpF/BUILD/libopenraw-0.2.3/lib/mp4)`

Caused by:
  failed to fetch `https://github.com/rust-lang/crates.io-index`

Caused by:
  failed to resolve address for github.com: Temporary failure in name resolution; class=Net (12)
make[2]: *** [Makefile:1585: /tmp/B.j2EJpF/BUILD/libopenraw-0.2.3/lib/mp4/target/release/libmp4.a] Error 101
make[2]: Leaving directory '/tmp/B.j2EJpF/BUILD/libopenraw-0.2.3/lib'
make[1]: *** [Makefile:435: all-recursive] Error 1
make: *** [Makefile:367: all] Error 2
error: Bad exit status from /tmp/B.j2EJpF/BUILD/tmp/rpm-tmp.24176 (%build)


RPM build errors:
    Bad exit status from /tmp/B.j2EJpF/BUILD/tmp/rpm-tmp.24176 (%build)
ended at: Sun Oct 18 18:07:36 2020, done in 0:00:27.325795
error: No files produced.
+ chmod -R u+rwX /tmp/B.j2EJpF/BUILD
+ rm -rf /tmp/B.j2EJpF/tmp /tmp/B.j2EJpF/BUILD
+ rm -rf /tmp/B.j2EJpF
Begin-PLD-Builder-Info
Build-Time: user:19.68s sys:3.21s real:29.68s (faults io:482 non-io:1724093)

End-PLD-Builder-Info
[Back to list of logs] [View rpm -qa of builder]