FailedOk

th/SRPMS[OK]
th/x32[OK]
th/i686[OK]
th/x86_64[OK]

ac/SRPMS[OK]
ac/i386[OK]
ac/i586[OK]
ac/i686[OK]
ac/alpha[OK]
ac/amd64[OK]
ac/athlon[OK]
ac/ppc[OK]
ac/sparc[OK]
ac/sparc64[OK]

Advanced Search
main()
Powered by PLD Linux
(c) 2002-2018 PLD Team
$Revision: 1.37 $
Powered by six Cray XMT Supercomputers.
Your IP: 54.162.227.37

libpreludedb 6caa016f-1899-4cd2-bf06-e426be18014c

Status:Failed
Source URL:ftp://buildlogs.pld-linux.org/th/x86_64/FAIL/libpreludedb,6caa016f-1899-4cd2-bf06-e426be18014c.bz2
text/plain URL:View!
full text:View!
rpm -qa of builder:View!
Date:2018/03/07 11:10:55
Runtime:0:00:54.949980

Toc:

  • error 1
  • make[3]: *** [Makefile:1331: tmpl-build.stamp] Error 127
  • error 2
  • make[2]: *** [Makefile:1080: all-recursive] Error 1
  • error 3
  • make[1]: *** [Makefile:1348: all-recursive] Error 1
  • error 4
  • error: Bad exit status from /tmp/B.XDy8WH/BUILD/tmp/rpm-tmp.1550 (%build)
  • error 5
  • RPM build errors:
  • error 6
  • error: No files produced.

Content:

mv -f .deps/classic-get.Tpo .deps/classic-get.Plo
make[5]: Leaving directory '/tmp/B.XDy8WH/BUILD/libpreludedb-3.1.0/plugins/format/classic'
make[5]: Entering directory '/tmp/B.XDy8WH/BUILD/libpreludedb-3.1.0/plugins/format/classic'
/bin/sh ../../../libtool  --tag=CC   --mode=compile x86_64-pld-linux-gcc -DHAVE_CONFIG_H -I. -I../../..  -Wall -Wstrict-prototypes -Wmissing-prototypes -Wmissing-declarations -Wbad-function-cast -Wcast-qual -Wcast-align -Wnested-externs -Wunused -Wformat -Wformat-security -I../../../src/include -I./include -I../../../libmissing -I../../../libmissing  -fPIC  -O2 -fwrapv -pipe -Wformat -Werror=format-security -gdwarf-4 -fno-debug-types-section -fvar-tracking-assignments -g2 -Wp,-D_FORTIFY_SOURCE=2 -fstack-protector-strong --param=ssp-buffer-size=4 -fPIC -march=x86-64 -gdwarf-4 -fno-debug-types-section -fvar-tracking-assignments -g2  -MT classic-insert.lo -MD -MP -MF .deps/classic-insert.Tpo -c -o classic-insert.lo classic-insert.c
libtool: compile:  x86_64-pld-linux-gcc -DHAVE_CONFIG_H -I. -I../../.. -Wall -Wstrict-prototypes -Wmissing-prototypes -Wmissing-declarations -Wbad-function-cast -Wcast-qual -Wcast-align -Wnested-externs -Wunused -Wformat -Wformat-security -I../../../src/include -I./include -I../../../libmissing -I../../../libmissing -fPIC -O2 -fwrapv -pipe -Wformat -Werror=format-security -gdwarf-4 -fno-debug-types-section -fvar-tracking-assignments -g2 -Wp,-D_FORTIFY_SOURCE=2 -fstack-protector-strong --param=ssp-buffer-size=4 -fPIC -march=x86-64 -gdwarf-4 -fno-debug-types-section -fvar-tracking-assignments -g2 -MT classic-insert.lo -MD -MP -MF .deps/classic-insert.Tpo -c classic-insert.c  -fPIC -DPIC -o .libs/classic-insert.o
libtool: compile:  x86_64-pld-linux-gcc -DHAVE_CONFIG_H -I. -I../../.. -Wall -Wstrict-prototypes -Wmissing-prototypes -Wmissing-declarations -Wbad-function-cast -Wcast-qual -Wcast-align -Wnested-externs -Wunused -Wformat -Wformat-security -I../../../src/include -I./include -I../../../libmissing -I../../../libmissing -fPIC -O2 -fwrapv -pipe -Wformat -Werror=format-security -gdwarf-4 -fno-debug-types-section -fvar-tracking-assignments -g2 -Wp,-D_FORTIFY_SOURCE=2 -fstack-protector-strong --param=ssp-buffer-size=4 -fPIC -march=x86-64 -gdwarf-4 -fno-debug-types-section -fvar-tracking-assignments -g2 -MT classic-insert.lo -MD -MP -MF .deps/classic-insert.Tpo -c classic-insert.c -o classic-insert.o >/dev/null 2>&1
mv -f .deps/classic-insert.Tpo .deps/classic-insert.Plo
make[5]: Leaving directory '/tmp/B.XDy8WH/BUILD/libpreludedb-3.1.0/plugins/format/classic'
make[5]: Entering directory '/tmp/B.XDy8WH/BUILD/libpreludedb-3.1.0/plugins/format/classic'
/bin/sh ../../../libtool  --tag=CC   --mode=link x86_64-pld-linux-gcc  -O2 -fwrapv -pipe -Wformat -Werror=format-security -gdwarf-4 -fno-debug-types-section -fvar-tracking-assignments -g2 -Wp,-D_FORTIFY_SOURCE=2 -fstack-protector-strong --param=ssp-buffer-size=4 -fPIC -march=x86-64 -gdwarf-4 -fno-debug-types-section -fvar-tracking-assignments -g2  -module -avoid-version  -Wl,--as-needed -Wl,--no-copy-dt-needed-entries -Wl,-z,relro -Wl,-z,combreloc  -z relro -z now -o classic.la -rpath /usr/lib64/libpreludedb/plugins/formats classic.lo classic-delete.lo classic-get.lo classic-insert.lo classic-path-resolve.lo classic-sql-join.lo ../../../src/libpreludedb.la -L/usr/lib64 -lprelude -lgnutls -lgcrypt -lgpg-error -lltdl -ldl 
libtool: link: x86_64-pld-linux-gcc -shared  -fPIC -DPIC  -O2 -gdwarf-4 -g2 -fstack-protector-strong -march=x86-64 -gdwarf-4 -g2 -Wl,--as-needed -Wl,--no-copy-dt-needed-entries -Wl,-z -Wl,relro -Wl,-z -Wl,combreloc   -pthread  .libs/classic.o .libs/classic-delete.o .libs/classic-get.o .libs/classic-insert.o .libs/classic-path-resolve.o .libs/classic-sql-join.o   -Wl,-rpath -Wl,/tmp/B.XDy8WH/BUILD/libpreludedb-3.1.0/src/.libs ../../../src/.libs/libpreludedb.so -L/usr/lib64 /usr/lib64/libprelude.so /usr/lib64/libgnutls.so -lz -lp11-kit /usr/lib64/libidn2.so /usr/lib64/libunistring.so /usr/lib64/libtasn1.so -lnettle -lhogweed /usr/lib64/libgmp.so /usr/lib64/libgcrypt.so /usr/lib64/libgpg-error.so /usr/lib64/libltdl.so -ldl -Wl,-soname -Wl,classic.so -o .libs/classic.so
libtool: link: ar cru .libs/classic.a  classic.o classic-delete.o classic-get.o classic-insert.o classic-path-resolve.o classic-sql-join.o
libtool: link: ranlib .libs/classic.a
libtool: link: ( cd ".libs" && rm -f "classic.la" && ln -s "../classic.la" "classic.la" )
make[5]: Leaving directory '/tmp/B.XDy8WH/BUILD/libpreludedb-3.1.0/plugins/format/classic'
make[4]: Nothing to be done for 'all-am'.
make[3]: Nothing to be done for 'all-am'.
Making all in bindings
Making all in c++
Making all in include
make[4]: Nothing to be done for 'all'.
make[4]: Entering directory '/tmp/B.XDy8WH/BUILD/libpreludedb-3.1.0/bindings/c++'
/bin/sh ../../libtool  --tag=CXX   --mode=compile x86_64-pld-linux-g++ -DHAVE_CONFIG_H -I. -I../..  -I../.. -I../../src/include -I../../src/include -I../../bindings/c++/include -I../../bindings/c++/include  -fPIC  -O2 -fwrapv -pipe -Wformat -Werror=format-security -gdwarf-4 -fno-debug-types-section -fvar-tracking-assignments -g2 -Wp,-D_FORTIFY_SOURCE=2 -fstack-protector-strong --param=ssp-buffer-size=4 -fPIC -march=x86-64 -gdwarf-4 -fno-debug-types-section -fvar-tracking-assignments -g2  -MT libpreludedbcpp_la-preludedb-error.lo -MD -MP -MF .deps/libpreludedbcpp_la-preludedb-error.Tpo -c -o libpreludedbcpp_la-preludedb-error.lo `test -f 'preludedb-error.cxx' || echo './'`preludedb-error.cxx
libtool: compile:  x86_64-pld-linux-g++ -DHAVE_CONFIG_H -I. -I../.. -I../.. -I../../src/include -I../../src/include -I../../bindings/c++/include -I../../bindings/c++/include -fPIC -O2 -fwrapv -pipe -Wformat -Werror=format-security -gdwarf-4 -fno-debug-types-section -fvar-tracking-assignments -g2 -Wp,-D_FORTIFY_SOURCE=2 -fstack-protector-strong --param=ssp-buffer-size=4 -fPIC -march=x86-64 -gdwarf-4 -fno-debug-types-section -fvar-tracking-assignments -g2 -MT libpreludedbcpp_la-preludedb-error.lo -MD -MP -MF .deps/libpreludedbcpp_la-preludedb-error.Tpo -c preludedb-error.cxx  -fPIC -DPIC -o .libs/libpreludedbcpp_la-preludedb-error.o
libtool: compile:  x86_64-pld-linux-g++ -DHAVE_CONFIG_H -I. -I../.. -I../.. -I../../src/include -I../../src/include -I../../bindings/c++/include -I../../bindings/c++/include -fPIC -O2 -fwrapv -pipe -Wformat -Werror=format-security -gdwarf-4 -fno-debug-types-section -fvar-tracking-assignments -g2 -Wp,-D_FORTIFY_SOURCE=2 -fstack-protector-strong --param=ssp-buffer-size=4 -fPIC -march=x86-64 -gdwarf-4 -fno-debug-types-section -fvar-tracking-assignments -g2 -MT libpreludedbcpp_la-preludedb-error.lo -MD -MP -MF .deps/libpreludedbcpp_la-preludedb-error.Tpo -c preludedb-error.cxx -o libpreludedbcpp_la-preludedb-error.o >/dev/null 2>&1
mv -f .deps/libpreludedbcpp_la-preludedb-error.Tpo .deps/libpreludedbcpp_la-preludedb-error.Plo
make[4]: Leaving directory '/tmp/B.XDy8WH/BUILD/libpreludedb-3.1.0/bindings/c++'
make[4]: Entering directory '/tmp/B.XDy8WH/BUILD/libpreludedb-3.1.0/bindings/c++'
/bin/sh ../../libtool  --tag=CXX   --mode=compile x86_64-pld-linux-g++ -DHAVE_CONFIG_H -I. -I../..  -I../.. -I../../src/include -I../../src/include -I../../bindings/c++/include -I../../bindings/c++/include  -fPIC  -O2 -fwrapv -pipe -Wformat -Werror=format-security -gdwarf-4 -fno-debug-types-section -fvar-tracking-assignments -g2 -Wp,-D_FORTIFY_SOURCE=2 -fstack-protector-strong --param=ssp-buffer-size=4 -fPIC -march=x86-64 -gdwarf-4 -fno-debug-types-section -fvar-tracking-assignments -g2  -MT libpreludedbcpp_la-preludedb-sql.lo -MD -MP -MF .deps/libpreludedbcpp_la-preludedb-sql.Tpo -c -o libpreludedbcpp_la-preludedb-sql.lo `test -f 'preludedb-sql.cxx' || echo './'`preludedb-sql.cxx
libtool: compile:  x86_64-pld-linux-g++ -DHAVE_CONFIG_H -I. -I../.. -I../.. -I../../src/include -I../../src/include -I../../bindings/c++/include -I../../bindings/c++/include -fPIC -O2 -fwrapv -pipe -Wformat -Werror=format-security -gdwarf-4 -fno-debug-types-section -fvar-tracking-assignments -g2 -Wp,-D_FORTIFY_SOURCE=2 -fstack-protector-strong --param=ssp-buffer-size=4 -fPIC -march=x86-64 -gdwarf-4 -fno-debug-types-section -fvar-tracking-assignments -g2 -MT libpreludedbcpp_la-preludedb-sql.lo -MD -MP -MF .deps/libpreludedbcpp_la-preludedb-sql.Tpo -c preludedb-sql.cxx  -fPIC -DPIC -o .libs/libpreludedbcpp_la-preludedb-sql.o
libtool: compile:  x86_64-pld-linux-g++ -DHAVE_CONFIG_H -I. -I../.. -I../.. -I../../src/include -I../../src/include -I../../bindings/c++/include -I../../bindings/c++/include -fPIC -O2 -fwrapv -pipe -Wformat -Werror=format-security -gdwarf-4 -fno-debug-types-section -fvar-tracking-assignments -g2 -Wp,-D_FORTIFY_SOURCE=2 -fstack-protector-strong --param=ssp-buffer-size=4 -fPIC -march=x86-64 -gdwarf-4 -fno-debug-types-section -fvar-tracking-assignments -g2 -MT libpreludedbcpp_la-preludedb-sql.lo -MD -MP -MF .deps/libpreludedbcpp_la-preludedb-sql.Tpo -c preludedb-sql.cxx -o libpreludedbcpp_la-preludedb-sql.o >/dev/null 2>&1
mv -f .deps/libpreludedbcpp_la-preludedb-sql.Tpo .deps/libpreludedbcpp_la-preludedb-sql.Plo
make[4]: Leaving directory '/tmp/B.XDy8WH/BUILD/libpreludedb-3.1.0/bindings/c++'
make[4]: Entering directory '/tmp/B.XDy8WH/BUILD/libpreludedb-3.1.0/bindings/c++'
/bin/sh ../../libtool  --tag=CXX   --mode=compile x86_64-pld-linux-g++ -DHAVE_CONFIG_H -I. -I../..  -I../.. -I../../src/include -I../../src/include -I../../bindings/c++/include -I../../bindings/c++/include  -fPIC  -O2 -fwrapv -pipe -Wformat -Werror=format-security -gdwarf-4 -fno-debug-types-section -fvar-tracking-assignments -g2 -Wp,-D_FORTIFY_SOURCE=2 -fstack-protector-strong --param=ssp-buffer-size=4 -fPIC -march=x86-64 -gdwarf-4 -fno-debug-types-section -fvar-tracking-assignments -g2  -MT libpreludedbcpp_la-preludedb.lo -MD -MP -MF .deps/libpreludedbcpp_la-preludedb.Tpo -c -o libpreludedbcpp_la-preludedb.lo `test -f 'preludedb.cxx' || echo './'`preludedb.cxx
libtool: compile:  x86_64-pld-linux-g++ -DHAVE_CONFIG_H -I. -I../.. -I../.. -I../../src/include -I../../src/include -I../../bindings/c++/include -I../../bindings/c++/include -fPIC -O2 -fwrapv -pipe -Wformat -Werror=format-security -gdwarf-4 -fno-debug-types-section -fvar-tracking-assignments -g2 -Wp,-D_FORTIFY_SOURCE=2 -fstack-protector-strong --param=ssp-buffer-size=4 -fPIC -march=x86-64 -gdwarf-4 -fno-debug-types-section -fvar-tracking-assignments -g2 -MT libpreludedbcpp_la-preludedb.lo -MD -MP -MF .deps/libpreludedbcpp_la-preludedb.Tpo -c preludedb.cxx  -fPIC -DPIC -o .libs/libpreludedbcpp_la-preludedb.o
libtool: compile:  x86_64-pld-linux-g++ -DHAVE_CONFIG_H -I. -I../.. -I../.. -I../../src/include -I../../src/include -I../../bindings/c++/include -I../../bindings/c++/include -fPIC -O2 -fwrapv -pipe -Wformat -Werror=format-security -gdwarf-4 -fno-debug-types-section -fvar-tracking-assignments -g2 -Wp,-D_FORTIFY_SOURCE=2 -fstack-protector-strong --param=ssp-buffer-size=4 -fPIC -march=x86-64 -gdwarf-4 -fno-debug-types-section -fvar-tracking-assignments -g2 -MT libpreludedbcpp_la-preludedb.lo -MD -MP -MF .deps/libpreludedbcpp_la-preludedb.Tpo -c preludedb.cxx -o libpreludedbcpp_la-preludedb.o >/dev/null 2>&1
mv -f .deps/libpreludedbcpp_la-preludedb.Tpo .deps/libpreludedbcpp_la-preludedb.Plo
make[4]: Leaving directory '/tmp/B.XDy8WH/BUILD/libpreludedb-3.1.0/bindings/c++'
make[4]: Entering directory '/tmp/B.XDy8WH/BUILD/libpreludedb-3.1.0/bindings/c++'
/bin/sh ../../libtool  --tag=CXX   --mode=link x86_64-pld-linux-g++  -O2 -fwrapv -pipe -Wformat -Werror=format-security -gdwarf-4 -fno-debug-types-section -fvar-tracking-assignments -g2 -Wp,-D_FORTIFY_SOURCE=2 -fstack-protector-strong --param=ssp-buffer-size=4 -fPIC -march=x86-64 -gdwarf-4 -fno-debug-types-section -fvar-tracking-assignments -g2  -no-undefined -version-info 3:0:1 -Wl,--as-needed -Wl,--no-copy-dt-needed-entries -Wl,-z,relro -Wl,-z,combreloc  -z relro -z now -o libpreludedbcpp.la -rpath /usr/lib64 libpreludedbcpp_la-preludedb.lo libpreludedbcpp_la-preludedb-sql.lo libpreludedbcpp_la-preludedb-error.lo ../../src/libpreludedb.la -lpreludecpp 
libtool: link: x86_64-pld-linux-g++  -fPIC -DPIC -shared -nostdlib  -O2 -gdwarf-4 -g2 -fstack-protector-strong -march=x86-64 -gdwarf-4 -g2 -Wl,--as-needed -Wl,--no-copy-dt-needed-entries -Wl,-z -Wl,relro -Wl,-z -Wl,combreloc   -pthread /usr/lib64/gcc/x86_64-pld-linux/7.3.0/../../../../lib64/crti.o /usr/lib64/gcc/x86_64-pld-linux/7.3.0/crtbeginS.o  .libs/libpreludedbcpp_la-preludedb.o .libs/libpreludedbcpp_la-preludedb-sql.o .libs/libpreludedbcpp_la-preludedb-error.o   -Wl,-rpath -Wl,/tmp/B.XDy8WH/BUILD/libpreludedb-3.1.0/src/.libs ../../src/.libs/libpreludedb.so -L/usr/lib64 /usr/lib64/libpreludecpp.so /usr/lib64/libprelude.so /usr/lib64/libgnutls.so -lz -lp11-kit /usr/lib64/libidn2.so /usr/lib64/libunistring.so /usr/lib64/libtasn1.so -lnettle -lhogweed /usr/lib64/libgmp.so /usr/lib64/libgcrypt.so /usr/lib64/libgpg-error.so /usr/lib64/libltdl.so -ldl -L/usr/lib64/gcc/x86_64-pld-linux/7.3.0 -L/usr/lib64/gcc/x86_64-pld-linux/7.3.0/../../../../lib64 -L/lib/../lib64 -L/usr/lib/../lib64 -L/usr/lib64/gcc/x86_64-pld-linux/7.3.0/../../.. /usr/lib64/libstdc++.so -lm -lc -lgcc_s /usr/lib64/gcc/x86_64-pld-linux/7.3.0/crtendS.o /usr/lib64/gcc/x86_64-pld-linux/7.3.0/../../../../lib64/crtn.o -Wl,-soname -Wl,libpreludedbcpp.so.2 -o .libs/libpreludedbcpp.so.2.1.0
libtool: link: (cd ".libs" && rm -f "libpreludedbcpp.so.2" && ln -s "libpreludedbcpp.so.2.1.0" "libpreludedbcpp.so.2")
libtool: link: (cd ".libs" && rm -f "libpreludedbcpp.so" && ln -s "libpreludedbcpp.so.2.1.0" "libpreludedbcpp.so")
libtool: link: ar cru .libs/libpreludedbcpp.a  libpreludedbcpp_la-preludedb.o libpreludedbcpp_la-preludedb-sql.o libpreludedbcpp_la-preludedb-error.o
libtool: link: ranlib .libs/libpreludedbcpp.a
libtool: link: ( cd ".libs" && rm -f "libpreludedbcpp.la" && ln -s "../libpreludedbcpp.la" "libpreludedbcpp.la" )
make[4]: Leaving directory '/tmp/B.XDy8WH/BUILD/libpreludedb-3.1.0/bindings/c++'
Making all in python
make[3]: Entering directory '/tmp/B.XDy8WH/BUILD/libpreludedb-3.1.0/bindings/python'
/usr/bin/swig -c++  -I/usr/include -I../../bindings -I../../bindings/python -I/usr/share/libprelude/swig -I../../bindings/c++/include -python -threads -O -builtin -o _preludedb.cxx ../libpreludedbcpp.i
../../bindings/c++/include/preludedb.hxx:33: Warning 511: Can't use keyword arguments with overloaded functions (PreludeDB::DB::ResultIdents::get(unsigned int)).
../../bindings/c++/include/preludedb.hxx:72: Warning 511: Can't use keyword arguments with overloaded functions (PreludeDB::DB::ResultValues::get(unsigned int)).
make[3]: Leaving directory '/tmp/B.XDy8WH/BUILD/libpreludedb-3.1.0/bindings/python'
make[3]: Entering directory '/tmp/B.XDy8WH/BUILD/libpreludedb-3.1.0/bindings/python'
CC="x86_64-pld-linux-g++" /usr/bin/python2 setup.py build --build-base=build-2
running build
running build_py
creating build-2
creating build-2/lib.linux-x86_64-2.7
copying preludedb.py -> build-2/lib.linux-x86_64-2.7
running build_ext
building '_preludedb' extension
creating build-2/temp.linux-x86_64-2.7
x86_64-pld-linux-g++ -fno-strict-aliasing -O2 -fwrapv -pipe -Wformat -Werror=format-security -gdwarf-4 -fno-debug-types-section -fvar-tracking-assignments -g2 -Wp,-D_FORTIFY_SOURCE=2 -fstack-protector-strong --param=ssp-buffer-size=4 -fPIC -march=x86-64 -gdwarf-4 -fno-debug-types-section -fvar-tracking-assignments -g2 -DNDEBUG -O2 -fwrapv -pipe -Wformat -Werror=format-security -gdwarf-4 -fno-debug-types-section -fvar-tracking-assignments -g2 -Wp,-D_FORTIFY_SOURCE=2 -fstack-protector-strong --param=ssp-buffer-size=4 -fPIC -march=x86-64 -gdwarf-4 -fno-debug-types-section -fvar-tracking-assignments -g2 -fPIC -I/usr/include/python2.7 -c _preludedb.cxx -o build-2/temp.linux-x86_64-2.7/_preludedb.o -I../.. -I../../src/include -I../../src/include -I../../bindings/c++/include
x86_64-pld-linux-g++ -pthread -shared -Wl,--as-needed -Wl,--no-copy-dt-needed-entries -Wl,-z,relro -Wl,-z,combreloc build-2/temp.linux-x86_64-2.7/_preludedb.o -L../../src/.libs/ -L../../bindings/c++/.libs/ -L/usr/lib64 -lpython2.7 -o build-2/lib.linux-x86_64-2.7/_preludedb.so -lpreludedbcpp -lpreludecpp -lpreludedb -L/usr/lib64 -lprelude -lgnutls -lgcrypt -lgpg-error -lltdl -ldl
CC="x86_64-pld-linux-g++" /usr/bin/python3 setup.py build --build-base=build-3
running build
running build_py
creating build-3
creating build-3/lib.linux-x86_64-3.6
copying preludedb.py -> build-3/lib.linux-x86_64-3.6
running build_ext
building '_preludedb' extension
creating build-3/temp.linux-x86_64-3.6
x86_64-pld-linux-g++ -Wno-unused-result -Wsign-compare -DNDEBUG -O2 -fwrapv -pipe -Wformat -Werror=format-security -gdwarf-4 -fno-debug-types-section -fvar-tracking-assignments -g2 -Wp,-D_FORTIFY_SOURCE=2 -fstack-protector-strong --param=ssp-buffer-size=4 -fPIC -march=x86-64 -gdwarf-4 -fno-debug-types-section -fvar-tracking-assignments -g2 -fno-caller-saves -O2 -fwrapv -pipe -Wformat -Werror=format-security -gdwarf-4 -fno-debug-types-section -fvar-tracking-assignments -g2 -Wp,-D_FORTIFY_SOURCE=2 -fstack-protector-strong --param=ssp-buffer-size=4 -fPIC -march=x86-64 -gdwarf-4 -fno-debug-types-section -fvar-tracking-assignments -g2 -fPIC -I/usr/include/python3.6m -c _preludedb.cxx -o build-3/temp.linux-x86_64-3.6/_preludedb.o -I../.. -I../../src/include -I../../src/include -I../../bindings/c++/include
x86_64-pld-linux-g++ -pthread -shared -Wl,--as-needed -Wl,--no-copy-dt-needed-entries -Wl,-z,relro -Wl,-z,combreloc build-3/temp.linux-x86_64-3.6/_preludedb.o -L../../src/.libs/ -L../../bindings/c++/.libs/ -L/usr/lib64 -lpython3.6m -o build-3/lib.linux-x86_64-3.6/_preludedb.cpython-36m-x86_64-linux-gnu.so -lpreludedbcpp -lpreludecpp -lpreludedb -L/usr/lib64 -lprelude -lgnutls -lgcrypt -lgpg-error -lltdl -ldl
make[3]: Leaving directory '/tmp/B.XDy8WH/BUILD/libpreludedb-3.1.0/bindings/python'
make[3]: Nothing to be done for 'all-am'.
Making all in docs
Making all in api
make[3]: Entering directory '/tmp/B.XDy8WH/BUILD/libpreludedb-3.1.0/docs/api'
gtk-doc: Scanning header files
cd . && \
  gtkdoc-scan --module=libpreludedb --source-dir=../../src --ignore-headers=""  
if grep -l '^..*$' ./libpreludedb.types > /dev/null 2>&1 ; then \
    CC="/bin/sh ../../libtool --mode=compile x86_64-pld-linux-gcc   -fPIC  -O2 -fwrapv -pipe -Wformat -Werror=format-security -gdwarf-4 -fno-debug-types-section -fvar-tracking-assignments -g2 -Wp,-D_FORTIFY_SOURCE=2 -fstack-protector-strong --param=ssp-buffer-size=4 -fPIC -march=x86-64 -gdwarf-4 -fno-debug-types-section -fvar-tracking-assignments -g2 " LD="/bin/sh ../../libtool --mode=link x86_64-pld-linux-gcc  -O2 -fwrapv -pipe -Wformat -Werror=format-security -gdwarf-4 -fno-debug-types-section -fvar-tracking-assignments -g2 -Wp,-D_FORTIFY_SOURCE=2 -fstack-protector-strong --param=ssp-buffer-size=4 -fPIC -march=x86-64 -gdwarf-4 -fno-debug-types-section -fvar-tracking-assignments -g2   -Wl,--as-needed -Wl,--no-copy-dt-needed-entries -Wl,-z,relro -Wl,-z,combreloc  -z relro -z now" RUN="/bin/sh ../../libtool --mode=execute" CFLAGS=" -O2 -fwrapv -pipe -Wformat -Werror=format-security -gdwarf-4 -fno-debug-types-section -fvar-tracking-assignments -g2 -Wp,-D_FORTIFY_SOURCE=2 -fstack-protector-strong --param=ssp-buffer-size=4 -fPIC -march=x86-64 -gdwarf-4 -fno-debug-types-section -fvar-tracking-assignments -g2 " LDFLAGS=" -Wl,--as-needed -Wl,--no-copy-dt-needed-entries -Wl,-z,relro -Wl,-z,combreloc  -z relro -z now" gtkdoc-scangobj  --module=libpreludedb --output-dir=. ; \
else \
    cd . ; \
    for i in libpreludedb.args libpreludedb.hierarchy libpreludedb.interfaces libpreludedb.prerequisites libpreludedb.signals ; do \
               test -f $i || touch $i ; \
    done \
fi
touch scan-build.stamp
make[3]: Leaving directory '/tmp/B.XDy8WH/BUILD/libpreludedb-3.1.0/docs/api'
make[3]: Entering directory '/tmp/B.XDy8WH/BUILD/libpreludedb-3.1.0/docs/api'
gtk-doc: Rebuilding template files
cd . && gtkdoc-mktmpl --module=libpreludedb 
/bin/sh: gtkdoc-mktmpl: not found
make[3]: *** [Makefile:1331: tmpl-build.stamp] Error 127
make[3]: Leaving directory '/tmp/B.XDy8WH/BUILD/libpreludedb-3.1.0/docs/api'
make[2]: *** [Makefile:1080: all-recursive] Error 1
make[1]: *** [Makefile:1348: all-recursive] Error 1
make: *** [Makefile:1154: all] Error 2
error: Bad exit status from /tmp/B.XDy8WH/BUILD/tmp/rpm-tmp.1550 (%build)


RPM build errors:
    Bad exit status from /tmp/B.XDy8WH/BUILD/tmp/rpm-tmp.1550 (%build)
ended at: Wed Mar  7 11:10:55 2018, done in 0:00:54.949980
error: No files produced.
mesg: ttyname failed: Inappropriate ioctl for device
+ chmod -R u+rwX /tmp/B.XDy8WH/BUILD
+ rm -rf /tmp/B.XDy8WH/tmp /tmp/B.XDy8WH/BUILD
mesg: ttyname failed: Inappropriate ioctl for device
+ rm -rf /tmp/B.XDy8WH
Begin-PLD-Builder-Info
Build-Time: user:52.09s sys:7.61s real:59.00s (faults io:7 non-io:4199809)

End-PLD-Builder-Info
[Back to list of logs] [View rpm -qa of builder]