FailedOk

th/SRPMS[OK]
th/x32[OK]
th/i686[OK]
th/x86_64[OK]

ac/SRPMS[OK]
ac/i386[OK]
ac/i586[OK]
ac/i686[OK]
ac/alpha[OK]
ac/amd64[OK]
ac/athlon[OK]
ac/ppc[OK]
ac/sparc[OK]
ac/sparc64[OK]

Advanced Search
main()
Powered by PLD Linux
(c) 2002-2018 PLD Team
$Revision: 1.37 $
Powered by Przewodniczacego Lepper-a.
Your IP: 54.196.5.6

libreport 2cee8b43-5ebf-40b0-97a9-61a694261732

Status:Failed
Source URL:ftp://buildlogs.pld-linux.org/th/x86_64/FAIL/libreport,2cee8b43-5ebf-40b0-97a9-61a694261732.bz2
text/plain URL:View!
full text:View!
rpm -qa of builder:View!
Date:2018/05/09 21:27:53
Runtime:0:07:43.646805

Toc:

  • error 1
  • ERROR: All 117 tests were run,
  • error 2
  • make[2]: *** [Makefile:745: check-local] Error 1
  • error 3
  • make[1]: *** [Makefile:599: check-am] Error 2
  • error 4
  • error: Bad exit status from /tmp/B.pabyYn/BUILD/tmp/rpm-tmp.57657 (%build)
  • error 5
  • RPM build errors:
  • error 6
  • error: No files produced.

Content:

 60: ureport_server_config_load_basic_auth           ok

problem report

 61: summary                                         ok
 62: description                                     ok
 63: short_backtrace                                 ok
 64: attach                                          ok
 65: custom_section                                  ok
 66: sanity                                          ok

dump_dir

 67: dd_sanity                                       ok
 68: dd_create_open_delete                           ok
 69: dd_sanitize_mode_and_owner                      ok
 70: dd_owner                                        ok
 71: dd_stat                                         ok
 72: recursive_lock                                  ok
 73: str_is_correct_filename                         ok
 74: create_dump_dir                                 ok
 75: create_dump_dir_from_problem_data               ok
 76: dd_copy_fd                                      ok
 77: dd_load_int32                                   ok
 78: dd_load_uint32                                  ok
 79: dd_load_int64                                   ok
 80: dd_load_uint64                                  ok
 81: dd_create_archive                               ok
 82: dd_compute_size                                 ok
 83: dd_items_handling                               ok
 84: dd_get_env_variable                             ok
 85: dd_get_first_occurrence                         ok
 86: dd_get_last_occurrence                          ok
 87: dd_open_item                                    ok
 88: dd_open_item_file                               ok

global_config

 89: always_excluded_elements                        ok
 90: create_private_ticket                           ok
 91: stop_on_not_reportable                          ok

load_rule_list

 92: load_rule_list_rule_count                       ok
 93: load_rule_list_empty                            ok
 94: load_rule_list_conditions                       ok
 95: load_rule_list_command                          ok

ISO_date

 96: iso_date_string                                 ok
 97: parse_numbers                                   ok

uriparser

 98: uri_userinfo_remove                             ok

Event config

 99: restricted_access                               ok
100: get_options_with_err_msg                        ok

Bugzilla

101: report_Bugzilla_xml                             ok

/proc helpers

102: get_env_variable_ext                            ok
103: get_env_variable                                ok
104: get_cmdline                                     ok
105: get_executable                                  ok
106: get_cwd                                         ok
107: get_rootdir                                     ok
108: dump_fd_info                                    ok
109: get_fs-u_g-id                                   ok
110: get_ns_ids                                      ok
111: get_mountinfo_for_mount_point                   ok
112: dump_namespace_diff                             ok
113: process_has_own_root                            ok

compress

114: lz4-decompression                               ok
115: xz-decompression                                ok

Forbidden words

116: load_words_from_file                            ok

Client

117: set_echo                                        FAILED (client.at:9)

## ------------- ##
## Test results. ##
## ------------- ##

ERROR: All 117 tests were run,
1 failed unexpectedly.
## -------------------------- ##
## testsuite.log was created. ##
## -------------------------- ##

Please send `tests/testsuite.log' and all information you think might help:

   To: <crash-catcher@fedorahosted.org>
   Subject: [libreport 2.9.5] testsuite: 117 failed

You may investigate any problem if you feel able to do so, in which
case the test suite provides a good starting point.  Its output may
be found below `tests/testsuite.dir'.

make[2]: *** [Makefile:745: check-local] Error 1
make[2]: Leaving directory '/tmp/B.pabyYn/BUILD/libreport-2.9.5/tests'
make[1]: *** [Makefile:599: check-am] Error 2
make: *** [Makefile:625: check-recursive] Error 1
+ cat tests/test-suite.log
/tmp/B.pabyYn/BUILD/tmp/rpm-tmp.57657[85]: cat: tests/test-suite.log: No such file or directory
error: Bad exit status from /tmp/B.pabyYn/BUILD/tmp/rpm-tmp.57657 (%build)


RPM build errors:
    Bad exit status from /tmp/B.pabyYn/BUILD/tmp/rpm-tmp.57657 (%build)
ended at: Wed May  9 21:27:53 2018, done in 0:07:43.646805
error: No files produced.
mesg: ttyname failed: Inappropriate ioctl for device
+ chmod -R u+rwX /tmp/B.pabyYn/BUILD
+ rm -rf /tmp/B.pabyYn/tmp /tmp/B.pabyYn/BUILD
mesg: ttyname failed: Inappropriate ioctl for device
+ rm -rf /tmp/B.pabyYn
Begin-PLD-Builder-Info
Build-Time: user:314.27s sys:166.63s real:467.30s (faults io:0 non-io:85009762)

End-PLD-Builder-Info
[Back to list of logs] [View rpm -qa of builder]