FailedOk

th/SRPMS[OK]
th/x32[OK]
th/i686[OK]
th/x86_64[OK]

ac/SRPMS[OK]
ac/i386[OK]
ac/i586[OK]
ac/i686[OK]
ac/alpha[OK]
ac/amd64[OK]
ac/athlon[OK]
ac/ppc[OK]
ac/sparc[OK]
ac/sparc64[OK]

Advanced Search
main()
Powered by PLD Linux
(c) 2002-2018 PLD Team
$Revision: 1.37 $
Powered by X.
Your IP: 54.147.142.16

libvirt-snmp f7bde680-3205-43b1-b76f-d5e70b374235

Status:Failed
Source URL:ftp://buildlogs.pld-linux.org/th/x86_64/FAIL/libvirt-snmp,f7bde680-3205-43b1-b76f-d5e70b374235.bz2
text/plain URL:View!
rpm -qa of builder:View!
Date:2018/09/02 19:25:29
Runtime:0:00:04.828581

Toc:

  • prep
  • Executing(%prep): /bin/sh -e /tmp/B.VQhH5C/BUILD/tmp/rpm-tmp.29522
  • build
  • Executing(%build): /bin/sh -e /tmp/B.VQhH5C/BUILD/tmp/rpm-tmp.29522
  • error 1
  • libvirtGuestTable.h:124:4: error: unknown type name 'U64'
  • error 2
  • libvirtGuestTable_data_get.h:58:76: error: unknown type name 'U64'
  • error 3
  • libvirtGuestTable_data_set.h:83:80: error: unknown type name 'U64'
  • error 4
  • libvirtGuestTable_data_set.h:85:72: error: unknown type name 'U64'
  • error 5
  • libvirtGuestTable_data_get.c:462:68: error: unknown type name 'U64'
  • error 6
  • make[2]: *** [Makefile:365: libvirtMib_subagent-libvirtGuestTable_data_get.o] Error 1
  • error 7
  • libvirtGuestTable.h:124:4: error: unknown type name 'U64'
  • error 8
  • libvirtGuestTable_data_get.h:58:76: error: unknown type name 'U64'
  • error 9
  • libvirtGuestTable_data_set.h:83:80: error: unknown type name 'U64'
  • error 10
  • libvirtGuestTable_data_set.h:85:72: error: unknown type name 'U64'
  • error 11
  • make[2]: *** [Makefile:379: libvirtMib_subagent-libvirtGuestTable_data_set.o] Error 1
  • error 12
  • libvirtGuestTable.h:124:4: error: unknown type name 'U64'
  • error 13
  • libvirtGuestTable_data_get.h:58:76: error: unknown type name 'U64'
  • error 14
  • libvirtGuestTable_data_set.h:83:80: error: unknown type name 'U64'
  • error 15
  • libvirtGuestTable_data_set.h:85:72: error: unknown type name 'U64'
  • error 16
  • make[2]: *** [Makefile:449: libvirtMib_subagent-libvirtGuestTable.o] Error 1
  • error 17
  • libvirtGuestTable.h:124:4: error: unknown type name 'U64'
  • error 18
  • libvirtGuestTable_data_get.h:58:76: error: unknown type name 'U64'
  • error 19
  • libvirtGuestTable_data_set.h:83:80: error: unknown type name 'U64'
  • error 20
  • libvirtGuestTable_data_set.h:85:72: error: unknown type name 'U64'
  • error 21
  • make[2]: *** [Makefile:393: libvirtMib_subagent-libvirtGuestTable_data_access.o] Error 1
  • error 22
  • libvirtGuestTable.h:124:4: error: unknown type name 'U64'
  • error 23
  • libvirtGuestTable_data_get.h:58:76: error: unknown type name 'U64'
  • error 24
  • libvirtGuestTable_data_set.h:83:80: error: unknown type name 'U64'
  • error 25
  • libvirtGuestTable_data_set.h:85:72: error: unknown type name 'U64'
  • error 26
  • libvirtGuestTable_interface.c:847:27: error: 'U64' undeclared (first use in this function)
  • error 27
  • libvirtGuestTable_interface.c:849:48: error: expected expression before ')' token
  • error 28
  • make[2]: *** [Makefile:477: libvirtMib_subagent-libvirtGuestTable_interface.o] Error 1
  • error 29
  • libvirtGuestTable.h:124:4: error: unknown type name 'U64'
  • error 30
  • libvirtGuestTable_data_get.h:58:76: error: unknown type name 'U64'
  • error 31
  • libvirtGuestTable_data_set.h:83:80: error: unknown type name 'U64'
  • error 32
  • libvirtGuestTable_data_set.h:85:72: error: unknown type name 'U64'
  • error 33
  • libvirtSnmp.c:219:42: error: request for member 'high' in something not a structure or union
  • error 34
  • libvirtSnmp.c:220:42: error: request for member 'low' in something not a structure or union
  • error 35
  • make[2]: *** [Makefile:435: libvirtMib_subagent-libvirtSnmp.o] Error 1
  • error 36
  • libvirtGuestTable.h:124:4: error: unknown type name 'U64'
  • error 37
  • libvirtGuestTable_data_get.h:58:76: error: unknown type name 'U64'
  • error 38
  • libvirtGuestTable_data_set.h:83:80: error: unknown type name 'U64'
  • error 39
  • libvirtGuestTable_data_set.h:85:72: error: unknown type name 'U64'
  • error 40
  • make[2]: *** [Makefile:463: libvirtMib_subagent-libvirtMib_subagent.o] Error 1
  • error 41
  • make[1]: *** [Makefile:271: all-recursive] Error 1
  • error 42
  • error: Bad exit status from /tmp/B.VQhH5C/BUILD/tmp/rpm-tmp.29522 (%build)
  • error 43
  • RPM build errors:
  • error 44
  • error: No files produced.

Content:

request from: baggins
checking if we should skip the build
started at: Sun Sep  2 19:25:21 2018
killing old processes on a builder
mesg: ttyname failed: Inappropriate ioctl for device
sending signal 9 to pid -1
Killed
cleaning up /tmp
mesg: ttyname failed: Inappropriate ioctl for device
fetching https://srcbuilder.pld-linux.org/th//srpms/f7bde680-3205-43b1-b76f-d5e70b374235/libvirt-snmp-0.0.3-3.src.rpm
fetched 171371 bytes, 409.9 K/s
installing srpm: libvirt-snmp-0.0.3-3.src.rpm
mesg: ttyname failed: Inappropriate ioctl for device
+ install -d /tmp/B.VQhH5C/BUILD /tmp/B.VQhH5C/RPMS
+ LC_ALL=en_US.UTF-8
+ rpm -qp --changelog libvirt-snmp-0.0.3-3.src.rpm
* Sun Sep 02 2018 PLD Linux Team <feedback@pld-linux.org>
- For complete changelog see: http://git.pld-linux.org/?p=packages/libvirt-snmp.git;a=log;h=master
+ rpm -Uhv --nodeps --define '_topdir /tmp/B.VQhH5C' --define '_specdir %{_topdir}' --define '_sourcedir %{_specdir}' --define '_rpmdir %{_topdir}/RPMS' --define '_builddir %{_topdir}/BUILD' libvirt-snmp-0.0.3-3.src.rpm Preparing... ################################################## libvirt-snmp ################################################## + rm -f libvirt-snmp-0.0.3-3.src.rpm mesg: ttyname failed: Inappropriate ioctl for device + install -m 700 -d /tmp/B.VQhH5C/BUILD/tmp mesg: ttyname failed: Inappropriate ioctl for device + TMPDIR=/tmp/B.VQhH5C/BUILD/tmp + exec nice -n 0 rpmbuild -bp --short-circuit --nodeps --define '_topdir /tmp/B.VQhH5C' --define '_specdir %{_topdir}' --define '_sourcedir %{_specdir}' --define '_rpmdir %{_topdir}/RPMS' --define '_builddir %{_topdir}/BUILD' --target x86_64-pld-linux --define 'prep exit 0' /tmp/B.VQhH5C/libvirt-snmp.spec Building target platforms: x86_64-pld-linux checking BuildConflict-ing packages no BuildConflicts found checking BR rpm: Building target platforms: x86_64-pld-linux no BR needed building RPM using: set -ex; : build-id: f7bde680-3205-43b1-b76f-d5e70b374235; TMPDIR=/tmp/B.VQhH5C/BUILD/tmp exec nice -n 0 rpmbuild -bb --define '_smp_mflags -j9' --define '_make_opts -Otarget' --define '_pld_builder 1' --define '_topdir /tmp/B.VQhH5C' --define '_specdir %{_topdir}' --define '_sourcedir %{_specdir}' --define '_rpmdir %{_topdir}/RPMS' --define '_builddir %{_topdir}/BUILD' --target x86_64-pld-linux /tmp/B.VQhH5C/libvirt-snmp.spec mesg: ttyname failed: Inappropriate ioctl for device + : build-id: f7bde680-3205-43b1-b76f-d5e70b374235 + TMPDIR=/tmp/B.VQhH5C/BUILD/tmp + exec nice -n 0 rpmbuild -bb --define '_smp_mflags -j9' --define '_make_opts -Otarget' --define '_pld_builder 1' --define '_topdir /tmp/B.VQhH5C' --define '_specdir %{_topdir}' --define '_sourcedir %{_specdir}' --define '_rpmdir %{_topdir}/RPMS' --define '_builddir %{_topdir}/BUILD' --target x86_64-pld-linux /tmp/B.VQhH5C/libvirt-snmp.spec Building target platforms: x86_64-pld-linux Executing(%prep): /bin/sh -e /tmp/B.VQhH5C/BUILD/tmp/rpm-tmp.29522 + umask 022 + cd /tmp/B.VQhH5C/BUILD + cd /tmp/B.VQhH5C/BUILD + rm -rf libvirt-snmp-0.0.3 + /usr/bin/gzip -dc /tmp/B.VQhH5C/libvirt-snmp-0.0.3.tar.gz + /bin/tar -xf - + STATUS=0 + '[' 0 -ne 0 ']' + cd libvirt-snmp-0.0.3 + /bin/id -u + '[' 1000 '=' 0 ']' + /bin/id -u + '[' 1000 '=' 0 ']' + /bin/chmod -Rf a+rX,u+w,g-w,o-w . + exit 0 Executing(%build): /bin/sh -e /tmp/B.VQhH5C/BUILD/tmp/rpm-tmp.29522 TMP=/home/users/builder/tmp HOME=/home/users/builder PATH=/home/users/builder/GNUstep/Tools:/usr/local/bin:/usr/bin:/bin:/home/users/builder/bin TMPDIR=/tmp/B.VQhH5C/BUILD/tmp + umask 022 + cd /tmp/B.VQhH5C/BUILD + cd libvirt-snmp-0.0.3 + ./configure 'LDFLAGS=-Wl,--as-needed -Wl,--no-copy-dt-needed-entries -Wl,-z,relro -Wl,-z,combreloc ' 'CFLAGS=-O2 -fwrapv -pipe -Wformat -Werror=format-security -gdwarf-4 -fno-debug-types-section -fvar-tracking-assignments -g2 -Wp,-D_FORTIFY_SOURCE=2 -fstack-protector-strong --param=ssp-buffer-size=4 -fPIC -march=x86-64 -gdwarf-4 -fno-debug-types-section -fvar-tracking-assignments -g2 ' 'CXXFLAGS=-O2 -fwrapv -pipe -Wformat -Werror=format-security -gdwarf-4 -fno-debug-types-section -fvar-tracking-assignments -g2 -Wp,-D_FORTIFY_SOURCE=2 -fstack-protector-strong --param=ssp-buffer-size=4 -fPIC -march=x86-64 -gdwarf-4 -fno-debug-types-section -fvar-tracking-assignments -g2 ' 'FFLAGS=-O2 -fwrapv -pipe -Wformat -Werror=format-security -gdwarf-4 -fno-debug-types-section -fvar-tracking-assignments -g2 -Wp,-D_FORTIFY_SOURCE=2 -fstack-protector-strong --param=ssp-buffer-size=4 -fPIC -march=x86-64 -gdwarf-4 -fno-debug-types-section -fvar-tracking-assignments -g2 ' 'FCFLAGS=-O2 -fwrapv -pipe -Wformat -Werror=format-security -gdwarf-4 -fno-debug-types-section -fvar-tracking-assignments -g2 -Wp,-D_FORTIFY_SOURCE=2 -fstack-protector-strong --param=ssp-buffer-size=4 -fPIC -march=x86-64 -gdwarf-4 -fno-debug-types-section -fvar-tracking-assignments -g2 ' 'CPPFLAGS=' 'CC=x86_64-pld-linux-gcc' 'CXX=x86_64-pld-linux-g++' '--host=x86_64-pld-linux' '--build=x86_64-pld-linux' '--prefix=/usr' '--exec-prefix=/usr' '--bindir=/usr/bin' '--sbindir=/usr/sbin' '--sysconfdir=/etc' '--datadir=/usr/share' '--includedir=/usr/include' '--libdir=/usr/lib64' '--libexecdir=/usr/libexec' '--localstatedir=/var' '--sharedstatedir=/var/lib' '--mandir=/usr/share/man' '--infodir=/usr/share/info' '--x-libraries=/usr/lib64' checking for a BSD-compatible install... /usr/bin/install -c checking whether build environment is sane... yes checking for a thread-safe mkdir -p... /bin/mkdir -p checking for gawk... gawk checking whether make sets $(MAKE)... yes checking for x86_64-pld-linux-gcc... x86_64-pld-linux-gcc checking whether the C compiler works... yes checking for C compiler default output file name... a.out checking for suffix of executables... checking whether we are cross compiling... no checking for suffix of object files... o checking whether we are using the GNU C compiler... yes checking whether x86_64-pld-linux-gcc accepts -g... yes checking for x86_64-pld-linux-gcc option to accept ISO C89... none needed checking for style of include used by make... GNU checking dependency style of x86_64-pld-linux-gcc... gcc3 checking whether x86_64-pld-linux-gcc and cc understand -c and -o together... yes checking for memset... yes checking for strdup... yes checking how to run the C preprocessor... x86_64-pld-linux-gcc -E checking for grep that handles long lines and -e... /bin/grep checking for egrep... /bin/grep -E checking for ANSI C header files... yes checking for sys/types.h... yes checking for sys/stat.h... yes checking for stdlib.h... yes checking for string.h... yes checking for memory.h... yes checking for strings.h... yes checking for inttypes.h... yes checking for stdint.h... yes checking for unistd.h... yes checking for stdlib.h... (cached) yes checking for stdlib.h... (cached) yes checking for GNU libc compatible malloc... yes checking for size_t... yes checking for an ANSI C-conforming const... yes checking return type of signal handlers... void checking for x86_64-pld-linux-pkg-config... no checking for pkg-config... /usr/bin/pkg-config checking pkg-config is at least version 0.9.0... yes checking for LIBVIRT... yes checking for virEventRunDefaultImpl in -lvirt... yes checking for SNMP... no checking net-snmp net-snmp-config... yes checking MIB directories... found /usr/share/mibs checking pthread.h usability... yes checking pthread.h presence... yes checking for pthread.h... yes checking for pthread_create in -lpthread... yes configure: creating ./config.status config.status: creating Makefile config.status: creating src/Makefile config.status: creating docs/Makefile config.status: creating libvirt-snmp.spec config.status: creating config.h config.status: executing depfiles commands + /usr/bin/make -Otarget -j9 /usr/bin/make all-recursive Making all in src/ make[2]: Entering directory '/tmp/B.VQhH5C/BUILD/libvirt-snmp-0.0.3/src' x86_64-pld-linux-gcc -DHAVE_CONFIG_H -I. -I.. -I/usr/include/libnl3 -I/usr/include -O2 -fwrapv -pipe -Wformat -Werror=format-security -gdwarf-4 -fno-debug-types-section -fvar-tracking-assignments -g2 -Wp,-D_FORTIFY_SOURCE=2 -fstack-protector-strong --param=ssp-buffer-size=4 -fPIC -march=x86-64 -gdwarf-4 -fno-debug-types-section -fvar-tracking-assignments -g2 -MT libvirtMib_subagent-libvirtSnmpError.o -MD -MP -MF .deps/libvirtMib_subagent-libvirtSnmpError.Tpo -c -o libvirtMib_subagent-libvirtSnmpError.o `test -f 'libvirtSnmpError.c' || echo './'`libvirtSnmpError.c mv -f .deps/libvirtMib_subagent-libvirtSnmpError.Tpo .deps/libvirtMib_subagent-libvirtSnmpError.Po make[2]: Leaving directory '/tmp/B.VQhH5C/BUILD/libvirt-snmp-0.0.3/src' make[2]: Entering directory '/tmp/B.VQhH5C/BUILD/libvirt-snmp-0.0.3/src' x86_64-pld-linux-gcc -DHAVE_CONFIG_H -I. -I.. -I/usr/include/libnl3 -I/usr/include -O2 -fwrapv -pipe -Wformat -Werror=format-security -gdwarf-4 -fno-debug-types-section -fvar-tracking-assignments -g2 -Wp,-D_FORTIFY_SOURCE=2 -fstack-protector-strong --param=ssp-buffer-size=4 -fPIC -march=x86-64 -gdwarf-4 -fno-debug-types-section -fvar-tracking-assignments -g2 -MT libvirtMib_subagent-libvirtGuestTable_data_get.o -MD -MP -MF .deps/libvirtMib_subagent-libvirtGuestTable_data_get.Tpo -c -o libvirtMib_subagent-libvirtGuestTable_data_get.o `test -f 'libvirtGuestTable_data_get.c' || echo './'`libvirtGuestTable_data_get.c In file included from libvirtGuestTable_data_get.c:29: libvirtGuestTable.h:124:4: error: unknown type name 'U64' U64 libvirtGuestCpuTime; ^~~ In file included from libvirtGuestTable.h:230, from libvirtGuestTable_data_get.c:29: libvirtGuestTable_data_get.h:58:76: error: unknown type name 'U64' int libvirtGuestCpuTime_get( libvirtGuestTable_rowreq_ctx *rowreq_ctx, U64 * libvirtGuestCpuTime_val_ptr ); ^~~ In file included from libvirtGuestTable.h:231, from libvirtGuestTable_data_get.c:29: libvirtGuestTable_data_set.h:83:80: error: unknown type name 'U64' int libvirtGuestCpuTime_check_value( libvirtGuestTable_rowreq_ctx *rowreq_ctx, U64 libvirtGuestCpuTime_val); ^~~ libvirtGuestTable_data_set.h:85:72: error: unknown type name 'U64' int libvirtGuestCpuTime_set( libvirtGuestTable_rowreq_ctx *rowreq_ctx, U64 libvirtGuestCpuTime_val ); ^~~ libvirtGuestTable_data_get.c:462:68: error: unknown type name 'U64' libvirtGuestCpuTime_get( libvirtGuestTable_rowreq_ctx *rowreq_ctx, U64 * libvirtGuestCpuTime_val_ptr ) ^~~ make[2]: *** [Makefile:365: libvirtMib_subagent-libvirtGuestTable_data_get.o] Error 1 make[2]: Leaving directory '/tmp/B.VQhH5C/BUILD/libvirt-snmp-0.0.3/src' make[2]: *** Waiting for unfinished jobs.... make[2]: Entering directory '/tmp/B.VQhH5C/BUILD/libvirt-snmp-0.0.3/src' x86_64-pld-linux-gcc -DHAVE_CONFIG_H -I. -I.. -I/usr/include/libnl3 -I/usr/include -O2 -fwrapv -pipe -Wformat -Werror=format-security -gdwarf-4 -fno-debug-types-section -fvar-tracking-assignments -g2 -Wp,-D_FORTIFY_SOURCE=2 -fstack-protector-strong --param=ssp-buffer-size=4 -fPIC -march=x86-64 -gdwarf-4 -fno-debug-types-section -fvar-tracking-assignments -g2 -MT libvirtMib_subagent-libvirtGuestTable_data_set.o -MD -MP -MF .deps/libvirtMib_subagent-libvirtGuestTable_data_set.Tpo -c -o libvirtMib_subagent-libvirtGuestTable_data_set.o `test -f 'libvirtGuestTable_data_set.c' || echo './'`libvirtGuestTable_data_set.c In file included from libvirtGuestTable_data_set.c:29: libvirtGuestTable.h:124:4: error: unknown type name 'U64' U64 libvirtGuestCpuTime; ^~~ In file included from libvirtGuestTable.h:230, from libvirtGuestTable_data_set.c:29: libvirtGuestTable_data_get.h:58:76: error: unknown type name 'U64' int libvirtGuestCpuTime_get( libvirtGuestTable_rowreq_ctx *rowreq_ctx, U64 * libvirtGuestCpuTime_val_ptr ); ^~~ In file included from libvirtGuestTable.h:231, from libvirtGuestTable_data_set.c:29: libvirtGuestTable_data_set.h:83:80: error: unknown type name 'U64' int libvirtGuestCpuTime_check_value( libvirtGuestTable_rowreq_ctx *rowreq_ctx, U64 libvirtGuestCpuTime_val); ^~~ libvirtGuestTable_data_set.h:85:72: error: unknown type name 'U64' int libvirtGuestCpuTime_set( libvirtGuestTable_rowreq_ctx *rowreq_ctx, U64 libvirtGuestCpuTime_val ); ^~~ make[2]: *** [Makefile:379: libvirtMib_subagent-libvirtGuestTable_data_set.o] Error 1 make[2]: Leaving directory '/tmp/B.VQhH5C/BUILD/libvirt-snmp-0.0.3/src' make[2]: Entering directory '/tmp/B.VQhH5C/BUILD/libvirt-snmp-0.0.3/src' x86_64-pld-linux-gcc -DHAVE_CONFIG_H -I. -I.. -I/usr/include/libnl3 -I/usr/include -O2 -fwrapv -pipe -Wformat -Werror=format-security -gdwarf-4 -fno-debug-types-section -fvar-tracking-assignments -g2 -Wp,-D_FORTIFY_SOURCE=2 -fstack-protector-strong --param=ssp-buffer-size=4 -fPIC -march=x86-64 -gdwarf-4 -fno-debug-types-section -fvar-tracking-assignments -g2 -MT libvirtMib_subagent-libvirtGuestTable.o -MD -MP -MF .deps/libvirtMib_subagent-libvirtGuestTable.Tpo -c -o libvirtMib_subagent-libvirtGuestTable.o `test -f 'libvirtGuestTable.c' || echo './'`libvirtGuestTable.c In file included from libvirtGuestTable.c:29: libvirtGuestTable.h:124:4: error: unknown type name 'U64' U64 libvirtGuestCpuTime; ^~~ In file included from libvirtGuestTable.h:230, from libvirtGuestTable.c:29: libvirtGuestTable_data_get.h:58:76: error: unknown type name 'U64' int libvirtGuestCpuTime_get( libvirtGuestTable_rowreq_ctx *rowreq_ctx, U64 * libvirtGuestCpuTime_val_ptr ); ^~~ In file included from libvirtGuestTable.h:231, from libvirtGuestTable.c:29: libvirtGuestTable_data_set.h:83:80: error: unknown type name 'U64' int libvirtGuestCpuTime_check_value( libvirtGuestTable_rowreq_ctx *rowreq_ctx, U64 libvirtGuestCpuTime_val); ^~~ libvirtGuestTable_data_set.h:85:72: error: unknown type name 'U64' int libvirtGuestCpuTime_set( libvirtGuestTable_rowreq_ctx *rowreq_ctx, U64 libvirtGuestCpuTime_val ); ^~~ make[2]: *** [Makefile:449: libvirtMib_subagent-libvirtGuestTable.o] Error 1 make[2]: Leaving directory '/tmp/B.VQhH5C/BUILD/libvirt-snmp-0.0.3/src' make[2]: Entering directory '/tmp/B.VQhH5C/BUILD/libvirt-snmp-0.0.3/src' x86_64-pld-linux-gcc -DHAVE_CONFIG_H -I. -I.. -I/usr/include/libnl3 -I/usr/include -O2 -fwrapv -pipe -Wformat -Werror=format-security -gdwarf-4 -fno-debug-types-section -fvar-tracking-assignments -g2 -Wp,-D_FORTIFY_SOURCE=2 -fstack-protector-strong --param=ssp-buffer-size=4 -fPIC -march=x86-64 -gdwarf-4 -fno-debug-types-section -fvar-tracking-assignments -g2 -MT libvirtMib_subagent-libvirtGuestTable_data_access.o -MD -MP -MF .deps/libvirtMib_subagent-libvirtGuestTable_data_access.Tpo -c -o libvirtMib_subagent-libvirtGuestTable_data_access.o `test -f 'libvirtGuestTable_data_access.c' || echo './'`libvirtGuestTable_data_access.c In file included from libvirtGuestTable_data_access.c:29: libvirtGuestTable.h:124:4: error: unknown type name 'U64' U64 libvirtGuestCpuTime; ^~~ In file included from libvirtGuestTable.h:230, from libvirtGuestTable_data_access.c:29: libvirtGuestTable_data_get.h:58:76: error: unknown type name 'U64' int libvirtGuestCpuTime_get( libvirtGuestTable_rowreq_ctx *rowreq_ctx, U64 * libvirtGuestCpuTime_val_ptr ); ^~~ In file included from libvirtGuestTable.h:231, from libvirtGuestTable_data_access.c:29: libvirtGuestTable_data_set.h:83:80: error: unknown type name 'U64' int libvirtGuestCpuTime_check_value( libvirtGuestTable_rowreq_ctx *rowreq_ctx, U64 libvirtGuestCpuTime_val); ^~~ libvirtGuestTable_data_set.h:85:72: error: unknown type name 'U64' int libvirtGuestCpuTime_set( libvirtGuestTable_rowreq_ctx *rowreq_ctx, U64 libvirtGuestCpuTime_val ); ^~~ make[2]: *** [Makefile:393: libvirtMib_subagent-libvirtGuestTable_data_access.o] Error 1 make[2]: Leaving directory '/tmp/B.VQhH5C/BUILD/libvirt-snmp-0.0.3/src' make[2]: Entering directory '/tmp/B.VQhH5C/BUILD/libvirt-snmp-0.0.3/src' x86_64-pld-linux-gcc -DHAVE_CONFIG_H -I. -I.. -I/usr/include/libnl3 -I/usr/include -O2 -fwrapv -pipe -Wformat -Werror=format-security -gdwarf-4 -fno-debug-types-section -fvar-tracking-assignments -g2 -Wp,-D_FORTIFY_SOURCE=2 -fstack-protector-strong --param=ssp-buffer-size=4 -fPIC -march=x86-64 -gdwarf-4 -fno-debug-types-section -fvar-tracking-assignments -g2 -MT libvirtMib_subagent-libvirtGuestTable_interface.o -MD -MP -MF .deps/libvirtMib_subagent-libvirtGuestTable_interface.Tpo -c -o libvirtMib_subagent-libvirtGuestTable_interface.o `test -f 'libvirtGuestTable_interface.c' || echo './'`libvirtGuestTable_interface.c In file included from libvirtGuestTable_interface.c:51: libvirtGuestTable.h:124:4: error: unknown type name 'U64' U64 libvirtGuestCpuTime; ^~~ In file included from libvirtGuestTable.h:230, from libvirtGuestTable_interface.c:51: libvirtGuestTable_data_get.h:58:76: error: unknown type name 'U64' int libvirtGuestCpuTime_get( libvirtGuestTable_rowreq_ctx *rowreq_ctx, U64 * libvirtGuestCpuTime_val_ptr ); ^~~ In file included from libvirtGuestTable.h:231, from libvirtGuestTable_interface.c:51: libvirtGuestTable_data_set.h:83:80: error: unknown type name 'U64' int libvirtGuestCpuTime_check_value( libvirtGuestTable_rowreq_ctx *rowreq_ctx, U64 libvirtGuestCpuTime_val); ^~~ libvirtGuestTable_data_set.h:85:72: error: unknown type name 'U64' int libvirtGuestCpuTime_set( libvirtGuestTable_rowreq_ctx *rowreq_ctx, U64 libvirtGuestCpuTime_val ); ^~~ libvirtGuestTable_interface.c: In function '_libvirtGuestTable_get_column': libvirtGuestTable_interface.c:847:27: error: 'U64' undeclared (first use in this function) var->val_len = sizeof(U64); ^~~ libvirtGuestTable_interface.c:847:27: note: each undeclared identifier is reported only once for each function it appears in libvirtGuestTable_interface.c:849:6: warning: implicit declaration of function 'libvirtGuestCpuTime_get'; did you mean 'libvirtGuestCpuTime_undo'? [-Wimplicit-function-declaration] rc = libvirtGuestCpuTime_get(rowreq_ctx, (U64 *)var->val.string ); ^~~~~~~~~~~~~~~~~~~~~~~ libvirtGuestCpuTime_undo libvirtGuestTable_interface.c:849:48: error: expected expression before ')' token rc = libvirtGuestCpuTime_get(rowreq_ctx, (U64 *)var->val.string ); ^ make[2]: *** [Makefile:477: libvirtMib_subagent-libvirtGuestTable_interface.o] Error 1 make[2]: Leaving directory '/tmp/B.VQhH5C/BUILD/libvirt-snmp-0.0.3/src' make[2]: Entering directory '/tmp/B.VQhH5C/BUILD/libvirt-snmp-0.0.3/src' x86_64-pld-linux-gcc -DHAVE_CONFIG_H -I. -I.. -I/usr/include/libnl3 -I/usr/include -O2 -fwrapv -pipe -Wformat -Werror=format-security -gdwarf-4 -fno-debug-types-section -fvar-tracking-assignments -g2 -Wp,-D_FORTIFY_SOURCE=2 -fstack-protector-strong --param=ssp-buffer-size=4 -fPIC -march=x86-64 -gdwarf-4 -fno-debug-types-section -fvar-tracking-assignments -g2 -MT libvirtMib_subagent-libvirtSnmp.o -MD -MP -MF .deps/libvirtMib_subagent-libvirtSnmp.Tpo -c -o libvirtMib_subagent-libvirtSnmp.o `test -f 'libvirtSnmp.c' || echo './'`libvirtSnmp.c In file included from libvirtSnmp.c:33: libvirtGuestTable.h:124:4: error: unknown type name 'U64' U64 libvirtGuestCpuTime; ^~~ In file included from libvirtGuestTable.h:230, from libvirtSnmp.c:33: libvirtGuestTable_data_get.h:58:76: error: unknown type name 'U64' int libvirtGuestCpuTime_get( libvirtGuestTable_rowreq_ctx *rowreq_ctx, U64 * libvirtGuestCpuTime_val_ptr ); ^~~ In file included from libvirtGuestTable.h:231, from libvirtSnmp.c:33: libvirtGuestTable_data_set.h:83:80: error: unknown type name 'U64' int libvirtGuestCpuTime_check_value( libvirtGuestTable_rowreq_ctx *rowreq_ctx, U64 libvirtGuestCpuTime_val); ^~~ libvirtGuestTable_data_set.h:85:72: error: unknown type name 'U64' int libvirtGuestCpuTime_set( libvirtGuestTable_rowreq_ctx *rowreq_ctx, U64 libvirtGuestCpuTime_val ); ^~~ libvirtSnmp.c: In function 'libvirtSnmpLoadGuests': libvirtSnmp.c:219:42: error: request for member 'high' in something not a structure or union row_ctx->data.libvirtGuestCpuTime.high = info.cpuTime >> 32; ^ libvirtSnmp.c:220:42: error: request for member 'low' in something not a structure or union row_ctx->data.libvirtGuestCpuTime.low = info.cpuTime & 0xFFFFFFFF; ^ make[2]: *** [Makefile:435: libvirtMib_subagent-libvirtSnmp.o] Error 1 make[2]: Leaving directory '/tmp/B.VQhH5C/BUILD/libvirt-snmp-0.0.3/src' make[2]: Entering directory '/tmp/B.VQhH5C/BUILD/libvirt-snmp-0.0.3/src' x86_64-pld-linux-gcc -DHAVE_CONFIG_H -I. -I.. -I/usr/include/libnl3 -I/usr/include -O2 -fwrapv -pipe -Wformat -Werror=format-security -gdwarf-4 -fno-debug-types-section -fvar-tracking-assignments -g2 -Wp,-D_FORTIFY_SOURCE=2 -fstack-protector-strong --param=ssp-buffer-size=4 -fPIC -march=x86-64 -gdwarf-4 -fno-debug-types-section -fvar-tracking-assignments -g2 -MT libvirtMib_subagent-libvirtMib_subagent.o -MD -MP -MF .deps/libvirtMib_subagent-libvirtMib_subagent.Tpo -c -o libvirtMib_subagent-libvirtMib_subagent.o `test -f 'libvirtMib_subagent.c' || echo './'`libvirtMib_subagent.c In file included from libvirtMib_subagent.c:29: libvirtGuestTable.h:124:4: error: unknown type name 'U64' U64 libvirtGuestCpuTime; ^~~ In file included from libvirtGuestTable.h:230, from libvirtMib_subagent.c:29: libvirtGuestTable_data_get.h:58:76: error: unknown type name 'U64' int libvirtGuestCpuTime_get( libvirtGuestTable_rowreq_ctx *rowreq_ctx, U64 * libvirtGuestCpuTime_val_ptr ); ^~~ In file included from libvirtGuestTable.h:231, from libvirtMib_subagent.c:29: libvirtGuestTable_data_set.h:83:80: error: unknown type name 'U64' int libvirtGuestCpuTime_check_value( libvirtGuestTable_rowreq_ctx *rowreq_ctx, U64 libvirtGuestCpuTime_val); ^~~ libvirtGuestTable_data_set.h:85:72: error: unknown type name 'U64' int libvirtGuestCpuTime_set( libvirtGuestTable_rowreq_ctx *rowreq_ctx, U64 libvirtGuestCpuTime_val ); ^~~ make[2]: *** [Makefile:463: libvirtMib_subagent-libvirtMib_subagent.o] Error 1 make[2]: Leaving directory '/tmp/B.VQhH5C/BUILD/libvirt-snmp-0.0.3/src' make[2]: Entering directory '/tmp/B.VQhH5C/BUILD/libvirt-snmp-0.0.3/src' x86_64-pld-linux-gcc -DHAVE_CONFIG_H -I. -I.. -I/usr/include/libnl3 -I/usr/include -O2 -fwrapv -pipe -Wformat -Werror=format-security -gdwarf-4 -fno-debug-types-section -fvar-tracking-assignments -g2 -Wp,-D_FORTIFY_SOURCE=2 -fstack-protector-strong --param=ssp-buffer-size=4 -fPIC -march=x86-64 -gdwarf-4 -fno-debug-types-section -fvar-tracking-assignments -g2 -MT libvirtMib_subagent-libvirtNotifications.o -MD -MP -MF .deps/libvirtMib_subagent-libvirtNotifications.Tpo -c -o libvirtMib_subagent-libvirtNotifications.o `test -f 'libvirtNotifications.c' || echo './'`libvirtNotifications.c mv -f .deps/libvirtMib_subagent-libvirtNotifications.Tpo .deps/libvirtMib_subagent-libvirtNotifications.Po make[2]: Leaving directory '/tmp/B.VQhH5C/BUILD/libvirt-snmp-0.0.3/src' make[1]: *** [Makefile:271: all-recursive] Error 1 make: *** [Makefile:209: all] Error 2 error: Bad exit status from /tmp/B.VQhH5C/BUILD/tmp/rpm-tmp.29522 (%build) RPM build errors: Bad exit status from /tmp/B.VQhH5C/BUILD/tmp/rpm-tmp.29522 (%build) ended at: Sun Sep 2 19:25:29 2018, done in 0:00:04.828581 error: No files produced. mesg: ttyname failed: Inappropriate ioctl for device + chmod -R u+rwX /tmp/B.VQhH5C/BUILD + rm -rf /tmp/B.VQhH5C/tmp /tmp/B.VQhH5C/BUILD mesg: ttyname failed: Inappropriate ioctl for device + rm -rf /tmp/B.VQhH5C Begin-PLD-Builder-Info Build-Time: user:4.75s sys:0.85s real:7.89s (faults io:0 non-io:397768) End-PLD-Builder-Info
[Back to list of logs] [View rpm -qa of builder]