FailedOk

th/SRPMS[OK]
th/x32[OK]
th/i686[OK]
th/x86_64[OK]

ac/SRPMS[OK]
ac/i386[OK]
ac/i586[OK]
ac/i686[OK]
ac/alpha[OK]
ac/amd64[OK]
ac/athlon[OK]
ac/ppc[OK]
ac/sparc[OK]
ac/sparc64[OK]

Advanced Search
main()
Powered by PLD Linux
(c) 2002-2019 PLD Team
$Revision: 1.37 $
Powered by coffee.
Your IP: 54.226.25.74

libwapcaplet 91527869-73f8-4f04-90b4-56b5458dca31

Status:Failed
Source URL:ftp://buildlogs.pld-linux.org/th/x86_64/FAIL/libwapcaplet,91527869-73f8-4f04-90b4-56b5458dca31.bz2
text/plain URL:View!
full text:View!
rpm -qa of builder:View!
Date:2018/12/27 19:49:21
Runtime:0:00:00.544204

Toc:

  • error 1
  • src/libwapcaplet.c:148:16: error: cast between incompatible function types from 'void * (*)(void * restrict, const void * restrict, size_t)' {aka 'void * (*)(void * restrict, const void * restrict, long unsigned int)'} to 'void (*)(char *, const char *, size_t)' {aka 'void (*)(char *, const char *, long unsigned int)'} [-Werror=cast-function-type]
  • error 2
  • error: Bad exit status from /tmp/B.BRBx89/BUILD/tmp/rpm-tmp.43664 (%build)
  • error 3
  • RPM build errors:
  • error 4
  • error: No files produced.

Content:

request from: qboosh
checking if we should skip the build
started at: Thu Dec 27 19:49:17 2018
killing old processes on a builder
sending signal 9 to pid -1
Killed
cleaning up /tmp
fetching https://srcbuilder.pld-linux.org/th//srpms/91527869-73f8-4f04-90b4-56b5458dca31/libwapcaplet-0.4.1-1.src.rpm
fetched 41290 bytes, 114.2 K/s
installing srpm: libwapcaplet-0.4.1-1.src.rpm
+ install -d /tmp/B.BRBx89/BUILD /tmp/B.BRBx89/RPMS
+ LC_ALL=en_US.UTF-8
+ rpm -qp --changelog libwapcaplet-0.4.1-1.src.rpm
* Thu Dec 27 2018 PLD Linux Team <feedback@pld-linux.org>
- For complete changelog see: http://git.pld-linux.org/?p=packages/libwapcaplet.git;a=log;h=master
* Thu Dec 27 2018 Jakub Bogusz <qboosh@pld-linux.org> 3f5d500
- updated to 0.4.1 + rpm -Uhv --nodeps --define '_topdir /tmp/B.BRBx89' --define '_specdir %{_topdir}' --define '_sourcedir %{_specdir}' --define '_rpmdir %{_topdir}/RPMS' --define '_builddir %{_topdir}/BUILD' libwapcaplet-0.4.1-1.src.rpm Preparing... ################################################## libwapcaplet ################################################## + rm -f libwapcaplet-0.4.1-1.src.rpm + install -m 700 -d /tmp/B.BRBx89/BUILD/tmp + TMPDIR=/tmp/B.BRBx89/BUILD/tmp + exec nice -n 0 rpmbuild -bp --short-circuit --nodeps --define '_topdir /tmp/B.BRBx89' --define '_specdir %{_topdir}' --define '_sourcedir %{_specdir}' --define '_rpmdir %{_topdir}/RPMS' --define '_builddir %{_topdir}/BUILD' --target x86_64-pld-linux --define 'prep exit 0' /tmp/B.BRBx89/libwapcaplet.spec Building target platforms: x86_64-pld-linux checking BuildConflict-ing packages no BuildConflicts found checking BR rpm: Building target platforms: x86_64-pld-linux no BR needed building RPM using: set -ex; : build-id: 91527869-73f8-4f04-90b4-56b5458dca31; TMPDIR=/tmp/B.BRBx89/BUILD/tmp exec nice -n 0 rpmbuild -bb --define '_smp_mflags -j9' --define '_make_opts -Otarget' --define '_pld_builder 1' --define '_topdir /tmp/B.BRBx89' --define '_specdir %{_topdir}' --define '_sourcedir %{_specdir}' --define '_rpmdir %{_topdir}/RPMS' --define '_builddir %{_topdir}/BUILD' --target x86_64-pld-linux /tmp/B.BRBx89/libwapcaplet.spec + : build-id: 91527869-73f8-4f04-90b4-56b5458dca31 + TMPDIR=/tmp/B.BRBx89/BUILD/tmp + exec nice -n 0 rpmbuild -bb --define '_smp_mflags -j9' --define '_make_opts -Otarget' --define '_pld_builder 1' --define '_topdir /tmp/B.BRBx89' --define '_specdir %{_topdir}' --define '_sourcedir %{_specdir}' --define '_rpmdir %{_topdir}/RPMS' --define '_builddir %{_topdir}/BUILD' --target x86_64-pld-linux /tmp/B.BRBx89/libwapcaplet.spec Building target platforms: x86_64-pld-linux Executing(%prep): /bin/sh -e /tmp/B.BRBx89/BUILD/tmp/rpm-tmp.43664 + umask 022 + cd /tmp/B.BRBx89/BUILD + cd /tmp/B.BRBx89/BUILD + rm -rf libwapcaplet-0.4.1 + /usr/bin/gzip -dc /tmp/B.BRBx89/libwapcaplet-0.4.1-src.tar.gz + /bin/tar -xf - + STATUS=0 + '[' 0 -ne 0 ']' + cd libwapcaplet-0.4.1 + /bin/id -u + '[' 1000 '=' 0 ']' + /bin/id -u + '[' 1000 '=' 0 ']' + /bin/chmod -Rf a+rX,u+w,g-w,o-w . + exit 0 Executing(%build): /bin/sh -e /tmp/B.BRBx89/BUILD/tmp/rpm-tmp.43664 TMP=/home/users/builder/tmp HOME=/home/users/builder PATH=/home/users/builder/GNUstep/Tools:/usr/local/bin:/usr/bin:/bin:/home/users/builder/bin TMPDIR=/tmp/B.BRBx89/BUILD/tmp + umask 022 + cd /tmp/B.BRBx89/BUILD + cd libwapcaplet-0.4.1 + export 'CC=x86_64-pld-linux-gcc' + export 'CFLAGS=-O2 -fwrapv -pipe -Wformat -Werror=format-security -gdwarf-4 -fno-debug-types-section -fvar-tracking-assignments -g2 -Wp,-D_FORTIFY_SOURCE=2 -fstack-protector-strong --param=ssp-buffer-size=4 -fPIC -march=x86-64 -gdwarf-4 -fno-debug-types-section -fvar-tracking-assignments -g2 ' + export 'LDFLAGS=-Wl,--as-needed -Wl,--no-copy-dt-needed-entries -Wl,-z,relro -Wl,-z,combreloc ' + export 'AR=ar' + /usr/bin/make -Otarget -j9 'Q=' 'PREFIX=/usr' 'LIBDIR=lib64' 'COMPONENT_TYPE=lib-shared' mkdir -p build-x86_64-pld-linux-x86_64-pld-linux-release-lib-shared mkdir -p build-x86_64-pld-linux-x86_64-pld-linux-release-lib-shared/coverage touch build-x86_64-pld-linux-x86_64-pld-linux-release-lib-shared/stamp ln -f -s libwapcaplet.so.0.4.1 build-x86_64-pld-linux-x86_64-pld-linux-release-lib-shared/libwapcaplet.so.0 ln -f -s libwapcaplet.so.0.4.1 build-x86_64-pld-linux-x86_64-pld-linux-release-lib-shared/libwapcaplet.so COMPILE: src/libwapcaplet.c x86_64-pld-linux-gcc -MMD -MP -D_BSD_SOURCE -D_DEFAULT_SOURCE -I/tmp/B.BRBx89/BUILD/libwapcaplet-0.4.1/include/ -I/tmp/B.BRBx89/BUILD/libwapcaplet-0.4.1/src -Wall -W -Wundef -Wpointer-arith -Wcast-align -Wwrite-strings -Wstrict-prototypes -Wmissing-prototypes -Wmissing-declarations -Wnested-externs -Werror -O2 -fwrapv -pipe -Wformat -Werror=format-security -gdwarf-4 -fno-debug-types-section -fvar-tracking-assignments -g2 -Wp,-D_FORTIFY_SOURCE=2 -fstack-protector-strong --param=ssp-buffer-size=4 -fPIC -march=x86-64 -gdwarf-4 -fno-debug-types-section -fvar-tracking-assignments -g2 -D_ALIGNED="__attribute__((aligned))" -DNDEBUG -O2 -std=c99 -fPIC -DPIC -o build-x86_64-pld-linux-x86_64-pld-linux-release-lib-shared/src_libwapcaplet.o -c src/libwapcaplet.c src/libwapcaplet.c: In function 'lwc_intern_string': src/libwapcaplet.c:148:16: error: cast between incompatible function types from 'void * (*)(void * restrict, const void * restrict, size_t)' {aka 'void * (*)(void * restrict, const void * restrict, long unsigned int)'} to 'void (*)(char *, const char *, size_t)' {aka 'void (*)(char *, const char *, long unsigned int)'} [-Werror=cast-function-type] strncmp, (lwc_memcpy)memcpy); ^ cc1: all warnings being treated as errors make: *** [/usr/share/netsurf-buildsystem/makefiles/Makefile.top:585: build-x86_64-pld-linux-x86_64-pld-linux-release-lib-shared/src_libwapcaplet.o] Error 1 error: Bad exit status from /tmp/B.BRBx89/BUILD/tmp/rpm-tmp.43664 (%build) RPM build errors: Bad exit status from /tmp/B.BRBx89/BUILD/tmp/rpm-tmp.43664 (%build) ended at: Thu Dec 27 19:49:21 2018, done in 0:00:00.544204 error: No files produced. + chmod -R u+rwX /tmp/B.BRBx89/BUILD + rm -rf /tmp/B.BRBx89/tmp /tmp/B.BRBx89/BUILD + rm -rf /tmp/B.BRBx89 Begin-PLD-Builder-Info Build-Time: user:3.00s sys:0.20s real:4.53s (faults io:0 non-io:132303) End-PLD-Builder-Info
[Back to list of logs] [View rpm -qa of builder]