FailedOk

th/SRPMS[OK]
th/x32[OK]
th/i686[OK]
th/x86_64[OK]

ac/SRPMS[OK]
ac/i386[OK]
ac/i586[OK]
ac/i686[OK]
ac/alpha[OK]
ac/amd64[OK]
ac/athlon[OK]
ac/ppc[OK]
ac/sparc[OK]
ac/sparc64[OK]

Advanced Search
main()
Powered by PLD Linux
(c) 2002-2018 PLD Team
$Revision: 1.37 $
Powered by php.
Your IP: 54.234.13.175

lin_tape 20061531-a4fb-4ad3-96e8-317fbc6fa721

Status:Failed
Source URL:ftp://buildlogs.pld-linux.org/th/x86_64/FAIL/lin_tape,20061531-a4fb-4ad3-96e8-317fbc6fa721.bz2
text/plain URL:View!
rpm -qa of builder:View!
Date:2018/10/26 00:39:13
Runtime:0:00:07.449375

Toc:

  • prep
  • Executing(%prep): /bin/sh -e /tmp/B.NAAgQw/BUILD/tmp/rpm-tmp.30801
  • build
  • Executing(%build): /bin/sh -e /tmp/B.NAAgQw/BUILD/tmp/rpm-tmp.30801
  • error 1
  • ./include/linux/compiler.h:358:38: error: call to '__compiletime_assert_279' declared with attribute error: BUILD_BUG_ON failed: (local_raw_sense) != NULL && sizeof(local_raw_sense) != SCSI_SENSE_BUFFERSIZE
  • error 2
  • make[1]: *** [scripts/Makefile.build:305: /tmp/B.NAAgQw/BUILD/lin_tape-3.0.23/lower.o] Error 1
  • error 3
  • error: Bad exit status from /tmp/B.NAAgQw/BUILD/tmp/rpm-tmp.30801 (%build)
  • error 4
  • RPM build errors:
  • error 5
  • error: No files produced.

Content:

request from: baggins
checking if we should skip the build
started at: Fri Oct 26 00:39:01 2018
killing old processes on a builder
mesg: ttyname failed: Inappropriate ioctl for device
sending signal 9 to pid -1
Killed
cleaning up /tmp
mesg: ttyname failed: Inappropriate ioctl for device
fetching https://srcbuilder.pld-linux.org/th//srpms/20061531-a4fb-4ad3-96e8-317fbc6fa721/lin_tape-3.0.23-2%404.19.0_1.src.rpm
fetched 420497 bytes, 863.3 K/s
installing srpm: lin_tape-3.0.23-2@4.19.0_1.src.rpm
mesg: ttyname failed: Inappropriate ioctl for device
+ install -d /tmp/B.NAAgQw/BUILD /tmp/B.NAAgQw/RPMS
+ LC_ALL=en_US.UTF-8
+ rpm -qp --changelog lin_tape-3.0.23-2@4.19.0_1.src.rpm
* Thu Oct 25 2018 PLD Linux Team <feedback@pld-linux.org>
- For complete changelog see: http://git.pld-linux.org/?p=packages/lin_tape.git;a=log;h=master
* Mon Jun 18 2018 Jan Rękorajski <baggins@pld-linux.org> 90256aa
- fix building with kernel 4.17 - rel 2 * Sat Apr 07 2018 Jan Rękorajski <baggins@pld-linux.org> fda6bd2
- up to 3.0.23 - updated patches - added fix for building with kernels 4.15+ * Sat Nov 18 2017 Jan Rękorajski <baggins@pld-linux.org> ba88ce5
- fix building with kernbel 4.14 - rel 3 * Fri Nov 17 2017 Jan Rękorajski <baggins@pld-linux.org> 0710576
- first part of kernel 4.14 fixes + rpm -Uhv --nodeps --define '_topdir /tmp/B.NAAgQw' --define '_specdir %{_topdir}' --define '_sourcedir %{_specdir}' --define '_rpmdir %{_topdir}/RPMS' --define '_builddir %{_topdir}/BUILD' --without userspace --define 'build_kernels head,4.14,4.9,4.4' lin_tape-3.0.23-2@4.19.0_1.src.rpm Preparing... ################################################## lin_tape ################################################## + rm -f lin_tape-3.0.23-2@4.19.0_1.src.rpm mesg: ttyname failed: Inappropriate ioctl for device + install -m 700 -d /tmp/B.NAAgQw/BUILD/tmp mesg: ttyname failed: Inappropriate ioctl for device + TMPDIR=/tmp/B.NAAgQw/BUILD/tmp + exec nice -n 0 rpmbuild -bp --short-circuit --nodeps --define '_topdir /tmp/B.NAAgQw' --define '_specdir %{_topdir}' --define '_sourcedir %{_specdir}' --define '_rpmdir %{_topdir}/RPMS' --define '_builddir %{_topdir}/BUILD' --without userspace --target x86_64-pld-linux --define 'build_kernels head,4.14,4.9,4.4' --define 'prep exit 0' /tmp/B.NAAgQw/lin_tape.spec Building target platforms: x86_64-pld-linux checking BuildConflict-ing packages no BuildConflicts found checking BR rpm: Building target platforms: x86_64-pld-linux no BR needed building RPM using: set -ex; : build-id: 20061531-a4fb-4ad3-96e8-317fbc6fa721; TMPDIR=/tmp/B.NAAgQw/BUILD/tmp exec nice -n 0 rpmbuild -bb --define '_smp_mflags -j9' --define '_make_opts -Otarget' --define '_pld_builder 1' --define '_topdir /tmp/B.NAAgQw' --define '_specdir %{_topdir}' --define '_sourcedir %{_specdir}' --define '_rpmdir %{_topdir}/RPMS' --define '_builddir %{_topdir}/BUILD' --without userspace --target x86_64-pld-linux --define 'build_kernels head,4.14,4.9,4.4' /tmp/B.NAAgQw/lin_tape.spec mesg: ttyname failed: Inappropriate ioctl for device + : build-id: 20061531-a4fb-4ad3-96e8-317fbc6fa721 + TMPDIR=/tmp/B.NAAgQw/BUILD/tmp + exec nice -n 0 rpmbuild -bb --define '_smp_mflags -j9' --define '_make_opts -Otarget' --define '_pld_builder 1' --define '_topdir /tmp/B.NAAgQw' --define '_specdir %{_topdir}' --define '_sourcedir %{_specdir}' --define '_rpmdir %{_topdir}/RPMS' --define '_builddir %{_topdir}/BUILD' --without userspace --target x86_64-pld-linux --define 'build_kernels head,4.14,4.9,4.4' /tmp/B.NAAgQw/lin_tape.spec Building target platforms: x86_64-pld-linux Executing(%prep): /bin/sh -e /tmp/B.NAAgQw/BUILD/tmp/rpm-tmp.30801 + umask 022 + cd /tmp/B.NAAgQw/BUILD + cd /tmp/B.NAAgQw/BUILD + rm -rf lin_tape-3.0.23 + /usr/bin/gzip -dc /tmp/B.NAAgQw/lin_tape-3.0.23.tgz + /bin/tar -xf - + STATUS=0 + '[' 0 -ne 0 ']' + cd lin_tape-3.0.23 + /bin/id -u + '[' 1000 '=' 0 ']' + /bin/id -u + '[' 1000 '=' 0 ']' + /bin/chmod -Rf a+rX,u+w,g-w,o-w . + /bin/sed -i -e 's,\r$,,' Makefile + echo 'Patch #0 (use-module-dir.patch):' Patch #0 (use-module-dir.patch): + '[' -f /tmp/B.NAAgQw/use-module-dir.patch ']' + /bin/cat /tmp/B.NAAgQw/use-module-dir.patch + /usr/bin/patch -s -p1 + echo 'Patch #1 (clean-ifdefs.patch):' Patch #1 (clean-ifdefs.patch): + '[' -f /tmp/B.NAAgQw/clean-ifdefs.patch ']' + /bin/cat /tmp/B.NAAgQw/clean-ifdefs.patch + /usr/bin/patch -s -p1 + echo 'Patch #2 (linux-4.9.patch):' Patch #2 (linux-4.9.patch): + '[' -f /tmp/B.NAAgQw/linux-4.9.patch ']' + /bin/cat /tmp/B.NAAgQw/linux-4.9.patch + /usr/bin/patch -s -p1 + echo 'Patch #3 (linux-4.10.patch):' Patch #3 (linux-4.10.patch): + '[' -f /tmp/B.NAAgQw/linux-4.10.patch ']' + /bin/cat /tmp/B.NAAgQw/linux-4.10.patch + /usr/bin/patch -s -p1 + echo 'Patch #4 (linux-4.11.patch):' Patch #4 (linux-4.11.patch): + '[' -f /tmp/B.NAAgQw/linux-4.11.patch ']' + /bin/cat /tmp/B.NAAgQw/linux-4.11.patch + /usr/bin/patch -s -p1 + echo 'Patch #5 (linux-4.12.patch):' Patch #5 (linux-4.12.patch): + '[' -f /tmp/B.NAAgQw/linux-4.12.patch ']' + /bin/cat /tmp/B.NAAgQw/linux-4.12.patch + /usr/bin/patch -s -p1 + echo 'Patch #6 (linux-4.13.patch):' Patch #6 (linux-4.13.patch): + '[' -f /tmp/B.NAAgQw/linux-4.13.patch ']' + /bin/cat /tmp/B.NAAgQw/linux-4.13.patch + /usr/bin/patch -s -p1 + echo 'Patch #7 (kernel-4.14.patch):' Patch #7 (kernel-4.14.patch): + '[' -f /tmp/B.NAAgQw/kernel-4.14.patch ']' + /bin/cat /tmp/B.NAAgQw/kernel-4.14.patch + /usr/bin/patch -s -p1 + echo 'Patch #8 (kernel-4.15.patch):' Patch #8 (kernel-4.15.patch): + '[' -f /tmp/B.NAAgQw/kernel-4.15.patch ']' + /bin/cat /tmp/B.NAAgQw/kernel-4.15.patch + /usr/bin/patch -s -p1 + echo 'Patch #9 (kernel-4.17.patch):' Patch #9 (kernel-4.17.patch): + '[' -f /tmp/B.NAAgQw/kernel-4.17.patch ']' + /bin/cat /tmp/B.NAAgQw/kernel-4.17.patch + /usr/bin/patch -s -p1 + install -p /tmp/B.NAAgQw/lin_tape.fixlist . + exit 0 Executing(%build): /bin/sh -e /tmp/B.NAAgQw/BUILD/tmp/rpm-tmp.30801 TMP=/home/users/builder/tmp HOME=/home/users/builder PATH=/home/users/builder/GNUstep/Tools:/usr/local/bin:/usr/bin:/bin:/home/users/builder/bin TMPDIR=/tmp/B.NAAgQw/BUILD/tmp + umask 022 + cd /tmp/B.NAAgQw/BUILD + cd lin_tape-3.0.23 + compile + typeset 'L=<' PATCH_SH + set -e -x + '[' -r /usr/src/linux/.config ']' + rm -rf o + install -d o/include/linux o/include/generated o/arch/x86/include o/arch/powerpc/lib + ln -sf /usr/src/linux/.config o/.config + ln -sf /usr/src/linux/Module.symvers o/Module.symvers + '[' -f /usr/src/linux/include/generated/autoconf.h ']' + ln -sf /usr/src/linux/include/generated/autoconf.h o/include/generated/autoconf.h + ln -s ../generated/autoconf.h o/include/linux/autoconf.h + '[' -d /usr/src/linux/arch/x86/include/generated ']' + ln -s /usr/src/linux/arch/x86/include/generated o/arch/x86/include + set +x + install -d o/include/config + touch o/include/config/MARKER + ln -sf /usr/src/linux/include/config/auto.conf o/include/config/auto.conf + ln -sf /usr/src/linux/scripts o/scripts + /usr/bin/make -Otarget -j9 -C /usr/src/linux clean 'RCS_FIND_IGNORE=-name '\''*.[ks]o'\'' -o' 'M=/tmp/B.NAAgQw/BUILD/lin_tape-3.0.23' 'HOSTCC=x86_64-pld-linux-gcc' 'SYSSRC=/usr/src/linux' 'SYSOUT=/tmp/B.NAAgQw/BUILD/lin_tape-3.0.23/o' 'CC=x86_64-pld-linux-gcc' + /usr/bin/make -Otarget -j9 -C /usr/src/linux modules 'M=/tmp/B.NAAgQw/BUILD/lin_tape-3.0.23' 'CONSTIFY_PLUGIN=' 'HOSTCC=x86_64-pld-linux-gcc' 'SYSSRC=/usr/src/linux' 'SYSOUT=/tmp/B.NAAgQw/BUILD/lin_tape-3.0.23/o' 'CC=x86_64-pld-linux-gcc' CC [M] /tmp/B.NAAgQw/BUILD/lin_tape-3.0.23/fo_util.o CC [M] /tmp/B.NAAgQw/BUILD/lin_tape-3.0.23/lin_tape_scsi_trace.o CC [M] /tmp/B.NAAgQw/BUILD/lin_tape-3.0.23/join.o CC [M] /tmp/B.NAAgQw/BUILD/lin_tape-3.0.23/lower.o In file included from ./arch/x86/include/asm/current.h:5, from ./include/linux/mutex.h:14, from /tmp/B.NAAgQw/BUILD/lin_tape-3.0.23/lower.c:32: /tmp/B.NAAgQw/BUILD/lin_tape-3.0.23/lower.c: In function 'lower_send': ./include/linux/compiler.h:358:38: error: call to '__compiletime_assert_279' declared with attribute error: BUILD_BUG_ON failed: (local_raw_sense) != NULL && sizeof(local_raw_sense) != SCSI_SENSE_BUFFERSIZE _compiletime_assert(condition, msg, __compiletime_assert_, __LINE__) ^ ./include/linux/compiler.h:338:4: note: in definition of macro '__compiletime_assert' prefix ## suffix(); \ ^~~~~~ ./include/linux/compiler.h:358:2: note: in expansion of macro '_compiletime_assert' _compiletime_assert(condition, msg, __compiletime_assert_, __LINE__) ^~~~~~~~~~~~~~~~~~~ ./include/linux/build_bug.h:45:37: note: in expansion of macro 'compiletime_assert' #define BUILD_BUG_ON_MSG(cond, msg) compiletime_assert(!(cond), msg) ^~~~~~~~~~~~~~~~~~ ./include/linux/build_bug.h:69:2: note: in expansion of macro 'BUILD_BUG_ON_MSG' BUILD_BUG_ON_MSG(condition, "BUILD_BUG_ON failed: " #condition) ^~~~~~~~~~~~~~~~ ./include/scsi/scsi_device.h:440:2: note: in expansion of macro 'BUILD_BUG_ON' BUILD_BUG_ON((sense) != NULL && \ ^~~~~~~~~~~~ /tmp/B.NAAgQw/BUILD/lin_tape-3.0.23/lower.c:272:12: note: in expansion of macro 'scsi_execute' result = scsi_execute(sdev, pfo_cmd->scsi_cmd, ^~~~~~~~~~~~ make[1]: *** [scripts/Makefile.build:305: /tmp/B.NAAgQw/BUILD/lin_tape-3.0.23/lower.o] Error 1 make[1]: *** Waiting for unfinished jobs.... CC [M] /tmp/B.NAAgQw/BUILD/lin_tape-3.0.23/lin_tape_extra_ioctl.o CC [M] /tmp/B.NAAgQw/BUILD/lin_tape-3.0.23/resolve_ibm_hp.o CC [M] /tmp/B.NAAgQw/BUILD/lin_tape-3.0.23/upper.o CC [M] /tmp/B.NAAgQw/BUILD/lin_tape-3.0.23/lin_tape_ioctl_changer.o CC [M] /tmp/B.NAAgQw/BUILD/lin_tape-3.0.23/intercept.o CC [M] /tmp/B.NAAgQw/BUILD/lin_tape-3.0.23/lin_tape_scsi_config.o CC [M] /tmp/B.NAAgQw/BUILD/lin_tape-3.0.23/lin_tape_scsi_tape.o CC [M] /tmp/B.NAAgQw/BUILD/lin_tape-3.0.23/lin_tape_ioctl_tape.o make: *** [Makefile:1517: _module_/tmp/B.NAAgQw/BUILD/lin_tape-3.0.23] Error 2 error: Bad exit status from /tmp/B.NAAgQw/BUILD/tmp/rpm-tmp.30801 (%build) RPM build errors: Bad exit status from /tmp/B.NAAgQw/BUILD/tmp/rpm-tmp.30801 (%build) ended at: Fri Oct 26 00:39:13 2018, done in 0:00:07.449375 error: No files produced. mesg: ttyname failed: Inappropriate ioctl for device + chmod -R u+rwX /tmp/B.NAAgQw/BUILD + rm -rf /tmp/B.NAAgQw/tmp /tmp/B.NAAgQw/BUILD mesg: ttyname failed: Inappropriate ioctl for device + rm -rf /tmp/B.NAAgQw Begin-PLD-Builder-Info Build-Time: user:21.29s sys:2.92s real:12.29s (faults io:0 non-io:1023129) End-PLD-Builder-Info
[Back to list of logs] [View rpm -qa of builder]