FailedOk

th/SRPMS[OK]
th/x32[OK]
th/i686[OK]
th/x86_64[OK]

ac/SRPMS[OK]
ac/i386[OK]
ac/i586[OK]
ac/i686[OK]
ac/alpha[OK]
ac/amd64[OK]
ac/athlon[OK]
ac/ppc[OK]
ac/sparc[OK]
ac/sparc64[OK]

Advanced Search
main()
Powered by PLD Linux
(c) 2002-2018 PLD Team
$Revision: 1.37 $
Powered by ELF.
Your IP: 54.221.75.68

lin_tape 27aa551f-f369-4d84-b9eb-7725e8ecfd1f

Status:Failed
Source URL:ftp://buildlogs.pld-linux.org/th/x86_64/FAIL/lin_tape,27aa551f-f369-4d84-b9eb-7725e8ecfd1f.bz2
text/plain URL:View!
full text:View!
rpm -qa of builder:View!
Date:2018/10/27 17:02:15
Runtime:0:00:07.532760

Toc:

  • error 1
  • ./include/linux/compiler.h:358:38: error: call to '__compiletime_assert_279' declared with attribute error: BUILD_BUG_ON failed: (local_raw_sense) != NULL && sizeof(local_raw_sense) != SCSI_SENSE_BUFFERSIZE
  • error 2
  • make[1]: *** [scripts/Makefile.build:305: /tmp/B.4BkEo1/BUILD/lin_tape-3.0.23/lower.o] Error 1
  • error 3
  • error: Bad exit status from /tmp/B.4BkEo1/BUILD/tmp/rpm-tmp.71987 (%build)
  • error 4
  • RPM build errors:
  • error 5
  • error: No files produced.

Content:

+ /usr/bin/gzip -dc /tmp/B.4BkEo1/lin_tape-3.0.23.tgz
+ /bin/tar -xf -
+ STATUS=0 
+ '[' 0 -ne 0 ']'
+ cd lin_tape-3.0.23
+ /bin/id -u
+ '[' 1000 '=' 0 ']'
+ /bin/id -u
+ '[' 1000 '=' 0 ']'
+ /bin/chmod -Rf a+rX,u+w,g-w,o-w .
+ /bin/sed -i -e 's,\r$,,' Makefile
+ echo 'Patch #0 (use-module-dir.patch):'
Patch #0 (use-module-dir.patch):
+ '[' -f /tmp/B.4BkEo1/use-module-dir.patch ']'
+ /bin/cat /tmp/B.4BkEo1/use-module-dir.patch
+ /usr/bin/patch -s -p1
+ echo 'Patch #1 (clean-ifdefs.patch):'
Patch #1 (clean-ifdefs.patch):
+ '[' -f /tmp/B.4BkEo1/clean-ifdefs.patch ']'
+ /bin/cat /tmp/B.4BkEo1/clean-ifdefs.patch
+ /usr/bin/patch -s -p1
+ echo 'Patch #2 (linux-4.9.patch):'
Patch #2 (linux-4.9.patch):
+ '[' -f /tmp/B.4BkEo1/linux-4.9.patch ']'
+ /bin/cat /tmp/B.4BkEo1/linux-4.9.patch
+ /usr/bin/patch -s -p1
+ echo 'Patch #3 (linux-4.10.patch):'
Patch #3 (linux-4.10.patch):
+ '[' -f /tmp/B.4BkEo1/linux-4.10.patch ']'
+ /bin/cat /tmp/B.4BkEo1/linux-4.10.patch
+ /usr/bin/patch -s -p1
+ echo 'Patch #4 (linux-4.11.patch):'
Patch #4 (linux-4.11.patch):
+ '[' -f /tmp/B.4BkEo1/linux-4.11.patch ']'
+ /bin/cat /tmp/B.4BkEo1/linux-4.11.patch
+ /usr/bin/patch -s -p1
+ echo 'Patch #5 (linux-4.12.patch):'
Patch #5 (linux-4.12.patch):
+ '[' -f /tmp/B.4BkEo1/linux-4.12.patch ']'
+ /bin/cat /tmp/B.4BkEo1/linux-4.12.patch
+ /usr/bin/patch -s -p1
+ echo 'Patch #6 (linux-4.13.patch):'
Patch #6 (linux-4.13.patch):
+ '[' -f /tmp/B.4BkEo1/linux-4.13.patch ']'
+ /bin/cat /tmp/B.4BkEo1/linux-4.13.patch
+ /usr/bin/patch -s -p1
+ echo 'Patch #7 (kernel-4.14.patch):'
Patch #7 (kernel-4.14.patch):
+ '[' -f /tmp/B.4BkEo1/kernel-4.14.patch ']'
+ /bin/cat /tmp/B.4BkEo1/kernel-4.14.patch
+ /usr/bin/patch -s -p1
+ echo 'Patch #8 (kernel-4.15.patch):'
Patch #8 (kernel-4.15.patch):
+ '[' -f /tmp/B.4BkEo1/kernel-4.15.patch ']'
+ /bin/cat /tmp/B.4BkEo1/kernel-4.15.patch
+ /usr/bin/patch -s -p1
+ echo 'Patch #9 (kernel-4.17.patch):'
Patch #9 (kernel-4.17.patch):
+ '[' -f /tmp/B.4BkEo1/kernel-4.17.patch ']'
+ /bin/cat /tmp/B.4BkEo1/kernel-4.17.patch
+ /usr/bin/patch -s -p1
+ install -p /tmp/B.4BkEo1/lin_tape.fixlist .
+ exit 0
Executing(%build): /bin/sh -e /tmp/B.4BkEo1/BUILD/tmp/rpm-tmp.71987
TMP=/home/users/builder/tmp
HOME=/home/users/builder
PATH=/home/users/builder/GNUstep/Tools:/usr/local/bin:/usr/bin:/bin:/home/users/builder/bin
TMPDIR=/tmp/B.4BkEo1/BUILD/tmp
+ umask 022
+ cd /tmp/B.4BkEo1/BUILD
+ cd lin_tape-3.0.23
+ compile
+ typeset 'L=<' PATCH_SH
+ set -e -x
+ '[' -r /usr/src/linux/.config ']'
+ rm -rf o
+ install -d o/include/linux o/include/generated o/arch/x86/include o/arch/powerpc/lib
+ ln -sf /usr/src/linux/.config o/.config
+ ln -sf /usr/src/linux/Module.symvers o/Module.symvers
+ '[' -f /usr/src/linux/include/generated/autoconf.h ']'
+ ln -sf /usr/src/linux/include/generated/autoconf.h o/include/generated/autoconf.h
+ ln -s ../generated/autoconf.h o/include/linux/autoconf.h
+ '[' -d /usr/src/linux/arch/x86/include/generated ']'
+ ln -s /usr/src/linux/arch/x86/include/generated o/arch/x86/include
+ set +x
+ install -d o/include/config
+ touch o/include/config/MARKER
+ ln -sf /usr/src/linux/include/config/auto.conf o/include/config/auto.conf
+ ln -sf /usr/src/linux/scripts o/scripts
+ /usr/bin/make -Otarget -j9 -C /usr/src/linux clean 'RCS_FIND_IGNORE=-name '\''*.[ks]o'\'' -o' 'M=/tmp/B.4BkEo1/BUILD/lin_tape-3.0.23' 'HOSTCC=x86_64-pld-linux-gcc' 'SYSSRC=/usr/src/linux' 'SYSOUT=/tmp/B.4BkEo1/BUILD/lin_tape-3.0.23/o' 'CC=x86_64-pld-linux-gcc'
+ /usr/bin/make -Otarget -j9 -C /usr/src/linux modules 'M=/tmp/B.4BkEo1/BUILD/lin_tape-3.0.23' 'CONSTIFY_PLUGIN=' 'HOSTCC=x86_64-pld-linux-gcc' 'SYSSRC=/usr/src/linux' 'SYSOUT=/tmp/B.4BkEo1/BUILD/lin_tape-3.0.23/o' 'CC=x86_64-pld-linux-gcc'
  CC [M]  /tmp/B.4BkEo1/BUILD/lin_tape-3.0.23/lin_tape_scsi_trace.o
  CC [M]  /tmp/B.4BkEo1/BUILD/lin_tape-3.0.23/fo_util.o
  CC [M]  /tmp/B.4BkEo1/BUILD/lin_tape-3.0.23/join.o
  CC [M]  /tmp/B.4BkEo1/BUILD/lin_tape-3.0.23/lower.o
In file included from ./arch/x86/include/asm/current.h:5,
                 from ./include/linux/mutex.h:14,
                 from /tmp/B.4BkEo1/BUILD/lin_tape-3.0.23/lower.c:32:
/tmp/B.4BkEo1/BUILD/lin_tape-3.0.23/lower.c: In function 'lower_send':
./include/linux/compiler.h:358:38: error: call to '__compiletime_assert_279' declared with attribute error: BUILD_BUG_ON failed: (local_raw_sense) != NULL && sizeof(local_raw_sense) != SCSI_SENSE_BUFFERSIZE
  _compiletime_assert(condition, msg, __compiletime_assert_, __LINE__)
                                      ^
./include/linux/compiler.h:338:4: note: in definition of macro '__compiletime_assert'
    prefix ## suffix();    \
    ^~~~~~
./include/linux/compiler.h:358:2: note: in expansion of macro '_compiletime_assert'
  _compiletime_assert(condition, msg, __compiletime_assert_, __LINE__)
  ^~~~~~~~~~~~~~~~~~~
./include/linux/build_bug.h:45:37: note: in expansion of macro 'compiletime_assert'
 #define BUILD_BUG_ON_MSG(cond, msg) compiletime_assert(!(cond), msg)
                                     ^~~~~~~~~~~~~~~~~~
./include/linux/build_bug.h:69:2: note: in expansion of macro 'BUILD_BUG_ON_MSG'
  BUILD_BUG_ON_MSG(condition, "BUILD_BUG_ON failed: " #condition)
  ^~~~~~~~~~~~~~~~
./include/scsi/scsi_device.h:440:2: note: in expansion of macro 'BUILD_BUG_ON'
  BUILD_BUG_ON((sense) != NULL &&     \
  ^~~~~~~~~~~~
/tmp/B.4BkEo1/BUILD/lin_tape-3.0.23/lower.c:272:12: note: in expansion of macro 'scsi_execute'
   result = scsi_execute(sdev, pfo_cmd->scsi_cmd,
            ^~~~~~~~~~~~
make[1]: *** [scripts/Makefile.build:305: /tmp/B.4BkEo1/BUILD/lin_tape-3.0.23/lower.o] Error 1
make[1]: *** Waiting for unfinished jobs....
  CC [M]  /tmp/B.4BkEo1/BUILD/lin_tape-3.0.23/lin_tape_extra_ioctl.o
  CC [M]  /tmp/B.4BkEo1/BUILD/lin_tape-3.0.23/resolve_ibm_hp.o
  CC [M]  /tmp/B.4BkEo1/BUILD/lin_tape-3.0.23/upper.o
  CC [M]  /tmp/B.4BkEo1/BUILD/lin_tape-3.0.23/lin_tape_ioctl_changer.o
  CC [M]  /tmp/B.4BkEo1/BUILD/lin_tape-3.0.23/intercept.o
  CC [M]  /tmp/B.4BkEo1/BUILD/lin_tape-3.0.23/lin_tape_scsi_config.o
  CC [M]  /tmp/B.4BkEo1/BUILD/lin_tape-3.0.23/lin_tape_ioctl_tape.o
  CC [M]  /tmp/B.4BkEo1/BUILD/lin_tape-3.0.23/lin_tape_scsi_tape.o
make: *** [Makefile:1517: _module_/tmp/B.4BkEo1/BUILD/lin_tape-3.0.23] Error 2
error: Bad exit status from /tmp/B.4BkEo1/BUILD/tmp/rpm-tmp.71987 (%build)


RPM build errors:
    Bad exit status from /tmp/B.4BkEo1/BUILD/tmp/rpm-tmp.71987 (%build)
ended at: Sat Oct 27 17:02:15 2018, done in 0:00:07.532760
error: No files produced.
mesg: ttyname failed: Inappropriate ioctl for device
+ chmod -R u+rwX /tmp/B.4BkEo1/BUILD
+ rm -rf /tmp/B.4BkEo1/tmp /tmp/B.4BkEo1/BUILD
mesg: ttyname failed: Inappropriate ioctl for device
+ rm -rf /tmp/B.4BkEo1
Begin-PLD-Builder-Info
Build-Time: user:23.64s sys:2.80s real:14.68s (faults io:0 non-io:1023614)

End-PLD-Builder-Info
[Back to list of logs] [View rpm -qa of builder]