FailedOk

th/SRPMS[OK]
th/x32[OK]
th/i686[OK]
th/x86_64[OK]

ac/SRPMS[OK]
ac/i386[OK]
ac/i586[OK]
ac/i686[OK]
ac/alpha[OK]
ac/amd64[OK]
ac/athlon[OK]
ac/ppc[OK]
ac/sparc[OK]
ac/sparc64[OK]

Advanced Search
main()
Powered by PLD Linux
(c) 2002-2019 PLD Team
$Revision: 1.37 $
Powered by Real Computer.
Your IP: 3.87.147.184

lin_tape 786255d8-a177-4d80-bd92-4f66394c219b

Status:Failed
Source URL:ftp://buildlogs.pld-linux.org/th/x86_64/FAIL/lin_tape,786255d8-a177-4d80-bd92-4f66394c219b.bz2
text/plain URL:View!
full text:View!
rpm -qa of builder:View!
Date:2018/12/27 08:10:41
Runtime:0:00:30.090608

Toc:

  • error 1
  • /tmp/B.En9yt5/BUILD/lin_tape-3.0.33/lin_tape_scsi_tape.c:11848:46: error: passing argument 7 of 'get_user_pages' from incompatible pointer type [-Werror=incompatible-pointer-types]
  • error 2
  • /tmp/B.En9yt5/BUILD/lin_tape-3.0.33/lin_tape_scsi_tape.c:11847:17: error: too many arguments to function 'get_user_pages'
  • error 3
  • make[1]: *** [scripts/Makefile.build:277: /tmp/B.En9yt5/BUILD/lin_tape-3.0.33/lin_tape_scsi_tape.o] Error 1
  • error 4
  • error: Bad exit status from /tmp/B.En9yt5/BUILD/tmp/rpm-tmp.25230 (%build)
  • error 5
  • RPM build errors:
  • error 6
  • error: No files produced.

Content:

+ /usr/bin/make -Otarget -j9 -C /usr/src/linux-4.14 clean 'RCS_FIND_IGNORE=-name '\''*.[ks]o'\'' -o' 'M=/tmp/B.En9yt5/BUILD/lin_tape-3.0.33' 'HOSTCC=x86_64-pld-linux-gcc' 'SYSSRC=/usr/src/linux-4.14' 'SYSOUT=/tmp/B.En9yt5/BUILD/lin_tape-3.0.33/o' 'CC=x86_64-pld-linux-gcc'
make: Entering directory '/usr/src/linux-4.14-4.14.90'
  CLEAN   /tmp/B.En9yt5/BUILD/lin_tape-3.0.33/.tmp_versions
  CLEAN   /tmp/B.En9yt5/BUILD/lin_tape-3.0.33/Module.symvers
make: Leaving directory '/usr/src/linux-4.14-4.14.90'
+ /usr/bin/make -Otarget -j9 -C /usr/src/linux-4.14 modules 'M=/tmp/B.En9yt5/BUILD/lin_tape-3.0.33' 'CONSTIFY_PLUGIN=' 'HOSTCC=x86_64-pld-linux-gcc' 'SYSSRC=/usr/src/linux-4.14' 'SYSOUT=/tmp/B.En9yt5/BUILD/lin_tape-3.0.33/o' 'CC=x86_64-pld-linux-gcc'
  CC [M]  /tmp/B.En9yt5/BUILD/lin_tape-3.0.33/lin_tape_scsi_trace.o
  CC [M]  /tmp/B.En9yt5/BUILD/lin_tape-3.0.33/join.o
  CC [M]  /tmp/B.En9yt5/BUILD/lin_tape-3.0.33/fo_util.o
  CC [M]  /tmp/B.En9yt5/BUILD/lin_tape-3.0.33/resolve_ibm_hp.o
  CC [M]  /tmp/B.En9yt5/BUILD/lin_tape-3.0.33/lin_tape_extra_ioctl.o
  CC [M]  /tmp/B.En9yt5/BUILD/lin_tape-3.0.33/lower.o
  CC [M]  /tmp/B.En9yt5/BUILD/lin_tape-3.0.33/upper.o
  CC [M]  /tmp/B.En9yt5/BUILD/lin_tape-3.0.33/lin_tape_ioctl_changer.o
  CC [M]  /tmp/B.En9yt5/BUILD/lin_tape-3.0.33/trace.o
  CC [M]  /tmp/B.En9yt5/BUILD/lin_tape-3.0.33/intercept.o
  LD [M]  /tmp/B.En9yt5/BUILD/lin_tape-3.0.33/pfo.o
  CC [M]  /tmp/B.En9yt5/BUILD/lin_tape-3.0.33/lin_tape_scsi_config.o
  CC [M]  /tmp/B.En9yt5/BUILD/lin_tape-3.0.33/lin_tape_scsi_tape.o
  CC [M]  /tmp/B.En9yt5/BUILD/lin_tape-3.0.33/lin_tape_ioctl_tape.o
  LD [M]  /tmp/B.En9yt5/BUILD/lin_tape-3.0.33/lin_tape.o
make: Entering directory '/usr/src/linux-4.14-4.14.90'
  Building modules, stage 2.
make: Leaving directory '/usr/src/linux-4.14-4.14.90'
  MODPOST 2 modules
  CC      /tmp/B.En9yt5/BUILD/lin_tape-3.0.33/lin_tape.mod.o
  LD [M]  /tmp/B.En9yt5/BUILD/lin_tape-3.0.33/lin_tape.ko
  CC      /tmp/B.En9yt5/BUILD/lin_tape-3.0.33/pfo.mod.o
  LD [M]  /tmp/B.En9yt5/BUILD/lin_tape-3.0.33/pfo.ko
+ '[' -r /usr/src/linux-4.9/.config ']'
+ rm -rf o
+ install -d o/include/linux o/include/generated o/arch/x86/include o/arch/powerpc/lib
+ ln -sf /usr/src/linux-4.9/.config o/.config
+ ln -sf /usr/src/linux-4.9/Module.symvers o/Module.symvers
+ '[' -f /usr/src/linux-4.9/include/generated/autoconf.h ']'
+ ln -sf /usr/src/linux-4.9/include/generated/autoconf.h o/include/generated/autoconf.h
+ ln -s ../generated/autoconf.h o/include/linux/autoconf.h
+ '[' -d /usr/src/linux-4.9/arch/x86/include/generated ']'
+ ln -s /usr/src/linux-4.9/arch/x86/include/generated o/arch/x86/include
+ set +x
+ install -d o/include/config
+ touch o/include/config/MARKER
+ ln -sf /usr/src/linux-4.9/include/config/auto.conf o/include/config/auto.conf
+ ln -sf /usr/src/linux-4.9/scripts o/scripts
+ /usr/bin/make -Otarget -j9 -C /usr/src/linux-4.9 clean 'RCS_FIND_IGNORE=-name '\''*.[ks]o'\'' -o' 'M=/tmp/B.En9yt5/BUILD/lin_tape-3.0.33' 'HOSTCC=x86_64-pld-linux-gcc' 'SYSSRC=/usr/src/linux-4.9' 'SYSOUT=/tmp/B.En9yt5/BUILD/lin_tape-3.0.33/o' 'CC=x86_64-pld-linux-gcc'
make: Entering directory '/usr/src/linux-4.9-4.9.147'
  CLEAN   /tmp/B.En9yt5/BUILD/lin_tape-3.0.33/.tmp_versions
  CLEAN   /tmp/B.En9yt5/BUILD/lin_tape-3.0.33/Module.symvers
make: Leaving directory '/usr/src/linux-4.9-4.9.147'
+ /usr/bin/make -Otarget -j9 -C /usr/src/linux-4.9 modules 'M=/tmp/B.En9yt5/BUILD/lin_tape-3.0.33' 'CONSTIFY_PLUGIN=' 'HOSTCC=x86_64-pld-linux-gcc' 'SYSSRC=/usr/src/linux-4.9' 'SYSOUT=/tmp/B.En9yt5/BUILD/lin_tape-3.0.33/o' 'CC=x86_64-pld-linux-gcc'
  CC [M]  /tmp/B.En9yt5/BUILD/lin_tape-3.0.33/lin_tape_scsi_trace.o
  CC [M]  /tmp/B.En9yt5/BUILD/lin_tape-3.0.33/fo_util.o
  CC [M]  /tmp/B.En9yt5/BUILD/lin_tape-3.0.33/join.o
  CC [M]  /tmp/B.En9yt5/BUILD/lin_tape-3.0.33/resolve_ibm_hp.o
  CC [M]  /tmp/B.En9yt5/BUILD/lin_tape-3.0.33/lin_tape_extra_ioctl.o
  CC [M]  /tmp/B.En9yt5/BUILD/lin_tape-3.0.33/upper.o
  CC [M]  /tmp/B.En9yt5/BUILD/lin_tape-3.0.33/lower.o
  CC [M]  /tmp/B.En9yt5/BUILD/lin_tape-3.0.33/trace.o
  CC [M]  /tmp/B.En9yt5/BUILD/lin_tape-3.0.33/lin_tape_ioctl_changer.o
  CC [M]  /tmp/B.En9yt5/BUILD/lin_tape-3.0.33/intercept.o
  LD [M]  /tmp/B.En9yt5/BUILD/lin_tape-3.0.33/pfo.o
  CC [M]  /tmp/B.En9yt5/BUILD/lin_tape-3.0.33/lin_tape_scsi_config.o
  CC [M]  /tmp/B.En9yt5/BUILD/lin_tape-3.0.33/lin_tape_ioctl_tape.o
  CC [M]  /tmp/B.En9yt5/BUILD/lin_tape-3.0.33/lin_tape_scsi_tape.o
  LD [M]  /tmp/B.En9yt5/BUILD/lin_tape-3.0.33/lin_tape.o
make: Entering directory '/usr/src/linux-4.9-4.9.147'
  Building modules, stage 2.
make: Leaving directory '/usr/src/linux-4.9-4.9.147'
  MODPOST 2 modules
  CC      /tmp/B.En9yt5/BUILD/lin_tape-3.0.33/lin_tape.mod.o
  LD [M]  /tmp/B.En9yt5/BUILD/lin_tape-3.0.33/lin_tape.ko
  CC      /tmp/B.En9yt5/BUILD/lin_tape-3.0.33/pfo.mod.o
  LD [M]  /tmp/B.En9yt5/BUILD/lin_tape-3.0.33/pfo.ko
+ '[' -r /usr/src/linux-4.4/.config ']'
+ rm -rf o
+ install -d o/include/linux o/include/generated o/arch/x86/include o/arch/powerpc/lib
+ ln -sf /usr/src/linux-4.4/.config o/.config
+ ln -sf /usr/src/linux-4.4/Module.symvers o/Module.symvers
+ '[' -f /usr/src/linux-4.4/include/generated/autoconf.h ']'
+ ln -sf /usr/src/linux-4.4/include/generated/autoconf.h o/include/generated/autoconf.h
+ ln -s ../generated/autoconf.h o/include/linux/autoconf.h
+ '[' -d /usr/src/linux-4.4/arch/x86/include/generated ']'
+ ln -s /usr/src/linux-4.4/arch/x86/include/generated o/arch/x86/include
+ set +x
+ install -d o/include/config
+ touch o/include/config/MARKER
+ ln -sf /usr/src/linux-4.4/include/config/auto.conf o/include/config/auto.conf
+ ln -sf /usr/src/linux-4.4/scripts o/scripts
+ /usr/bin/make -Otarget -j9 -C /usr/src/linux-4.4 clean 'RCS_FIND_IGNORE=-name '\''*.[ks]o'\'' -o' 'M=/tmp/B.En9yt5/BUILD/lin_tape-3.0.33' 'HOSTCC=x86_64-pld-linux-gcc' 'SYSSRC=/usr/src/linux-4.4' 'SYSOUT=/tmp/B.En9yt5/BUILD/lin_tape-3.0.33/o' 'CC=x86_64-pld-linux-gcc'
make: Entering directory '/usr/src/linux-4.4-4.4.169'
  CLEAN   /tmp/B.En9yt5/BUILD/lin_tape-3.0.33/.tmp_versions
  CLEAN   /tmp/B.En9yt5/BUILD/lin_tape-3.0.33/Module.symvers
make: Leaving directory '/usr/src/linux-4.4-4.4.169'
+ /usr/bin/make -Otarget -j9 -C /usr/src/linux-4.4 modules 'M=/tmp/B.En9yt5/BUILD/lin_tape-3.0.33' 'CONSTIFY_PLUGIN=' 'HOSTCC=x86_64-pld-linux-gcc' 'SYSSRC=/usr/src/linux-4.4' 'SYSOUT=/tmp/B.En9yt5/BUILD/lin_tape-3.0.33/o' 'CC=x86_64-pld-linux-gcc'
  CC [M]  /tmp/B.En9yt5/BUILD/lin_tape-3.0.33/fo_util.o
  CC [M]  /tmp/B.En9yt5/BUILD/lin_tape-3.0.33/lin_tape_scsi_trace.o
  CC [M]  /tmp/B.En9yt5/BUILD/lin_tape-3.0.33/join.o
  CC [M]  /tmp/B.En9yt5/BUILD/lin_tape-3.0.33/lin_tape_scsi_tape.o
/tmp/B.En9yt5/BUILD/lin_tape-3.0.33/lin_tape_scsi_tape.c: In function 'lin_tape_get_user_pages':
/tmp/B.En9yt5/BUILD/lin_tape-3.0.33/lin_tape_scsi_tape.c:11848:46: error: passing argument 7 of 'get_user_pages' from incompatible pointer type [-Werror=incompatible-pointer-types]
   (ulong)user_location, number_pages, rw, 0, pages, NULL);
                                              ^~~~~
In file included from /tmp/B.En9yt5/BUILD/lin_tape-3.0.33/lin_tape_tape.h:26,
                 from /tmp/B.En9yt5/BUILD/lin_tape-3.0.33/lin_tape_scsi_tape.h:27,
                 from /tmp/B.En9yt5/BUILD/lin_tape-3.0.33/lin_tape_scsi_tape.c:22:
include/linux/mm.h:1225:31: note: expected 'struct vm_area_struct **' but argument is of type 'struct page **'
       struct vm_area_struct **vmas);
       ~~~~~~~~~~~~~~~~~~~~~~~~^~~~
/tmp/B.En9yt5/BUILD/lin_tape-3.0.33/lin_tape_scsi_tape.c:11847:17: error: too many arguments to function 'get_user_pages'
  mapped_pages = get_user_pages(current, current->mm,
                 ^~~~~~~~~~~~~~
In file included from /tmp/B.En9yt5/BUILD/lin_tape-3.0.33/lin_tape_tape.h:26,
                 from /tmp/B.En9yt5/BUILD/lin_tape-3.0.33/lin_tape_scsi_tape.h:27,
                 from /tmp/B.En9yt5/BUILD/lin_tape-3.0.33/lin_tape_scsi_tape.c:22:
include/linux/mm.h:1222:6: note: declared here
 long get_user_pages(struct task_struct *tsk, struct mm_struct *mm,
      ^~~~~~~~~~~~~~
cc1: some warnings being treated as errors
make[1]: *** [scripts/Makefile.build:277: /tmp/B.En9yt5/BUILD/lin_tape-3.0.33/lin_tape_scsi_tape.o] Error 1
make[1]: *** Waiting for unfinished jobs....
  CC [M]  /tmp/B.En9yt5/BUILD/lin_tape-3.0.33/resolve_ibm_hp.o
  CC [M]  /tmp/B.En9yt5/BUILD/lin_tape-3.0.33/lin_tape_extra_ioctl.o
  CC [M]  /tmp/B.En9yt5/BUILD/lin_tape-3.0.33/lower.o
  CC [M]  /tmp/B.En9yt5/BUILD/lin_tape-3.0.33/upper.o
  CC [M]  /tmp/B.En9yt5/BUILD/lin_tape-3.0.33/intercept.o
  CC [M]  /tmp/B.En9yt5/BUILD/lin_tape-3.0.33/lin_tape_ioctl_changer.o
  CC [M]  /tmp/B.En9yt5/BUILD/lin_tape-3.0.33/lin_tape_scsi_config.o
  CC [M]  /tmp/B.En9yt5/BUILD/lin_tape-3.0.33/lin_tape_ioctl_tape.o
make: *** [Makefile:1439: _module_/tmp/B.En9yt5/BUILD/lin_tape-3.0.33] Error 2
error: Bad exit status from /tmp/B.En9yt5/BUILD/tmp/rpm-tmp.25230 (%build)


RPM build errors:
    Bad exit status from /tmp/B.En9yt5/BUILD/tmp/rpm-tmp.25230 (%build)
ended at: Thu Dec 27 08:10:40 2018, done in 0:00:30.090608
error: No files produced.
+ chmod -R u+rwX /tmp/B.En9yt5/BUILD
+ rm -rf /tmp/B.En9yt5/tmp /tmp/B.En9yt5/BUILD
+ rm -rf /tmp/B.En9yt5
Begin-PLD-Builder-Info
Build-Time: user:74.88s sys:9.25s real:34.81s (faults io:0 non-io:3130295)

End-PLD-Builder-Info
[Back to list of logs] [View rpm -qa of builder]