FailedOk

th/SRPMS[OK]
th/x32[OK]
th/i686[OK]
th/x86_64[OK]

ac/SRPMS[OK]
ac/i386[OK]
ac/i586[OK]
ac/i686[OK]
ac/alpha[OK]
ac/amd64[OK]
ac/athlon[OK]
ac/ppc[OK]
ac/sparc[OK]
ac/sparc64[OK]

Advanced Search
main()
Powered by PLD Linux
(c) 2002-2021 PLD Team
$Revision: 1.37 $
Powered by foobarbaz.
Your IP: 3.238.36.32

lttng-modules 4caabcd3-b655-4fa4-9573-fe1b4c7b1d50

Status:Failed
Source URL:https://buildlogs.pld-linux.org/pld/th/x86_64/FAIL/lttng-modules,4caabcd3-b655-4fa4-9573-fe1b4c7b1d50.bz2
text/plain URL:View!
rpm -qa of builder:View!
Date:2021/02/23 01:34:40
Runtime:0:00:12.551288

Toc:

  • prep
  • Executing(%prep): /bin/sh -e /tmp/B.IZ79_l/BUILD/tmp/rpm-tmp.dBq3oY
  • build
  • Executing(%build): /bin/sh -e /tmp/B.IZ79_l/BUILD/tmp/rpm-tmp.CFjHbp
  • error 1
  • /tmp/B.IZ79_l/BUILD/lttng-modules-2.12.3/lttng-modules-2.12.3/probes/../probes/lttng-tracepoint-event-impl.h:131:6: error: conflicting types for 'trace_block_rq_requeue'
  • error 2
  • /tmp/B.IZ79_l/BUILD/lttng-modules-2.12.3/lttng-modules-2.12.3/probes/../probes/lttng-tracepoint-event-impl.h:131:6: error: conflicting types for 'trace_block_rq_insert'
  • error 3
  • /tmp/B.IZ79_l/BUILD/lttng-modules-2.12.3/lttng-modules-2.12.3/probes/../probes/lttng-tracepoint-event-impl.h:131:6: error: conflicting types for 'trace_block_rq_issue'
  • error 4
  • /tmp/B.IZ79_l/BUILD/lttng-modules-2.12.3/lttng-modules-2.12.3/probes/../probes/lttng-tracepoint-event-impl.h:131:6: error: conflicting types for 'trace_block_bio_bounce'
  • error 5
  • /tmp/B.IZ79_l/BUILD/lttng-modules-2.12.3/lttng-modules-2.12.3/probes/../probes/lttng-tracepoint-event-impl.h:131:6: error: conflicting types for 'trace_block_bio_backmerge'
  • error 6
  • /tmp/B.IZ79_l/BUILD/lttng-modules-2.12.3/lttng-modules-2.12.3/probes/../probes/lttng-tracepoint-event-impl.h:131:6: error: conflicting types for 'trace_block_bio_frontmerge'
  • error 7
  • /tmp/B.IZ79_l/BUILD/lttng-modules-2.12.3/lttng-modules-2.12.3/probes/../probes/lttng-tracepoint-event-impl.h:131:6: error: conflicting types for 'trace_block_bio_queue'
  • error 8
  • /tmp/B.IZ79_l/BUILD/lttng-modules-2.12.3/lttng-modules-2.12.3/probes/../probes/lttng-tracepoint-event-impl.h:131:6: error: conflicting types for 'trace_block_getrq'
  • error 9
  • /tmp/B.IZ79_l/BUILD/lttng-modules-2.12.3/lttng-modules-2.12.3/probes/../probes/lttng-tracepoint-event-impl.h:131:6: error: conflicting types for 'trace_block_split'
  • error 10
  • /tmp/B.IZ79_l/BUILD/lttng-modules-2.12.3/lttng-modules-2.12.3/probes/../probes/lttng-tracepoint-event-impl.h:131:6: error: conflicting types for 'trace_block_bio_remap'
  • error 11
  • /tmp/B.IZ79_l/BUILD/lttng-modules-2.12.3/lttng-modules-2.12.3/probes/../probes/lttng-tracepoint-event-impl.h:131:6: error: conflicting types for 'trace_block_rq_remap'
  • error 12
  • make[3]: *** [scripts/Makefile.build:279: /tmp/B.IZ79_l/BUILD/lttng-modules-2.12.3/lttng-modules-2.12.3/probes/lttng-probe-block.o] Error 1
  • error 13
  • make[2]: *** [scripts/Makefile.build:496: /tmp/B.IZ79_l/BUILD/lttng-modules-2.12.3/lttng-modules-2.12.3/probes] Error 2
  • error 14
  • make[1]: *** [Makefile:1800: /tmp/B.IZ79_l/BUILD/lttng-modules-2.12.3/lttng-modules-2.12.3] Error 2
  • error 15
  • error: Bad exit status from /tmp/B.IZ79_l/BUILD/tmp/rpm-tmp.CFjHbp (%build)
  • error 16
  • RPM build errors:
  • error 17
  • error: No files produced.

Content:

request from: baggins
checking if we should skip the build
started at: Tue Feb 23 01:34:25 2021
killing old processes on a builder
sending signal 9 to pid -1
cleaning up /tmp
fetching https://srcbuilder.pld-linux.org/th//srpms/4caabcd3-b655-4fa4-9573-fe1b4c7b1d50/lttng-modules-2.12.3-2%405.11.0_1.src.rpm
fetched 343999 bytes, 802.1 K/s
installing srpm: lttng-modules-2.12.3-2@5.11.0_1.src.rpm
+ install -d /tmp/B.IZ79_l/BUILD /tmp/B.IZ79_l/RPMS
+ LC_ALL=en_US.UTF-8
+ rpm -qp --changelog lttng-modules-2.12.3-2@5.11.0_1.src.rpm
* Tue Feb 23 2021 PLD Linux Team <feedback@pld-linux.org>
- For complete changelog see: http://git.pld-linux.org/?p=packages/lttng-modules.git;a=log;h=master
* Sat Feb 06 2021 Jan Rękorajski <baggins@pld-linux.org> abf0d8a
- fix building with kernel 4.9.256 - rel 2 * Sat Nov 28 2020 Jan Rękorajski <baggins@pld-linux.org> b704ebb
- up to 2.2.13 + latest fixes * Sat Sep 26 2020 Jan Rękorajski <baggins@pld-linux.org> f9dfa75
- add fixes from upstream git with fixes to build modules on recent kernels - rel 2 * Sun Aug 16 2020 Jan Rękorajski <baggins@pld-linux.org> aa9cd3d
- up to 2.12.2 * Fri Jun 05 2020 Jan Rękorajski <baggins@pld-linux.org> 10babb8
- up to 2.12.1 * Tue Apr 14 2020 Jakub Bogusz <qboosh@pld-linux.org> 9a3ded0
- updated to 2.12.0 (for Linux 3.0+; ftrace integration dropped) - removed obsolete kernel-5.5.3 patch * Sat Apr 04 2020 Jan Rękorajski <baggins@pld-linux.org> 3efbae2
- up to 2.11.2 * Sun Feb 23 2020 Jan Rękorajski <baggins@pld-linux.org> 87b6b5d
- fix version macro * Sun Feb 23 2020 Jan Rękorajski <baggins@pld-linux.org> e66d568
- 4.14 doesn't need this * Sun Feb 23 2020 Jan Rękorajski <baggins@pld-linux.org> 50a7834
- enable fix on all kernels * Sun Feb 23 2020 Jan Rękorajski <baggins@pld-linux.org> 0c8875f
- 5.4 also needs this * Sun Feb 23 2020 Jan Rękorajski <baggins@pld-linux.org> bbbacb5
- fix paths in patch * Sun Feb 23 2020 Jan Rękorajski <baggins@pld-linux.org> d4618bf
- fix building with kernel 5.5.3+ - rel 2 * Wed Jan 29 2020 Jan Rękorajski <baggins@pld-linux.org> 4144a1b
- up to 2.11.1 * Sun Dec 01 2019 Jan Rękorajski <baggins@pld-linux.org> b91196d
- rework build dirs to make sure we clean them between building for different kernels - rel 2 * Sat Nov 30 2019 Jan Rękorajski <baggins@pld-linux.org> 04f5de0
- up to 2.11.0 * Sat Oct 26 2019 Jakub Bogusz <qboosh@pld-linux.org> e3bbd49
- updated to 2.10.12 * Fri Jul 12 2019 Jan Rękorajski <baggins@pld-linux.org> 882dfc8
- up to 2.10.10 * Tue May 07 2019 Jan Rękorajski <baggins@pld-linux.org> 8cdc335
- fix building with kernel 5.1 - rel 2 * Fri Mar 29 2019 Jakub Bogusz <qboosh@pld-linux.org> c281bdf
- updated to 2.10.9 - removed obsolete kernel-4.20,kernel-5.0 patches + rpm -Uhv --nodeps --define '_topdir /tmp/B.IZ79_l' --define '_specdir %{_topdir}' --define '_sourcedir %{_specdir}' --define '_rpmdir %{_topdir}/RPMS' --define '_builddir %{_topdir}/BUILD' --without userspace --define 'build_kernels head' lttng-modules-2.12.3-2@5.11.0_1.src.rpm Updating / installing... lttng-modules-2.12.3-2@5.11.0_1 ######################################## + rm -f lttng-modules-2.12.3-2@5.11.0_1.src.rpm + install -m 700 -d /tmp/B.IZ79_l/BUILD/tmp + TMPDIR=/tmp/B.IZ79_l/BUILD/tmp + exec nice -n 0 rpmbuild -bp --short-circuit --nodeps --define '_topdir /tmp/B.IZ79_l' --define '_specdir %{_topdir}' --define '_sourcedir %{_specdir}' --define '_rpmdir %{_topdir}/RPMS' --define '_builddir %{_topdir}/BUILD' --without userspace --target x86_64-pld-linux --define 'build_kernels head' --define 'prep exit 0' /tmp/B.IZ79_l/lttng-modules.spec warning: Could not canonicalize hostname: ymir Building target platforms: x86_64-pld-linux Building for target x86_64-pld-linux checking BuildConflict-ing packages no BuildConflicts found checking BR no BR needed building RPM using: set -ex; : build-id: 4caabcd3-b655-4fa4-9573-fe1b4c7b1d50; TMPDIR=/tmp/B.IZ79_l/BUILD/tmp exec nice -n 0 rpmbuild -bb --define '_smp_mflags -j9' --define '_make_opts -Otarget' --define '_pld_builder 1' --define '_topdir /tmp/B.IZ79_l' --define '_specdir %{_topdir}' --define '_sourcedir %{_specdir}' --define '_rpmdir %{_topdir}/RPMS' --define '_builddir %{_topdir}/BUILD' --without userspace --target x86_64-pld-linux --define 'build_kernels head' /tmp/B.IZ79_l/lttng-modules.spec + : build-id: 4caabcd3-b655-4fa4-9573-fe1b4c7b1d50 + TMPDIR=/tmp/B.IZ79_l/BUILD/tmp + exec nice -n 0 rpmbuild -bb --define '_smp_mflags -j9' --define '_make_opts -Otarget' --define '_pld_builder 1' --define '_topdir /tmp/B.IZ79_l' --define '_specdir %{_topdir}' --define '_sourcedir %{_specdir}' --define '_rpmdir %{_topdir}/RPMS' --define '_builddir %{_topdir}/BUILD' --without userspace --target x86_64-pld-linux --define 'build_kernels head' /tmp/B.IZ79_l/lttng-modules.spec warning: Could not canonicalize hostname: ymir Building target platforms: x86_64-pld-linux Building for target x86_64-pld-linux Executing(%prep): /bin/sh -e /tmp/B.IZ79_l/BUILD/tmp/rpm-tmp.dBq3oY + umask 022 + cd /tmp/B.IZ79_l/BUILD + cd /tmp/B.IZ79_l/BUILD + rm -rf lttng-modules-2.12.3 + /bin/mkdir -p lttng-modules-2.12.3 + cd lttng-modules-2.12.3 + /usr/bin/bzip2 -dc /tmp/B.IZ79_l/lttng-modules-2.12.3.tar.bz2 + /bin/tar -xof - + STATUS=0 + '[' 0 -ne 0 ']' + /bin/chmod -Rf a+rX,u+w,g-w,o-w . + cd lttng-modules-2.12.3 + echo 'Patch #0 (build.patch):' Patch #0 (build.patch): + </tmp/B.IZ79_l/build.patch + /usr/bin/patch -s -p1 '--fuzz=0' + echo 'Patch #1 (git.patch):' Patch #1 (git.patch): + </tmp/B.IZ79_l/git.patch + /usr/bin/patch -s -p1 '--fuzz=0' + echo 'Patch #2 (kernel-4.9.256.patch):' Patch #2 (kernel-4.9.256.patch): + </tmp/B.IZ79_l/kernel-4.9.256.patch + /usr/bin/patch -s -p1 '--fuzz=0' + RPM_EC=0 + jobs -p + exit 0 Executing(%build): /bin/sh -e /tmp/B.IZ79_l/BUILD/tmp/rpm-tmp.CFjHbp TMP=/home/users/builder/tmp HOME=/home/users/builder PATH=/home/users/builder/GNUstep/Tools:/bin:/usr/bin:/usr/local/bin:/home/users/builder/bin TMPDIR=/tmp/B.IZ79_l/BUILD/tmp + umask 022 + cd /tmp/B.IZ79_l/BUILD + cd lttng-modules-2.12.3 + cd lttng-modules-2.12.3 + /usr/bin/make -Otarget -j9 clean 'KERNELDIR=/usr/src/linux' /usr/bin/make -C /usr/src/linux M=/tmp/B.IZ79_l/BUILD/lttng-modules-2.12.3/lttng-modules-2.12.3 clean find: '/tmp/B.IZ79_l/BUILD/lttng-modules-2.12.3/lttng-modules-2.12.3/extra_version/patches/': No such file or directory find: '/tmp/B.IZ79_l/BUILD/lttng-modules-2.12.3/lttng-modules-2.12.3/lib/../extra_version/patches/': No such file or directory find: '/tmp/B.IZ79_l/BUILD/lttng-modules-2.12.3/lttng-modules-2.12.3/tests/../extra_version/patches/': No such file or directory find: '/tmp/B.IZ79_l/BUILD/lttng-modules-2.12.3/lttng-modules-2.12.3/probes/../extra_version/patches/': No such file or directory + /usr/bin/make -Otarget -j9 'KERNELDIR=/usr/src/linux' /usr/bin/make -C /usr/src/linux M=/tmp/B.IZ79_l/BUILD/lttng-modules-2.12.3/lttng-modules-2.12.3 CONFIG_LTTNG=m CONFIG_LTTNG_CLOCK_PLUGIN_TEST=m modules find: '/tmp/B.IZ79_l/BUILD/lttng-modules-2.12.3/lttng-modules-2.12.3/extra_version/patches/': No such file or directory find: '/tmp/B.IZ79_l/BUILD/lttng-modules-2.12.3/lttng-modules-2.12.3/lib/../extra_version/patches/': No such file or directory find: '/tmp/B.IZ79_l/BUILD/lttng-modules-2.12.3/lttng-modules-2.12.3/tests/../extra_version/patches/': No such file or directory find: '/tmp/B.IZ79_l/BUILD/lttng-modules-2.12.3/lttng-modules-2.12.3/probes/../extra_version/patches/': No such file or directory CC [M] /tmp/B.IZ79_l/BUILD/lttng-modules-2.12.3/lttng-modules-2.12.3/lttng-ring-buffer-metadata-client.o CC [M] /tmp/B.IZ79_l/BUILD/lttng-modules-2.12.3/lttng-modules-2.12.3/lttng-ring-buffer-metadata-mmap-client.o CC [M] /tmp/B.IZ79_l/BUILD/lttng-modules-2.12.3/lttng-modules-2.12.3/tests/probes/lttng-test.o CC [M] /tmp/B.IZ79_l/BUILD/lttng-modules-2.12.3/lttng-modules-2.12.3/lttng-ring-buffer-client-discard.o CC [M] /tmp/B.IZ79_l/BUILD/lttng-modules-2.12.3/lttng-modules-2.12.3/lttng-ring-buffer-client-mmap-discard.o CC [M] /tmp/B.IZ79_l/BUILD/lttng-modules-2.12.3/lttng-modules-2.12.3/lttng-ring-buffer-client-mmap-overwrite.o CC [M] /tmp/B.IZ79_l/BUILD/lttng-modules-2.12.3/lttng-modules-2.12.3/lttng-ring-buffer-client-overwrite.o CC [M] /tmp/B.IZ79_l/BUILD/lttng-modules-2.12.3/lttng-modules-2.12.3/lttng-string-utils.o CC [M] /tmp/B.IZ79_l/BUILD/lttng-modules-2.12.3/lttng-modules-2.12.3/tests/clock-plugin/lttng-clock-plugin-test.o LD [M] /tmp/B.IZ79_l/BUILD/lttng-modules-2.12.3/lttng-modules-2.12.3/tests/lttng-test.o CC [M] /tmp/B.IZ79_l/BUILD/lttng-modules-2.12.3/lttng-modules-2.12.3/lib/ringbuffer/ring_buffer_backend.o LD [M] /tmp/B.IZ79_l/BUILD/lttng-modules-2.12.3/lttng-modules-2.12.3/tests/lttng-clock-plugin-test.o CC [M] /tmp/B.IZ79_l/BUILD/lttng-modules-2.12.3/lttng-modules-2.12.3/lttng-clock.o CC [M] /tmp/B.IZ79_l/BUILD/lttng-modules-2.12.3/lttng-modules-2.12.3/probes/lttng-probe-sched.o CC [M] /tmp/B.IZ79_l/BUILD/lttng-modules-2.12.3/lttng-modules-2.12.3/lttng-abi.o CC [M] /tmp/B.IZ79_l/BUILD/lttng-modules-2.12.3/lttng-modules-2.12.3/lttng-context.o CC [M] /tmp/B.IZ79_l/BUILD/lttng-modules-2.12.3/lttng-modules-2.12.3/lttng-context-pid.o CC [M] /tmp/B.IZ79_l/BUILD/lttng-modules-2.12.3/lttng-modules-2.12.3/lttng-probes.o CC [M] /tmp/B.IZ79_l/BUILD/lttng-modules-2.12.3/lttng-modules-2.12.3/lttng-context-procname.o CC [M] /tmp/B.IZ79_l/BUILD/lttng-modules-2.12.3/lttng-modules-2.12.3/probes/lttng-probe-irq.o CC [M] /tmp/B.IZ79_l/BUILD/lttng-modules-2.12.3/lttng-modules-2.12.3/lttng-events.o CC [M] /tmp/B.IZ79_l/BUILD/lttng-modules-2.12.3/lttng-modules-2.12.3/lib/ringbuffer/ring_buffer_splice.o CC [M] /tmp/B.IZ79_l/BUILD/lttng-modules-2.12.3/lttng-modules-2.12.3/lib/ringbuffer/ring_buffer_iterator.o CC [M] /tmp/B.IZ79_l/BUILD/lttng-modules-2.12.3/lttng-modules-2.12.3/lib/ringbuffer/ring_buffer_frontend.o CC [M] /tmp/B.IZ79_l/BUILD/lttng-modules-2.12.3/lttng-modules-2.12.3/lib/prio_heap/lttng_prio_heap.o CC [M] /tmp/B.IZ79_l/BUILD/lttng-modules-2.12.3/lttng-modules-2.12.3/lttng-context-prio.o CC [M] /tmp/B.IZ79_l/BUILD/lttng-modules-2.12.3/lttng-modules-2.12.3/lib/ringbuffer/ring_buffer_mmap.o CC [M] /tmp/B.IZ79_l/BUILD/lttng-modules-2.12.3/lttng-modules-2.12.3/lib/ringbuffer/ring_buffer_vfs.o CC [M] /tmp/B.IZ79_l/BUILD/lttng-modules-2.12.3/lttng-modules-2.12.3/lib/../wrapper/splice.o LD [M] /tmp/B.IZ79_l/BUILD/lttng-modules-2.12.3/lttng-modules-2.12.3/lib/lttng-lib-ring-buffer.o CC [M] /tmp/B.IZ79_l/BUILD/lttng-modules-2.12.3/lttng-modules-2.12.3/lttng-context-nice.o CC [M] /tmp/B.IZ79_l/BUILD/lttng-modules-2.12.3/lttng-modules-2.12.3/probes/lttng-probe-timer.o CC [M] /tmp/B.IZ79_l/BUILD/lttng-modules-2.12.3/lttng-modules-2.12.3/probes/lttng-probe-module.o CC [M] /tmp/B.IZ79_l/BUILD/lttng-modules-2.12.3/lttng-modules-2.12.3/lttng-context-vpid.o CC [M] /tmp/B.IZ79_l/BUILD/lttng-modules-2.12.3/lttng-modules-2.12.3/probes/lttng-probe-9p.o CC [M] /tmp/B.IZ79_l/BUILD/lttng-modules-2.12.3/lttng-modules-2.12.3/probes/lttng-probe-kmem.o CC [M] /tmp/B.IZ79_l/BUILD/lttng-modules-2.12.3/lttng-modules-2.12.3/probes/lttng-probe-power.o CC [M] /tmp/B.IZ79_l/BUILD/lttng-modules-2.12.3/lttng-modules-2.12.3/probes/lttng-probe-i2c.o CC [M] /tmp/B.IZ79_l/BUILD/lttng-modules-2.12.3/lttng-modules-2.12.3/lttng-context-tid.o CC [M] /tmp/B.IZ79_l/BUILD/lttng-modules-2.12.3/lttng-modules-2.12.3/lttng-context-vtid.o CC [M] /tmp/B.IZ79_l/BUILD/lttng-modules-2.12.3/lttng-modules-2.12.3/lttng-context-cpu-id.o CC [M] /tmp/B.IZ79_l/BUILD/lttng-modules-2.12.3/lttng-modules-2.12.3/probes/lttng-probe-statedump.o CC [M] /tmp/B.IZ79_l/BUILD/lttng-modules-2.12.3/lttng-modules-2.12.3/lttng-context-vppid.o CC [M] /tmp/B.IZ79_l/BUILD/lttng-modules-2.12.3/lttng-modules-2.12.3/lttng-context-ppid.o CC [M] /tmp/B.IZ79_l/BUILD/lttng-modules-2.12.3/lttng-modules-2.12.3/probes/lttng-probe-kvm.o CC [M] /tmp/B.IZ79_l/BUILD/lttng-modules-2.12.3/lttng-modules-2.12.3/probes/lttng-probe-x86-irq-vectors.o CC [M] /tmp/B.IZ79_l/BUILD/lttng-modules-2.12.3/lttng-modules-2.12.3/probes/lttng-probe-x86-exceptions.o CC [M] /tmp/B.IZ79_l/BUILD/lttng-modules-2.12.3/lttng-modules-2.12.3/lttng-context-uid.o CC [M] /tmp/B.IZ79_l/BUILD/lttng-modules-2.12.3/lttng-modules-2.12.3/probes/lttng-probe-kvm-x86-mmu.o CC [M] /tmp/B.IZ79_l/BUILD/lttng-modules-2.12.3/lttng-modules-2.12.3/lttng-context-euid.o CC [M] /tmp/B.IZ79_l/BUILD/lttng-modules-2.12.3/lttng-modules-2.12.3/lttng-context-gid.o CC [M] /tmp/B.IZ79_l/BUILD/lttng-modules-2.12.3/lttng-modules-2.12.3/lttng-context-suid.o CC [M] /tmp/B.IZ79_l/BUILD/lttng-modules-2.12.3/lttng-modules-2.12.3/probes/lttng-probe-signal.o CC [M] /tmp/B.IZ79_l/BUILD/lttng-modules-2.12.3/lttng-modules-2.12.3/probes/lttng-probe-kvm-x86.o CC [M] /tmp/B.IZ79_l/BUILD/lttng-modules-2.12.3/lttng-modules-2.12.3/probes/lttng-probe-block.o In file included from /tmp/B.IZ79_l/BUILD/lttng-modules-2.12.3/lttng-modules-2.12.3/probes/../probes/define_trace.h:87, from /tmp/B.IZ79_l/BUILD/lttng-modules-2.12.3/lttng-modules-2.12.3/probes/../instrumentation/events/lttng-module/block.h:1122, from /tmp/B.IZ79_l/BUILD/lttng-modules-2.12.3/lttng-modules-2.12.3/probes/lttng-probe-block.c:30: /tmp/B.IZ79_l/BUILD/lttng-modules-2.12.3/lttng-modules-2.12.3/probes/../probes/lttng-tracepoint-event-impl.h:131:6: error: conflicting types for 'trace_block_rq_requeue' 131 | void trace_##_name(_proto); | ^~~~~~ /tmp/B.IZ79_l/BUILD/lttng-modules-2.12.3/lttng-modules-2.12.3/probes/../probes/lttng-tracepoint-event-impl.h:43:2: note: in expansion of macro 'LTTNG_TRACEPOINT_EVENT_INSTANCE_MAP' 43 | LTTNG_TRACEPOINT_EVENT_INSTANCE_MAP(map, name, map, PARAMS(proto), PARAMS(args)) | ^~~~~~~~~~~~~~~~~~~~~~~~~~~~~~~~~~~ /tmp/B.IZ79_l/BUILD/lttng-modules-2.12.3/lttng-modules-2.12.3/probes/../probes/lttng-tracepoint-event-impl.h:85:2: note: in expansion of macro 'LTTNG_TRACEPOINT_EVENT_MAP' 85 | LTTNG_TRACEPOINT_EVENT_MAP(name, name, \ | ^~~~~~~~~~~~~~~~~~~~~~~~~~ /tmp/B.IZ79_l/BUILD/lttng-modules-2.12.3/lttng-modules-2.12.3/probes/../instrumentation/events/lttng-module/block.h:279:1: note: in expansion of macro 'LTTNG_TRACEPOINT_EVENT' 279 | LTTNG_TRACEPOINT_EVENT(block_rq_requeue, | ^~~~~~~~~~~~~~~~~~~~~~ In file included from ./include/trace/events/block.h:11, from /tmp/B.IZ79_l/BUILD/lttng-modules-2.12.3/lttng-modules-2.12.3/probes/lttng-probe-block.c:19: ./include/linux/tracepoint.h:238:21: note: previous definition of 'trace_block_rq_requeue' was here 238 | static inline void trace_##name(proto) \ | ^~~~~~ ./include/linux/tracepoint.h:413:2: note: in expansion of macro '__DECLARE_TRACE' 413 | __DECLARE_TRACE(name, PARAMS(proto), PARAMS(args), \ | ^~~~~~~~~~~~~~~ ./include/linux/tracepoint.h:549:2: note: in expansion of macro 'DECLARE_TRACE' 549 | DECLARE_TRACE(name, PARAMS(proto), PARAMS(args)) | ^~~~~~~~~~~~~ ./include/trace/events/block.h:73:1: note: in expansion of macro 'TRACE_EVENT' 73 | TRACE_EVENT(block_rq_requeue, | ^~~~~~~~~~~ In file included from /tmp/B.IZ79_l/BUILD/lttng-modules-2.12.3/lttng-modules-2.12.3/probes/../probes/define_trace.h:87, from /tmp/B.IZ79_l/BUILD/lttng-modules-2.12.3/lttng-modules-2.12.3/probes/../instrumentation/events/lttng-module/block.h:1122, from /tmp/B.IZ79_l/BUILD/lttng-modules-2.12.3/lttng-modules-2.12.3/probes/lttng-probe-block.c:30: /tmp/B.IZ79_l/BUILD/lttng-modules-2.12.3/lttng-modules-2.12.3/probes/../probes/lttng-tracepoint-event-impl.h:131:6: error: conflicting types for 'trace_block_rq_insert' 131 | void trace_##_name(_proto); | ^~~~~~ /tmp/B.IZ79_l/BUILD/lttng-modules-2.12.3/lttng-modules-2.12.3/probes/../probes/lttng-tracepoint-event-impl.h:96:2: note: in expansion of macro 'LTTNG_TRACEPOINT_EVENT_INSTANCE_MAP' 96 | LTTNG_TRACEPOINT_EVENT_INSTANCE_MAP(template, name, name, PARAMS(proto), PARAMS(args)) | ^~~~~~~~~~~~~~~~~~~~~~~~~~~~~~~~~~~ /tmp/B.IZ79_l/BUILD/lttng-modules-2.12.3/lttng-modules-2.12.3/probes/../instrumentation/events/lttng-module/block.h:563:1: note: in expansion of macro 'LTTNG_TRACEPOINT_EVENT_INSTANCE' 563 | LTTNG_TRACEPOINT_EVENT_INSTANCE(block_rq, block_rq_insert, | ^~~~~~~~~~~~~~~~~~~~~~~~~~~~~~~ In file included from ./include/trace/events/block.h:11, from /tmp/B.IZ79_l/BUILD/lttng-modules-2.12.3/lttng-modules-2.12.3/probes/lttng-probe-block.c:19: ./include/linux/tracepoint.h:238:21: note: previous definition of 'trace_block_rq_insert' was here 238 | static inline void trace_##name(proto) \ | ^~~~~~ ./include/linux/tracepoint.h:413:2: note: in expansion of macro '__DECLARE_TRACE' 413 | __DECLARE_TRACE(name, PARAMS(proto), PARAMS(args), \ | ^~~~~~~~~~~~~~~ ./include/linux/tracepoint.h:538:2: note: in expansion of macro 'DECLARE_TRACE' 538 | DECLARE_TRACE(name, PARAMS(proto), PARAMS(args)) | ^~~~~~~~~~~~~ ./include/trace/events/block.h:190:1: note: in expansion of macro 'DEFINE_EVENT' 190 | DEFINE_EVENT(block_rq, block_rq_insert, | ^~~~~~~~~~~~ In file included from /tmp/B.IZ79_l/BUILD/lttng-modules-2.12.3/lttng-modules-2.12.3/probes/../probes/define_trace.h:87, from /tmp/B.IZ79_l/BUILD/lttng-modules-2.12.3/lttng-modules-2.12.3/probes/../instrumentation/events/lttng-module/block.h:1122, from /tmp/B.IZ79_l/BUILD/lttng-modules-2.12.3/lttng-modules-2.12.3/probes/lttng-probe-block.c:30: /tmp/B.IZ79_l/BUILD/lttng-modules-2.12.3/lttng-modules-2.12.3/probes/../probes/lttng-tracepoint-event-impl.h:131:6: error: conflicting types for 'trace_block_rq_issue' 131 | void trace_##_name(_proto); | ^~~~~~ /tmp/B.IZ79_l/BUILD/lttng-modules-2.12.3/lttng-modules-2.12.3/probes/../probes/lttng-tracepoint-event-impl.h:96:2: note: in expansion of macro 'LTTNG_TRACEPOINT_EVENT_INSTANCE_MAP' 96 | LTTNG_TRACEPOINT_EVENT_INSTANCE_MAP(template, name, name, PARAMS(proto), PARAMS(args)) | ^~~~~~~~~~~~~~~~~~~~~~~~~~~~~~~~~~~ /tmp/B.IZ79_l/BUILD/lttng-modules-2.12.3/lttng-modules-2.12.3/probes/../instrumentation/events/lttng-module/block.h:578:1: note: in expansion of macro 'LTTNG_TRACEPOINT_EVENT_INSTANCE' 578 | LTTNG_TRACEPOINT_EVENT_INSTANCE(block_rq, block_rq_issue, | ^~~~~~~~~~~~~~~~~~~~~~~~~~~~~~~ In file included from ./include/trace/events/block.h:11, from /tmp/B.IZ79_l/BUILD/lttng-modules-2.12.3/lttng-modules-2.12.3/probes/lttng-probe-block.c:19: ./include/linux/tracepoint.h:238:21: note: previous definition of 'trace_block_rq_issue' was here 238 | static inline void trace_##name(proto) \ | ^~~~~~ ./include/linux/tracepoint.h:413:2: note: in expansion of macro '__DECLARE_TRACE' 413 | __DECLARE_TRACE(name, PARAMS(proto), PARAMS(args), \ | ^~~~~~~~~~~~~~~ ./include/linux/tracepoint.h:538:2: note: in expansion of macro 'DECLARE_TRACE' 538 | DECLARE_TRACE(name, PARAMS(proto), PARAMS(args)) | ^~~~~~~~~~~~~ ./include/trace/events/block.h:204:1: note: in expansion of macro 'DEFINE_EVENT' 204 | DEFINE_EVENT(block_rq, block_rq_issue, | ^~~~~~~~~~~~ In file included from /tmp/B.IZ79_l/BUILD/lttng-modules-2.12.3/lttng-modules-2.12.3/probes/../probes/define_trace.h:87, from /tmp/B.IZ79_l/BUILD/lttng-modules-2.12.3/lttng-modules-2.12.3/probes/../instrumentation/events/lttng-module/block.h:1122, from /tmp/B.IZ79_l/BUILD/lttng-modules-2.12.3/lttng-modules-2.12.3/probes/lttng-probe-block.c:30: /tmp/B.IZ79_l/BUILD/lttng-modules-2.12.3/lttng-modules-2.12.3/probes/../probes/lttng-tracepoint-event-impl.h:131:6: error: conflicting types for 'trace_block_bio_bounce' 131 | void trace_##_name(_proto); | ^~~~~~ /tmp/B.IZ79_l/BUILD/lttng-modules-2.12.3/lttng-modules-2.12.3/probes/../probes/lttng-tracepoint-event-impl.h:43:2: note: in expansion of macro 'LTTNG_TRACEPOINT_EVENT_INSTANCE_MAP' 43 | LTTNG_TRACEPOINT_EVENT_INSTANCE_MAP(map, name, map, PARAMS(proto), PARAMS(args)) | ^~~~~~~~~~~~~~~~~~~~~~~~~~~~~~~~~~~ /tmp/B.IZ79_l/BUILD/lttng-modules-2.12.3/lttng-modules-2.12.3/probes/../probes/lttng-tracepoint-event-impl.h:85:2: note: in expansion of macro 'LTTNG_TRACEPOINT_EVENT_MAP' 85 | LTTNG_TRACEPOINT_EVENT_MAP(name, name, \ | ^~~~~~~~~~~~~~~~~~~~~~~~~~ /tmp/B.IZ79_l/BUILD/lttng-modules-2.12.3/lttng-modules-2.12.3/probes/../instrumentation/events/lttng-module/block.h:596:1: note: in expansion of macro 'LTTNG_TRACEPOINT_EVENT' 596 | LTTNG_TRACEPOINT_EVENT(block_bio_bounce, | ^~~~~~~~~~~~~~~~~~~~~~ In file included from ./include/trace/events/block.h:11, from /tmp/B.IZ79_l/BUILD/lttng-modules-2.12.3/lttng-modules-2.12.3/probes/lttng-probe-block.c:19: ./include/linux/tracepoint.h:238:21: note: previous definition of 'trace_block_bio_bounce' was here 238 | static inline void trace_##name(proto) \ | ^~~~~~ ./include/linux/tracepoint.h:413:2: note: in expansion of macro '__DECLARE_TRACE' 413 | __DECLARE_TRACE(name, PARAMS(proto), PARAMS(args), \ | ^~~~~~~~~~~~~~~ ./include/linux/tracepoint.h:538:2: note: in expansion of macro 'DECLARE_TRACE' 538 | DECLARE_TRACE(name, PARAMS(proto), PARAMS(args)) | ^~~~~~~~~~~~~ ./include/trace/events/block.h:299:1: note: in expansion of macro 'DEFINE_EVENT' 299 | DEFINE_EVENT(block_bio, block_bio_bounce, | ^~~~~~~~~~~~ In file included from /tmp/B.IZ79_l/BUILD/lttng-modules-2.12.3/lttng-modules-2.12.3/probes/../probes/define_trace.h:87, from /tmp/B.IZ79_l/BUILD/lttng-modules-2.12.3/lttng-modules-2.12.3/probes/../instrumentation/events/lttng-module/block.h:1122, from /tmp/B.IZ79_l/BUILD/lttng-modules-2.12.3/lttng-modules-2.12.3/probes/lttng-probe-block.c:30: /tmp/B.IZ79_l/BUILD/lttng-modules-2.12.3/lttng-modules-2.12.3/probes/../probes/lttng-tracepoint-event-impl.h:131:6: error: conflicting types for 'trace_block_bio_backmerge' 131 | void trace_##_name(_proto); | ^~~~~~ /tmp/B.IZ79_l/BUILD/lttng-modules-2.12.3/lttng-modules-2.12.3/probes/../probes/lttng-tracepoint-event-impl.h:96:2: note: in expansion of macro 'LTTNG_TRACEPOINT_EVENT_INSTANCE_MAP' 96 | LTTNG_TRACEPOINT_EVENT_INSTANCE_MAP(template, name, name, PARAMS(proto), PARAMS(args)) | ^~~~~~~~~~~~~~~~~~~~~~~~~~~~~~~~~~~ /tmp/B.IZ79_l/BUILD/lttng-modules-2.12.3/lttng-modules-2.12.3/probes/../instrumentation/events/lttng-module/block.h:770:1: note: in expansion of macro 'LTTNG_TRACEPOINT_EVENT_INSTANCE' 770 | LTTNG_TRACEPOINT_EVENT_INSTANCE(block_bio_merge, block_bio_backmerge, | ^~~~~~~~~~~~~~~~~~~~~~~~~~~~~~~ In file included from ./include/trace/events/block.h:11, from /tmp/B.IZ79_l/BUILD/lttng-modules-2.12.3/lttng-modules-2.12.3/probes/lttng-probe-block.c:19: ./include/linux/tracepoint.h:238:21: note: previous definition of 'trace_block_bio_backmerge' was here 238 | static inline void trace_##name(proto) \ | ^~~~~~ ./include/linux/tracepoint.h:413:2: note: in expansion of macro '__DECLARE_TRACE' 413 | __DECLARE_TRACE(name, PARAMS(proto), PARAMS(args), \ | ^~~~~~~~~~~~~~~ ./include/linux/tracepoint.h:538:2: note: in expansion of macro 'DECLARE_TRACE' 538 | DECLARE_TRACE(name, PARAMS(proto), PARAMS(args)) | ^~~~~~~~~~~~~ ./include/trace/events/block.h:310:1: note: in expansion of macro 'DEFINE_EVENT' 310 | DEFINE_EVENT(block_bio, block_bio_backmerge, | ^~~~~~~~~~~~ In file included from /tmp/B.IZ79_l/BUILD/lttng-modules-2.12.3/lttng-modules-2.12.3/probes/../probes/define_trace.h:87, from /tmp/B.IZ79_l/BUILD/lttng-modules-2.12.3/lttng-modules-2.12.3/probes/../instrumentation/events/lttng-module/block.h:1122, from /tmp/B.IZ79_l/BUILD/lttng-modules-2.12.3/lttng-modules-2.12.3/probes/lttng-probe-block.c:30: /tmp/B.IZ79_l/BUILD/lttng-modules-2.12.3/lttng-modules-2.12.3/probes/../probes/lttng-tracepoint-event-impl.h:131:6: error: conflicting types for 'trace_block_bio_frontmerge' 131 | void trace_##_name(_proto); | ^~~~~~ /tmp/B.IZ79_l/BUILD/lttng-modules-2.12.3/lttng-modules-2.12.3/probes/../probes/lttng-tracepoint-event-impl.h:96:2: note: in expansion of macro 'LTTNG_TRACEPOINT_EVENT_INSTANCE_MAP' 96 | LTTNG_TRACEPOINT_EVENT_INSTANCE_MAP(template, name, name, PARAMS(proto), PARAMS(args)) | ^~~~~~~~~~~~~~~~~~~~~~~~~~~~~~~~~~~ /tmp/B.IZ79_l/BUILD/lttng-modules-2.12.3/lttng-modules-2.12.3/probes/../instrumentation/events/lttng-module/block.h:785:1: note: in expansion of macro 'LTTNG_TRACEPOINT_EVENT_INSTANCE' 785 | LTTNG_TRACEPOINT_EVENT_INSTANCE(block_bio_merge, block_bio_frontmerge, | ^~~~~~~~~~~~~~~~~~~~~~~~~~~~~~~ In file included from ./include/trace/events/block.h:11, from /tmp/B.IZ79_l/BUILD/lttng-modules-2.12.3/lttng-modules-2.12.3/probes/lttng-probe-block.c:19: ./include/linux/tracepoint.h:238:21: note: previous definition of 'trace_block_bio_frontmerge' was here 238 | static inline void trace_##name(proto) \ | ^~~~~~ ./include/linux/tracepoint.h:413:2: note: in expansion of macro '__DECLARE_TRACE' 413 | __DECLARE_TRACE(name, PARAMS(proto), PARAMS(args), \ | ^~~~~~~~~~~~~~~ ./include/linux/tracepoint.h:538:2: note: in expansion of macro 'DECLARE_TRACE' 538 | DECLARE_TRACE(name, PARAMS(proto), PARAMS(args)) | ^~~~~~~~~~~~~ ./include/trace/events/block.h:321:1: note: in expansion of macro 'DEFINE_EVENT' 321 | DEFINE_EVENT(block_bio, block_bio_frontmerge, | ^~~~~~~~~~~~ In file included from /tmp/B.IZ79_l/BUILD/lttng-modules-2.12.3/lttng-modules-2.12.3/probes/../probes/define_trace.h:87, from /tmp/B.IZ79_l/BUILD/lttng-modules-2.12.3/lttng-modules-2.12.3/probes/../instrumentation/events/lttng-module/block.h:1122, from /tmp/B.IZ79_l/BUILD/lttng-modules-2.12.3/lttng-modules-2.12.3/probes/lttng-probe-block.c:30: /tmp/B.IZ79_l/BUILD/lttng-modules-2.12.3/lttng-modules-2.12.3/probes/../probes/lttng-tracepoint-event-impl.h:131:6: error: conflicting types for 'trace_block_bio_queue' 131 | void trace_##_name(_proto); | ^~~~~~ /tmp/B.IZ79_l/BUILD/lttng-modules-2.12.3/lttng-modules-2.12.3/probes/../probes/lttng-tracepoint-event-impl.h:43:2: note: in expansion of macro 'LTTNG_TRACEPOINT_EVENT_INSTANCE_MAP' 43 | LTTNG_TRACEPOINT_EVENT_INSTANCE_MAP(map, name, map, PARAMS(proto), PARAMS(args)) | ^~~~~~~~~~~~~~~~~~~~~~~~~~~~~~~~~~~ /tmp/B.IZ79_l/BUILD/lttng-modules-2.12.3/lttng-modules-2.12.3/probes/../probes/lttng-tracepoint-event-impl.h:85:2: note: in expansion of macro 'LTTNG_TRACEPOINT_EVENT_MAP' 85 | LTTNG_TRACEPOINT_EVENT_MAP(name, name, \ | ^~~~~~~~~~~~~~~~~~~~~~~~~~ /tmp/B.IZ79_l/BUILD/lttng-modules-2.12.3/lttng-modules-2.12.3/probes/../instrumentation/events/lttng-module/block.h:799:1: note: in expansion of macro 'LTTNG_TRACEPOINT_EVENT' 799 | LTTNG_TRACEPOINT_EVENT(block_bio_queue, | ^~~~~~~~~~~~~~~~~~~~~~ In file included from ./include/trace/events/block.h:11, from /tmp/B.IZ79_l/BUILD/lttng-modules-2.12.3/lttng-modules-2.12.3/probes/lttng-probe-block.c:19: ./include/linux/tracepoint.h:238:21: note: previous definition of 'trace_block_bio_queue' was here 238 | static inline void trace_##name(proto) \ | ^~~~~~ ./include/linux/tracepoint.h:413:2: note: in expansion of macro '__DECLARE_TRACE' 413 | __DECLARE_TRACE(name, PARAMS(proto), PARAMS(args), \ | ^~~~~~~~~~~~~~~ ./include/linux/tracepoint.h:538:2: note: in expansion of macro 'DECLARE_TRACE' 538 | DECLARE_TRACE(name, PARAMS(proto), PARAMS(args)) | ^~~~~~~~~~~~~ ./include/trace/events/block.h:332:1: note: in expansion of macro 'DEFINE_EVENT' 332 | DEFINE_EVENT(block_bio, block_bio_queue, | ^~~~~~~~~~~~ In file included from /tmp/B.IZ79_l/BUILD/lttng-modules-2.12.3/lttng-modules-2.12.3/probes/../probes/define_trace.h:87, from /tmp/B.IZ79_l/BUILD/lttng-modules-2.12.3/lttng-modules-2.12.3/probes/../instrumentation/events/lttng-module/block.h:1122, from /tmp/B.IZ79_l/BUILD/lttng-modules-2.12.3/lttng-modules-2.12.3/probes/lttng-probe-block.c:30: /tmp/B.IZ79_l/BUILD/lttng-modules-2.12.3/lttng-modules-2.12.3/probes/../probes/lttng-tracepoint-event-impl.h:131:6: error: conflicting types for 'trace_block_getrq' 131 | void trace_##_name(_proto); | ^~~~~~ /tmp/B.IZ79_l/BUILD/lttng-modules-2.12.3/lttng-modules-2.12.3/probes/../probes/lttng-tracepoint-event-impl.h:96:2: note: in expansion of macro 'LTTNG_TRACEPOINT_EVENT_INSTANCE_MAP' 96 | LTTNG_TRACEPOINT_EVENT_INSTANCE_MAP(template, name, name, PARAMS(proto), PARAMS(args)) | ^~~~~~~~~~~~~~~~~~~~~~~~~~~~~~~~~~~ /tmp/B.IZ79_l/BUILD/lttng-modules-2.12.3/lttng-modules-2.12.3/probes/../instrumentation/events/lttng-module/block.h:933:1: note: in expansion of macro 'LTTNG_TRACEPOINT_EVENT_INSTANCE' 933 | LTTNG_TRACEPOINT_EVENT_INSTANCE(block_get_rq, block_getrq, | ^~~~~~~~~~~~~~~~~~~~~~~~~~~~~~~ In file included from ./include/trace/events/block.h:11, from /tmp/B.IZ79_l/BUILD/lttng-modules-2.12.3/lttng-modules-2.12.3/probes/lttng-probe-block.c:19: ./include/linux/tracepoint.h:238:21: note: previous definition of 'trace_block_getrq' was here 238 | static inline void trace_##name(proto) \ | ^~~~~~ ./include/linux/tracepoint.h:413:2: note: in expansion of macro '__DECLARE_TRACE' 413 | __DECLARE_TRACE(name, PARAMS(proto), PARAMS(args), \ | ^~~~~~~~~~~~~~~ ./include/linux/tracepoint.h:538:2: note: in expansion of macro 'DECLARE_TRACE' 538 | DECLARE_TRACE(name, PARAMS(proto), PARAMS(args)) | ^~~~~~~~~~~~~ ./include/trace/events/block.h:343:1: note: in expansion of macro 'DEFINE_EVENT' 343 | DEFINE_EVENT(block_bio, block_getrq, | ^~~~~~~~~~~~ In file included from /tmp/B.IZ79_l/BUILD/lttng-modules-2.12.3/lttng-modules-2.12.3/probes/../probes/define_trace.h:87, from /tmp/B.IZ79_l/BUILD/lttng-modules-2.12.3/lttng-modules-2.12.3/probes/../instrumentation/events/lttng-module/block.h:1122, from /tmp/B.IZ79_l/BUILD/lttng-modules-2.12.3/lttng-modules-2.12.3/probes/lttng-probe-block.c:30: /tmp/B.IZ79_l/BUILD/lttng-modules-2.12.3/lttng-modules-2.12.3/probes/../probes/lttng-tracepoint-event-impl.h:131:6: error: conflicting types for 'trace_block_split' 131 | void trace_##_name(_proto); | ^~~~~~ /tmp/B.IZ79_l/BUILD/lttng-modules-2.12.3/lttng-modules-2.12.3/probes/../probes/lttng-tracepoint-event-impl.h:43:2: note: in expansion of macro 'LTTNG_TRACEPOINT_EVENT_INSTANCE_MAP' 43 | LTTNG_TRACEPOINT_EVENT_INSTANCE_MAP(map, name, map, PARAMS(proto), PARAMS(args)) | ^~~~~~~~~~~~~~~~~~~~~~~~~~~~~~~~~~~ /tmp/B.IZ79_l/BUILD/lttng-modules-2.12.3/lttng-modules-2.12.3/probes/../probes/lttng-tracepoint-event-impl.h:85:2: note: in expansion of macro 'LTTNG_TRACEPOINT_EVENT_MAP' 85 | LTTNG_TRACEPOINT_EVENT_MAP(name, name, \ | ^~~~~~~~~~~~~~~~~~~~~~~~~~ /tmp/B.IZ79_l/BUILD/lttng-modules-2.12.3/lttng-modules-2.12.3/probes/../instrumentation/events/lttng-module/block.h:1018:1: note: in expansion of macro 'LTTNG_TRACEPOINT_EVENT' 1018 | LTTNG_TRACEPOINT_EVENT(block_split, | ^~~~~~~~~~~~~~~~~~~~~~ In file included from ./include/trace/events/block.h:11, from /tmp/B.IZ79_l/BUILD/lttng-modules-2.12.3/lttng-modules-2.12.3/probes/lttng-probe-block.c:19: ./include/linux/tracepoint.h:238:21: note: previous definition of 'trace_block_split' was here 238 | static inline void trace_##name(proto) \ | ^~~~~~ ./include/linux/tracepoint.h:413:2: note: in expansion of macro '__DECLARE_TRACE' 413 | __DECLARE_TRACE(name, PARAMS(proto), PARAMS(args), \ | ^~~~~~~~~~~~~~~ ./include/linux/tracepoint.h:549:2: note: in expansion of macro 'DECLARE_TRACE' 549 | DECLARE_TRACE(name, PARAMS(proto), PARAMS(args)) | ^~~~~~~~~~~~~ ./include/trace/events/block.h:418:1: note: in expansion of macro 'TRACE_EVENT' 418 | TRACE_EVENT(block_split, | ^~~~~~~~~~~ In file included from /tmp/B.IZ79_l/BUILD/lttng-modules-2.12.3/lttng-modules-2.12.3/probes/../probes/define_trace.h:87, from /tmp/B.IZ79_l/BUILD/lttng-modules-2.12.3/lttng-modules-2.12.3/probes/../instrumentation/events/lttng-module/block.h:1122, from /tmp/B.IZ79_l/BUILD/lttng-modules-2.12.3/lttng-modules-2.12.3/probes/lttng-probe-block.c:30: /tmp/B.IZ79_l/BUILD/lttng-modules-2.12.3/lttng-modules-2.12.3/probes/../probes/lttng-tracepoint-event-impl.h:131:6: error: conflicting types for 'trace_block_bio_remap' 131 | void trace_##_name(_proto); | ^~~~~~ /tmp/B.IZ79_l/BUILD/lttng-modules-2.12.3/lttng-modules-2.12.3/probes/../probes/lttng-tracepoint-event-impl.h:43:2: note: in expansion of macro 'LTTNG_TRACEPOINT_EVENT_INSTANCE_MAP' 43 | LTTNG_TRACEPOINT_EVENT_INSTANCE_MAP(map, name, map, PARAMS(proto), PARAMS(args)) | ^~~~~~~~~~~~~~~~~~~~~~~~~~~~~~~~~~~ /tmp/B.IZ79_l/BUILD/lttng-modules-2.12.3/lttng-modules-2.12.3/probes/../probes/lttng-tracepoint-event-impl.h:85:2: note: in expansion of macro 'LTTNG_TRACEPOINT_EVENT_MAP' 85 | LTTNG_TRACEPOINT_EVENT_MAP(name, name, \ | ^~~~~~~~~~~~~~~~~~~~~~~~~~ /tmp/B.IZ79_l/BUILD/lttng-modules-2.12.3/lttng-modules-2.12.3/probes/../instrumentation/events/lttng-module/block.h:1057:1: note: in expansion of macro 'LTTNG_TRACEPOINT_EVENT' 1057 | LTTNG_TRACEPOINT_EVENT(block_bio_remap, | ^~~~~~~~~~~~~~~~~~~~~~ In file included from ./include/trace/events/block.h:11, from /tmp/B.IZ79_l/BUILD/lttng-modules-2.12.3/lttng-modules-2.12.3/probes/lttng-probe-block.c:19: ./include/linux/tracepoint.h:238:21: note: previous definition of 'trace_block_bio_remap' was here 238 | static inline void trace_##name(proto) \ | ^~~~~~ ./include/linux/tracepoint.h:413:2: note: in expansion of macro '__DECLARE_TRACE' 413 | __DECLARE_TRACE(name, PARAMS(proto), PARAMS(args), \ | ^~~~~~~~~~~~~~~ ./include/linux/tracepoint.h:549:2: note: in expansion of macro 'DECLARE_TRACE' 549 | DECLARE_TRACE(name, PARAMS(proto), PARAMS(args)) | ^~~~~~~~~~~~~ ./include/trace/events/block.h:456:1: note: in expansion of macro 'TRACE_EVENT' 456 | TRACE_EVENT(block_bio_remap, | ^~~~~~~~~~~ In file included from /tmp/B.IZ79_l/BUILD/lttng-modules-2.12.3/lttng-modules-2.12.3/probes/../probes/define_trace.h:87, from /tmp/B.IZ79_l/BUILD/lttng-modules-2.12.3/lttng-modules-2.12.3/probes/../instrumentation/events/lttng-module/block.h:1122, from /tmp/B.IZ79_l/BUILD/lttng-modules-2.12.3/lttng-modules-2.12.3/probes/lttng-probe-block.c:30: /tmp/B.IZ79_l/BUILD/lttng-modules-2.12.3/lttng-modules-2.12.3/probes/../probes/lttng-tracepoint-event-impl.h:131:6: error: conflicting types for 'trace_block_rq_remap' 131 | void trace_##_name(_proto); | ^~~~~~ /tmp/B.IZ79_l/BUILD/lttng-modules-2.12.3/lttng-modules-2.12.3/probes/../probes/lttng-tracepoint-event-impl.h:43:2: note: in expansion of macro 'LTTNG_TRACEPOINT_EVENT_INSTANCE_MAP' 43 | LTTNG_TRACEPOINT_EVENT_INSTANCE_MAP(map, name, map, PARAMS(proto), PARAMS(args)) | ^~~~~~~~~~~~~~~~~~~~~~~~~~~~~~~~~~~ /tmp/B.IZ79_l/BUILD/lttng-modules-2.12.3/lttng-modules-2.12.3/probes/../probes/lttng-tracepoint-event-impl.h:85:2: note: in expansion of macro 'LTTNG_TRACEPOINT_EVENT_MAP' 85 | LTTNG_TRACEPOINT_EVENT_MAP(name, name, \ | ^~~~~~~~~~~~~~~~~~~~~~~~~~ /tmp/B.IZ79_l/BUILD/lttng-modules-2.12.3/lttng-modules-2.12.3/probes/../instrumentation/events/lttng-module/block.h:1098:1: note: in expansion of macro 'LTTNG_TRACEPOINT_EVENT' 1098 | LTTNG_TRACEPOINT_EVENT(block_rq_remap, | ^~~~~~~~~~~~~~~~~~~~~~ In file included from ./include/trace/events/block.h:11, from /tmp/B.IZ79_l/BUILD/lttng-modules-2.12.3/lttng-modules-2.12.3/probes/lttng-probe-block.c:19: ./include/linux/tracepoint.h:238:21: note: previous definition of 'trace_block_rq_remap' was here 238 | static inline void trace_##name(proto) \ | ^~~~~~ ./include/linux/tracepoint.h:413:2: note: in expansion of macro '__DECLARE_TRACE' 413 | __DECLARE_TRACE(name, PARAMS(proto), PARAMS(args), \ | ^~~~~~~~~~~~~~~ ./include/linux/tracepoint.h:549:2: note: in expansion of macro 'DECLARE_TRACE' 549 | DECLARE_TRACE(name, PARAMS(proto), PARAMS(args)) | ^~~~~~~~~~~~~ ./include/trace/events/block.h:498:1: note: in expansion of macro 'TRACE_EVENT' 498 | TRACE_EVENT(block_rq_remap, | ^~~~~~~~~~~ make[3]: *** [scripts/Makefile.build:279: /tmp/B.IZ79_l/BUILD/lttng-modules-2.12.3/lttng-modules-2.12.3/probes/lttng-probe-block.o] Error 1 make[3]: *** Waiting for unfinished jobs.... CC [M] /tmp/B.IZ79_l/BUILD/lttng-modules-2.12.3/lttng-modules-2.12.3/probes/lttng-probe-napi.o CC [M] /tmp/B.IZ79_l/BUILD/lttng-modules-2.12.3/lttng-modules-2.12.3/lttng-context-egid.o CC [M] /tmp/B.IZ79_l/BUILD/lttng-modules-2.12.3/lttng-modules-2.12.3/probes/lttng-probe-skb.o CC [M] /tmp/B.IZ79_l/BUILD/lttng-modules-2.12.3/lttng-modules-2.12.3/lttng-context-sgid.o CC [M] /tmp/B.IZ79_l/BUILD/lttng-modules-2.12.3/lttng-modules-2.12.3/probes/lttng-probe-udp.o CC [M] /tmp/B.IZ79_l/BUILD/lttng-modules-2.12.3/lttng-modules-2.12.3/probes/lttng-probe-sock.o CC [M] /tmp/B.IZ79_l/BUILD/lttng-modules-2.12.3/lttng-modules-2.12.3/probes/lttng-probe-net.o CC [M] /tmp/B.IZ79_l/BUILD/lttng-modules-2.12.3/lttng-modules-2.12.3/lttng-context-vuid.o CC [M] /tmp/B.IZ79_l/BUILD/lttng-modules-2.12.3/lttng-modules-2.12.3/lttng-context-veuid.o CC [M] /tmp/B.IZ79_l/BUILD/lttng-modules-2.12.3/lttng-modules-2.12.3/lttng-context-vsuid.o CC [M] /tmp/B.IZ79_l/BUILD/lttng-modules-2.12.3/lttng-modules-2.12.3/probes/lttng-probe-asoc.o make[2]: *** [scripts/Makefile.build:496: /tmp/B.IZ79_l/BUILD/lttng-modules-2.12.3/lttng-modules-2.12.3/probes] Error 2 make[2]: *** Waiting for unfinished jobs.... CC [M] /tmp/B.IZ79_l/BUILD/lttng-modules-2.12.3/lttng-modules-2.12.3/lttng-context-vgid.o CC [M] /tmp/B.IZ79_l/BUILD/lttng-modules-2.12.3/lttng-modules-2.12.3/lttng-context-vegid.o CC [M] /tmp/B.IZ79_l/BUILD/lttng-modules-2.12.3/lttng-modules-2.12.3/lttng-context-vsgid.o CC [M] /tmp/B.IZ79_l/BUILD/lttng-modules-2.12.3/lttng-modules-2.12.3/lttng-context-interruptible.o CC [M] /tmp/B.IZ79_l/BUILD/lttng-modules-2.12.3/lttng-modules-2.12.3/lttng-context-need-reschedule.o CC [M] /tmp/B.IZ79_l/BUILD/lttng-modules-2.12.3/lttng-modules-2.12.3/lttng-calibrate.o CC [M] /tmp/B.IZ79_l/BUILD/lttng-modules-2.12.3/lttng-modules-2.12.3/lttng-context-callstack.o CC [M] /tmp/B.IZ79_l/BUILD/lttng-modules-2.12.3/lttng-modules-2.12.3/lttng-context-hostname.o make[1]: *** [Makefile:1800: /tmp/B.IZ79_l/BUILD/lttng-modules-2.12.3/lttng-modules-2.12.3] Error 2 make: *** [Makefile:153: modules] Error 2 error: Bad exit status from /tmp/B.IZ79_l/BUILD/tmp/rpm-tmp.CFjHbp (%build) RPM build errors: Could not canonicalize hostname: ymir Bad exit status from /tmp/B.IZ79_l/BUILD/tmp/rpm-tmp.CFjHbp (%build) ended at: Tue Feb 23 01:34:40 2021, done in 0:00:12.551288 error: No files produced. + chmod -R u+rwX /tmp/B.IZ79_l/BUILD + rm -rf /tmp/B.IZ79_l/tmp /tmp/B.IZ79_l/BUILD + rm -rf /tmp/B.IZ79_l Begin-PLD-Builder-Info Build-Time: user:70.09s sys:11.46s real:15.65s (faults io:6 non-io:2249495) End-PLD-Builder-Info
[Back to list of logs] [View rpm -qa of builder]