FailedOk

th/SRPMS[OK]
th/x32[OK]
th/i686[OK]
th/x86_64[OK]

ac/SRPMS[OK]
ac/i386[OK]
ac/i586[OK]
ac/i686[OK]
ac/alpha[OK]
ac/amd64[OK]
ac/athlon[OK]
ac/ppc[OK]
ac/sparc[OK]
ac/sparc64[OK]

Advanced Search
main()
Powered by PLD Linux
(c) 2002-2020 PLD Team
$Revision: 1.37 $
Powered by Unix conspiracy.
Your IP: 3.237.66.86

lttng-modules 93750560-3234-46f0-9f04-22ebe389a8e9

Status:Failed
Source URL:https://buildlogs.pld-linux.org/pld/th/x86_64/FAIL/lttng-modules,93750560-3234-46f0-9f04-22ebe389a8e9.bz2
text/plain URL:View!
rpm -qa of builder:View!
Date:2020/11/17 20:46:28
Runtime:0:01:25.301607

Toc:

  • prep
  • Executing(%prep): /bin/sh -e /tmp/B.IHIodt/BUILD/tmp/rpm-tmp.94806
  • build
  • Executing(%build): /bin/sh -e /tmp/B.IHIodt/BUILD/tmp/rpm-tmp.94806
  • error 1
  • /tmp/B.IHIodt/BUILD/lttng-modules-2.12.2/lttng-modules-2.12.2/probes/../probes/lttng-tracepoint-event-impl.h:131:6: error: conflicting types for 'trace_find_free_extent'
  • error 2
  • make[3]: *** [scripts/Makefile.build:283: /tmp/B.IHIodt/BUILD/lttng-modules-2.12.2/lttng-modules-2.12.2/probes/lttng-probe-btrfs.o] Error 1
  • error 3
  • make[2]: *** [scripts/Makefile.build:500: /tmp/B.IHIodt/BUILD/lttng-modules-2.12.2/lttng-modules-2.12.2/probes] Error 2
  • error 4
  • make[1]: *** [Makefile:1784: /tmp/B.IHIodt/BUILD/lttng-modules-2.12.2/lttng-modules-2.12.2] Error 2
  • error 5
  • error: Bad exit status from /tmp/B.IHIodt/BUILD/tmp/rpm-tmp.94806 (%build)
  • error 6
  • RPM build errors:
  • error 7
  • error: No files produced.

Content:

request from: baggins
checking if we should skip the build
started at: Tue Nov 17 20:44:56 2020
killing old processes on a builder
sending signal 9 to pid -1
Killed
cleaning up /tmp
fetching https://srcbuilder.pld-linux.org/th//srpms/93750560-3234-46f0-9f04-22ebe389a8e9/lttng-modules-2.12.2-2%405.9.8_1.src.rpm
fetched 345089 bytes, 671.2 K/s
installing srpm: lttng-modules-2.12.2-2@5.9.8_1.src.rpm
+ install -d /tmp/B.IHIodt/BUILD /tmp/B.IHIodt/RPMS
+ LC_ALL=en_US.UTF-8
+ rpm -qp --changelog lttng-modules-2.12.2-2@5.9.8_1.src.rpm
* Tue Nov 17 2020 PLD Linux Team <feedback@pld-linux.org>
- For complete changelog see: http://git.pld-linux.org/?p=packages/lttng-modules.git;a=log;h=auto/th/lttng-modules-2.12.2-2
* Sat Sep 26 2020 Jan Rękorajski <baggins@pld-linux.org> f9dfa75
- add fixes from upstream git with fixes to build modules on recent kernels - rel 2 * Sun Aug 16 2020 Jan Rękorajski <baggins@pld-linux.org> aa9cd3d
- up to 2.12.2 * Fri Jun 05 2020 Jan Rękorajski <baggins@pld-linux.org> 10babb8
- up to 2.12.1 * Tue Apr 14 2020 Jakub Bogusz <qboosh@pld-linux.org> 9a3ded0
- updated to 2.12.0 (for Linux 3.0+; ftrace integration dropped) - removed obsolete kernel-5.5.3 patch * Sat Apr 04 2020 Jan Rękorajski <baggins@pld-linux.org> 3efbae2
- up to 2.11.2 * Sun Feb 23 2020 Jan Rękorajski <baggins@pld-linux.org> 87b6b5d
- fix version macro * Sun Feb 23 2020 Jan Rękorajski <baggins@pld-linux.org> e66d568
- 4.14 doesn't need this * Sun Feb 23 2020 Jan Rękorajski <baggins@pld-linux.org> 50a7834
- enable fix on all kernels * Sun Feb 23 2020 Jan Rękorajski <baggins@pld-linux.org> 0c8875f
- 5.4 also needs this * Sun Feb 23 2020 Jan Rękorajski <baggins@pld-linux.org> bbbacb5
- fix paths in patch * Sun Feb 23 2020 Jan Rękorajski <baggins@pld-linux.org> d4618bf
- fix building with kernel 5.5.3+ - rel 2 * Wed Jan 29 2020 Jan Rękorajski <baggins@pld-linux.org> 4144a1b
- up to 2.11.1 * Sun Dec 01 2019 Jan Rękorajski <baggins@pld-linux.org> b91196d
- rework build dirs to make sure we clean them between building for different kernels - rel 2 * Sat Nov 30 2019 Jan Rękorajski <baggins@pld-linux.org> 04f5de0
- up to 2.11.0 + rpm -Uhv --nodeps --define '_topdir /tmp/B.IHIodt' --define '_specdir %{_topdir}' --define '_sourcedir %{_specdir}' --define '_rpmdir %{_topdir}/RPMS' --define '_builddir %{_topdir}/BUILD' --without userspace --define 'build_kernels head,5.4,4.19,4.14,4.9' lttng-modules-2.12.2-2@5.9.8_1.src.rpm Preparing... ################################################## lttng-modules ################################################## + rm -f lttng-modules-2.12.2-2@5.9.8_1.src.rpm + install -m 700 -d /tmp/B.IHIodt/BUILD/tmp + TMPDIR=/tmp/B.IHIodt/BUILD/tmp + exec nice -n 0 rpmbuild -bp --short-circuit --nodeps --define '_topdir /tmp/B.IHIodt' --define '_specdir %{_topdir}' --define '_sourcedir %{_specdir}' --define '_rpmdir %{_topdir}/RPMS' --define '_builddir %{_topdir}/BUILD' --without userspace --target x86_64-pld-linux --define 'build_kernels head,5.4,4.19,4.14,4.9' --define 'prep exit 0' /tmp/B.IHIodt/lttng-modules.spec Building target platforms: x86_64-pld-linux checking BuildConflict-ing packages no BuildConflicts found checking BR rpm: Building target platforms: x86_64-pld-linux no BR needed building RPM using: set -ex; : build-id: 93750560-3234-46f0-9f04-22ebe389a8e9; TMPDIR=/tmp/B.IHIodt/BUILD/tmp exec nice -n 0 rpmbuild -bb --define '_smp_mflags -j9' --define '_make_opts -Otarget' --define '_pld_builder 1' --define '_topdir /tmp/B.IHIodt' --define '_specdir %{_topdir}' --define '_sourcedir %{_specdir}' --define '_rpmdir %{_topdir}/RPMS' --define '_builddir %{_topdir}/BUILD' --without userspace --target x86_64-pld-linux --define 'build_kernels head,5.4,4.19,4.14,4.9' /tmp/B.IHIodt/lttng-modules.spec + : build-id: 93750560-3234-46f0-9f04-22ebe389a8e9 + TMPDIR=/tmp/B.IHIodt/BUILD/tmp + exec nice -n 0 rpmbuild -bb --define '_smp_mflags -j9' --define '_make_opts -Otarget' --define '_pld_builder 1' --define '_topdir /tmp/B.IHIodt' --define '_specdir %{_topdir}' --define '_sourcedir %{_specdir}' --define '_rpmdir %{_topdir}/RPMS' --define '_builddir %{_topdir}/BUILD' --without userspace --target x86_64-pld-linux --define 'build_kernels head,5.4,4.19,4.14,4.9' /tmp/B.IHIodt/lttng-modules.spec Building target platforms: x86_64-pld-linux Executing(%prep): /bin/sh -e /tmp/B.IHIodt/BUILD/tmp/rpm-tmp.94806 + umask 022 + cd /tmp/B.IHIodt/BUILD + cd /tmp/B.IHIodt/BUILD + rm -rf lttng-modules-2.12.2 + /bin/mkdir -p lttng-modules-2.12.2 + cd lttng-modules-2.12.2 + /usr/bin/bzip2 -dc /tmp/B.IHIodt/lttng-modules-2.12.2.tar.bz2 + /bin/tar -xf - + STATUS=0 + '[' 0 -ne 0 ']' + /bin/id -u + '[' 1000 '=' 0 ']' + /bin/id -u + '[' 1000 '=' 0 ']' + /bin/chmod -Rf a+rX,u+w,g-w,o-w . + cd lttng-modules-2.12.2 + echo 'Patch #0 (build.patch):' Patch #0 (build.patch): + '[' -f /tmp/B.IHIodt/build.patch ']' + /bin/cat /tmp/B.IHIodt/build.patch + /usr/bin/patch -s -p1 + echo 'Patch #1 (git.patch):' Patch #1 (git.patch): + '[' -f /tmp/B.IHIodt/git.patch ']' + /bin/cat /tmp/B.IHIodt/git.patch + /usr/bin/patch -s -p1 + exit 0 Executing(%build): /bin/sh -e /tmp/B.IHIodt/BUILD/tmp/rpm-tmp.94806 TMP=/home/users/builder/tmp HOME=/home/users/builder PATH=/home/users/builder/GNUstep/Tools:/bin:/usr/bin:/usr/local/bin:/home/users/builder/bin TMPDIR=/tmp/B.IHIodt/BUILD/tmp + umask 022 + cd /tmp/B.IHIodt/BUILD + cd lttng-modules-2.12.2 + cd lttng-modules-2.12.2 + /usr/bin/make -Otarget -j9 clean 'KERNELDIR=/usr/src/linux' /usr/bin/make -C /usr/src/linux M=/tmp/B.IHIodt/BUILD/lttng-modules-2.12.2/lttng-modules-2.12.2 clean find: '/tmp/B.IHIodt/BUILD/lttng-modules-2.12.2/lttng-modules-2.12.2/extra_version/patches/': No such file or directory find: '/tmp/B.IHIodt/BUILD/lttng-modules-2.12.2/lttng-modules-2.12.2/tests/../extra_version/patches/': No such file or directory find: '/tmp/B.IHIodt/BUILD/lttng-modules-2.12.2/lttng-modules-2.12.2/lib/../extra_version/patches/': No such file or directory find: '/tmp/B.IHIodt/BUILD/lttng-modules-2.12.2/lttng-modules-2.12.2/probes/../extra_version/patches/': No such file or directory + /usr/bin/make -Otarget -j9 'KERNELDIR=/usr/src/linux' /usr/bin/make -C /usr/src/linux M=/tmp/B.IHIodt/BUILD/lttng-modules-2.12.2/lttng-modules-2.12.2 CONFIG_LTTNG=m CONFIG_LTTNG_CLOCK_PLUGIN_TEST=m modules find: '/tmp/B.IHIodt/BUILD/lttng-modules-2.12.2/lttng-modules-2.12.2/extra_version/patches/': No such file or directory find: '/tmp/B.IHIodt/BUILD/lttng-modules-2.12.2/lttng-modules-2.12.2/lib/../extra_version/patches/': No such file or directory find: '/tmp/B.IHIodt/BUILD/lttng-modules-2.12.2/lttng-modules-2.12.2/tests/../extra_version/patches/': No such file or directory find: '/tmp/B.IHIodt/BUILD/lttng-modules-2.12.2/lttng-modules-2.12.2/probes/../extra_version/patches/': No such file or directory CC [M] /tmp/B.IHIodt/BUILD/lttng-modules-2.12.2/lttng-modules-2.12.2/lttng-ring-buffer-metadata-client.o CC [M] /tmp/B.IHIodt/BUILD/lttng-modules-2.12.2/lttng-modules-2.12.2/lttng-ring-buffer-metadata-mmap-client.o CC [M] /tmp/B.IHIodt/BUILD/lttng-modules-2.12.2/lttng-modules-2.12.2/lttng-ring-buffer-client-discard.o CC [M] /tmp/B.IHIodt/BUILD/lttng-modules-2.12.2/lttng-modules-2.12.2/lttng-ring-buffer-client-mmap-discard.o CC [M] /tmp/B.IHIodt/BUILD/lttng-modules-2.12.2/lttng-modules-2.12.2/lttng-ring-buffer-client-mmap-overwrite.o CC [M] /tmp/B.IHIodt/BUILD/lttng-modules-2.12.2/lttng-modules-2.12.2/tests/probes/lttng-test.o CC [M] /tmp/B.IHIodt/BUILD/lttng-modules-2.12.2/lttng-modules-2.12.2/lttng-ring-buffer-client-overwrite.o CC [M] /tmp/B.IHIodt/BUILD/lttng-modules-2.12.2/lttng-modules-2.12.2/lttng-string-utils.o CC [M] /tmp/B.IHIodt/BUILD/lttng-modules-2.12.2/lttng-modules-2.12.2/lib/ringbuffer/ring_buffer_backend.o CC [M] /tmp/B.IHIodt/BUILD/lttng-modules-2.12.2/lttng-modules-2.12.2/lttng-clock.o CC [M] /tmp/B.IHIodt/BUILD/lttng-modules-2.12.2/lttng-modules-2.12.2/tests/clock-plugin/lttng-clock-plugin-test.o LD [M] /tmp/B.IHIodt/BUILD/lttng-modules-2.12.2/lttng-modules-2.12.2/tests/lttng-test.o LD [M] /tmp/B.IHIodt/BUILD/lttng-modules-2.12.2/lttng-modules-2.12.2/tests/lttng-clock-plugin-test.o CC [M] /tmp/B.IHIodt/BUILD/lttng-modules-2.12.2/lttng-modules-2.12.2/probes/lttng-probe-sched.o CC [M] /tmp/B.IHIodt/BUILD/lttng-modules-2.12.2/lttng-modules-2.12.2/probes/lttng-probe-irq.o CC [M] /tmp/B.IHIodt/BUILD/lttng-modules-2.12.2/lttng-modules-2.12.2/lttng-abi.o CC [M] /tmp/B.IHIodt/BUILD/lttng-modules-2.12.2/lttng-modules-2.12.2/lttng-probes.o CC [M] /tmp/B.IHIodt/BUILD/lttng-modules-2.12.2/lttng-modules-2.12.2/lttng-context.o CC [M] /tmp/B.IHIodt/BUILD/lttng-modules-2.12.2/lttng-modules-2.12.2/lttng-context-pid.o CC [M] /tmp/B.IHIodt/BUILD/lttng-modules-2.12.2/lttng-modules-2.12.2/lttng-events.o CC [M] /tmp/B.IHIodt/BUILD/lttng-modules-2.12.2/lttng-modules-2.12.2/lttng-context-procname.o CC [M] /tmp/B.IHIodt/BUILD/lttng-modules-2.12.2/lttng-modules-2.12.2/probes/lttng-probe-timer.o CC [M] /tmp/B.IHIodt/BUILD/lttng-modules-2.12.2/lttng-modules-2.12.2/lib/ringbuffer/ring_buffer_frontend.o CC [M] /tmp/B.IHIodt/BUILD/lttng-modules-2.12.2/lttng-modules-2.12.2/probes/lttng-probe-kmem.o CC [M] /tmp/B.IHIodt/BUILD/lttng-modules-2.12.2/lttng-modules-2.12.2/probes/lttng-probe-module.o CC [M] /tmp/B.IHIodt/BUILD/lttng-modules-2.12.2/lttng-modules-2.12.2/lttng-context-prio.o CC [M] /tmp/B.IHIodt/BUILD/lttng-modules-2.12.2/lttng-modules-2.12.2/lttng-context-nice.o CC [M] /tmp/B.IHIodt/BUILD/lttng-modules-2.12.2/lttng-modules-2.12.2/lttng-context-vpid.o CC [M] /tmp/B.IHIodt/BUILD/lttng-modules-2.12.2/lttng-modules-2.12.2/lttng-context-vtid.o CC [M] /tmp/B.IHIodt/BUILD/lttng-modules-2.12.2/lttng-modules-2.12.2/lttng-context-tid.o CC [M] /tmp/B.IHIodt/BUILD/lttng-modules-2.12.2/lttng-modules-2.12.2/lib/ringbuffer/ring_buffer_vfs.o CC [M] /tmp/B.IHIodt/BUILD/lttng-modules-2.12.2/lttng-modules-2.12.2/lib/ringbuffer/ring_buffer_iterator.o CC [M] /tmp/B.IHIodt/BUILD/lttng-modules-2.12.2/lttng-modules-2.12.2/probes/lttng-probe-9p.o CC [M] /tmp/B.IHIodt/BUILD/lttng-modules-2.12.2/lttng-modules-2.12.2/probes/lttng-probe-power.o CC [M] /tmp/B.IHIodt/BUILD/lttng-modules-2.12.2/lttng-modules-2.12.2/lttng-context-ppid.o CC [M] /tmp/B.IHIodt/BUILD/lttng-modules-2.12.2/lttng-modules-2.12.2/lib/ringbuffer/ring_buffer_splice.o CC [M] /tmp/B.IHIodt/BUILD/lttng-modules-2.12.2/lttng-modules-2.12.2/lib/../wrapper/splice.o CC [M] /tmp/B.IHIodt/BUILD/lttng-modules-2.12.2/lttng-modules-2.12.2/lib/prio_heap/lttng_prio_heap.o CC [M] /tmp/B.IHIodt/BUILD/lttng-modules-2.12.2/lttng-modules-2.12.2/probes/lttng-probe-i2c.o CC [M] /tmp/B.IHIodt/BUILD/lttng-modules-2.12.2/lttng-modules-2.12.2/lib/ringbuffer/ring_buffer_mmap.o LD [M] /tmp/B.IHIodt/BUILD/lttng-modules-2.12.2/lttng-modules-2.12.2/lib/lttng-lib-ring-buffer.o CC [M] /tmp/B.IHIodt/BUILD/lttng-modules-2.12.2/lttng-modules-2.12.2/lttng-context-vppid.o CC [M] /tmp/B.IHIodt/BUILD/lttng-modules-2.12.2/lttng-modules-2.12.2/probes/lttng-probe-statedump.o CC [M] /tmp/B.IHIodt/BUILD/lttng-modules-2.12.2/lttng-modules-2.12.2/probes/lttng-probe-kvm.o CC [M] /tmp/B.IHIodt/BUILD/lttng-modules-2.12.2/lttng-modules-2.12.2/lttng-context-cpu-id.o CC [M] /tmp/B.IHIodt/BUILD/lttng-modules-2.12.2/lttng-modules-2.12.2/probes/lttng-probe-x86-irq-vectors.o CC [M] /tmp/B.IHIodt/BUILD/lttng-modules-2.12.2/lttng-modules-2.12.2/lttng-context-uid.o CC [M] /tmp/B.IHIodt/BUILD/lttng-modules-2.12.2/lttng-modules-2.12.2/lttng-context-euid.o CC [M] /tmp/B.IHIodt/BUILD/lttng-modules-2.12.2/lttng-modules-2.12.2/probes/lttng-probe-x86-exceptions.o CC [M] /tmp/B.IHIodt/BUILD/lttng-modules-2.12.2/lttng-modules-2.12.2/probes/lttng-probe-kvm-x86-mmu.o CC [M] /tmp/B.IHIodt/BUILD/lttng-modules-2.12.2/lttng-modules-2.12.2/probes/lttng-probe-signal.o CC [M] /tmp/B.IHIodt/BUILD/lttng-modules-2.12.2/lttng-modules-2.12.2/probes/lttng-probe-napi.o CC [M] /tmp/B.IHIodt/BUILD/lttng-modules-2.12.2/lttng-modules-2.12.2/lttng-context-suid.o CC [M] /tmp/B.IHIodt/BUILD/lttng-modules-2.12.2/lttng-modules-2.12.2/probes/lttng-probe-skb.o CC [M] /tmp/B.IHIodt/BUILD/lttng-modules-2.12.2/lttng-modules-2.12.2/lttng-context-gid.o CC [M] /tmp/B.IHIodt/BUILD/lttng-modules-2.12.2/lttng-modules-2.12.2/probes/lttng-probe-kvm-x86.o CC [M] /tmp/B.IHIodt/BUILD/lttng-modules-2.12.2/lttng-modules-2.12.2/probes/lttng-probe-gpio.o CC [M] /tmp/B.IHIodt/BUILD/lttng-modules-2.12.2/lttng-modules-2.12.2/probes/lttng-probe-udp.o CC [M] /tmp/B.IHIodt/BUILD/lttng-modules-2.12.2/lttng-modules-2.12.2/probes/lttng-probe-net.o CC [M] /tmp/B.IHIodt/BUILD/lttng-modules-2.12.2/lttng-modules-2.12.2/probes/lttng-probe-block.o CC [M] /tmp/B.IHIodt/BUILD/lttng-modules-2.12.2/lttng-modules-2.12.2/probes/lttng-probe-sock.o CC [M] /tmp/B.IHIodt/BUILD/lttng-modules-2.12.2/lttng-modules-2.12.2/lttng-context-egid.o CC [M] /tmp/B.IHIodt/BUILD/lttng-modules-2.12.2/lttng-modules-2.12.2/probes/lttng-probe-asoc.o CC [M] /tmp/B.IHIodt/BUILD/lttng-modules-2.12.2/lttng-modules-2.12.2/lttng-context-sgid.o CC [M] /tmp/B.IHIodt/BUILD/lttng-modules-2.12.2/lttng-modules-2.12.2/lttng-context-vuid.o CC [M] /tmp/B.IHIodt/BUILD/lttng-modules-2.12.2/lttng-modules-2.12.2/lttng-context-vsuid.o CC [M] /tmp/B.IHIodt/BUILD/lttng-modules-2.12.2/lttng-modules-2.12.2/probes/lttng-probe-regulator.o CC [M] /tmp/B.IHIodt/BUILD/lttng-modules-2.12.2/lttng-modules-2.12.2/lttng-context-veuid.o CC [M] /tmp/B.IHIodt/BUILD/lttng-modules-2.12.2/lttng-modules-2.12.2/probes/lttng-probe-scsi.o CC [M] /tmp/B.IHIodt/BUILD/lttng-modules-2.12.2/lttng-modules-2.12.2/probes/lttng-probe-jbd2.o CC [M] /tmp/B.IHIodt/BUILD/lttng-modules-2.12.2/lttng-modules-2.12.2/lttng-context-vegid.o CC [M] /tmp/B.IHIodt/BUILD/lttng-modules-2.12.2/lttng-modules-2.12.2/lttng-context-vgid.o CC [M] /tmp/B.IHIodt/BUILD/lttng-modules-2.12.2/lttng-modules-2.12.2/lttng-context-vsgid.o CC [M] /tmp/B.IHIodt/BUILD/lttng-modules-2.12.2/lttng-modules-2.12.2/lttng-context-need-reschedule.o CC [M] /tmp/B.IHIodt/BUILD/lttng-modules-2.12.2/lttng-modules-2.12.2/lttng-context-interruptible.o CC [M] /tmp/B.IHIodt/BUILD/lttng-modules-2.12.2/lttng-modules-2.12.2/probes/lttng-probe-compaction.o CC [M] /tmp/B.IHIodt/BUILD/lttng-modules-2.12.2/lttng-modules-2.12.2/probes/lttng-probe-printk.o CC [M] /tmp/B.IHIodt/BUILD/lttng-modules-2.12.2/lttng-modules-2.12.2/probes/lttng-probe-vmscan.o CC [M] /tmp/B.IHIodt/BUILD/lttng-modules-2.12.2/lttng-modules-2.12.2/probes/lttng-probe-btrfs.o In file included from /tmp/B.IHIodt/BUILD/lttng-modules-2.12.2/lttng-modules-2.12.2/probes/../probes/define_trace.h:87, from /tmp/B.IHIodt/BUILD/lttng-modules-2.12.2/lttng-modules-2.12.2/probes/../instrumentation/events/lttng-module/btrfs.h:2385, from /tmp/B.IHIodt/BUILD/lttng-modules-2.12.2/lttng-modules-2.12.2/probes/lttng-probe-btrfs.c:36: /tmp/B.IHIodt/BUILD/lttng-modules-2.12.2/lttng-modules-2.12.2/probes/../probes/lttng-tracepoint-event-impl.h:131:6: error: conflicting types for 'trace_find_free_extent' 131 | void trace_##_name(_proto); | ^~~~~~ /tmp/B.IHIodt/BUILD/lttng-modules-2.12.2/lttng-modules-2.12.2/probes/../probes/lttng-tracepoint-event-impl.h:43:2: note: in expansion of macro 'LTTNG_TRACEPOINT_EVENT_INSTANCE_MAP' 43 | LTTNG_TRACEPOINT_EVENT_INSTANCE_MAP(map, name, map, PARAMS(proto), PARAMS(args)) | ^~~~~~~~~~~~~~~~~~~~~~~~~~~~~~~~~~~ /tmp/B.IHIodt/BUILD/lttng-modules-2.12.2/lttng-modules-2.12.2/probes/../instrumentation/events/lttng-module/btrfs.h:1860:1: note: in expansion of macro 'LTTNG_TRACEPOINT_EVENT_MAP' 1860 | LTTNG_TRACEPOINT_EVENT_MAP(find_free_extent, | ^~~~~~~~~~~~~~~~~~~~~~~~~~ In file included from ./include/trace/events/btrfs.h:9, from ./include/../fs/btrfs/ctree.h:19, from /tmp/B.IHIodt/BUILD/lttng-modules-2.12.2/lttng-modules-2.12.2/probes/lttng-probe-btrfs.c:14: ./include/linux/tracepoint.h:231:21: note: previous definition of 'trace_find_free_extent' was here 231 | static inline void trace_##name(proto) \ | ^~~~~~ ./include/linux/tracepoint.h:375:2: note: in expansion of macro '__DECLARE_TRACE' 375 | __DECLARE_TRACE(name, PARAMS(proto), PARAMS(args), \ | ^~~~~~~~~~~~~~~ ./include/linux/tracepoint.h:511:2: note: in expansion of macro 'DECLARE_TRACE' 511 | DECLARE_TRACE(name, PARAMS(proto), PARAMS(args)) | ^~~~~~~~~~~~~ ./include/trace/events/btrfs.h:1177:1: note: in expansion of macro 'TRACE_EVENT' 1177 | TRACE_EVENT(find_free_extent, | ^~~~~~~~~~~ make[3]: *** [scripts/Makefile.build:283: /tmp/B.IHIodt/BUILD/lttng-modules-2.12.2/lttng-modules-2.12.2/probes/lttng-probe-btrfs.o] Error 1 make[3]: *** Waiting for unfinished jobs.... CC [M] /tmp/B.IHIodt/BUILD/lttng-modules-2.12.2/lttng-modules-2.12.2/lttng-context-callstack.o CC [M] /tmp/B.IHIodt/BUILD/lttng-modules-2.12.2/lttng-modules-2.12.2/lttng-calibrate.o CC [M] /tmp/B.IHIodt/BUILD/lttng-modules-2.12.2/lttng-modules-2.12.2/probes/lttng-probe-rcu.o CC [M] /tmp/B.IHIodt/BUILD/lttng-modules-2.12.2/lttng-modules-2.12.2/lttng-context-hostname.o CC [M] /tmp/B.IHIodt/BUILD/lttng-modules-2.12.2/lttng-modules-2.12.2/probes/lttng.o CC [M] /tmp/B.IHIodt/BUILD/lttng-modules-2.12.2/lttng-modules-2.12.2/probes/lttng-probe-random.o CC [M] /tmp/B.IHIodt/BUILD/lttng-modules-2.12.2/lttng-modules-2.12.2/lttng-filter.o CC [M] /tmp/B.IHIodt/BUILD/lttng-modules-2.12.2/lttng-modules-2.12.2/probes/lttng-probe-regmap.o CC [M] /tmp/B.IHIodt/BUILD/lttng-modules-2.12.2/lttng-modules-2.12.2/lttng-tp-mempool.o CC [M] /tmp/B.IHIodt/BUILD/lttng-modules-2.12.2/lttng-modules-2.12.2/lttng-tracker-id.o CC [M] /tmp/B.IHIodt/BUILD/lttng-modules-2.12.2/lttng-modules-2.12.2/probes/lttng-probe-user.o CC [M] /tmp/B.IHIodt/BUILD/lttng-modules-2.12.2/lttng-modules-2.12.2/lttng-filter-interpreter.o CC [M] /tmp/B.IHIodt/BUILD/lttng-modules-2.12.2/lttng-modules-2.12.2/lttng-filter-specialize.o CC [M] /tmp/B.IHIodt/BUILD/lttng-modules-2.12.2/lttng-modules-2.12.2/lttng-filter-validator.o CC [M] /tmp/B.IHIodt/BUILD/lttng-modules-2.12.2/lttng-modules-2.12.2/lttng-context-perf-counters.o CC [M] /tmp/B.IHIodt/BUILD/lttng-modules-2.12.2/lttng-modules-2.12.2/lttng-tracepoint.o CC [M] /tmp/B.IHIodt/BUILD/lttng-modules-2.12.2/lttng-modules-2.12.2/lttng-context-cgroup-ns.o CC [M] /tmp/B.IHIodt/BUILD/lttng-modules-2.12.2/lttng-modules-2.12.2/lttng-context-mnt-ns.o CC [M] /tmp/B.IHIodt/BUILD/lttng-modules-2.12.2/lttng-modules-2.12.2/lttng-context-ipc-ns.o CC [M] /tmp/B.IHIodt/BUILD/lttng-modules-2.12.2/lttng-modules-2.12.2/lttng-context-pid-ns.o CC [M] /tmp/B.IHIodt/BUILD/lttng-modules-2.12.2/lttng-modules-2.12.2/lttng-context-net-ns.o CC [M] /tmp/B.IHIodt/BUILD/lttng-modules-2.12.2/lttng-modules-2.12.2/lttng-context-uts-ns.o CC [M] /tmp/B.IHIodt/BUILD/lttng-modules-2.12.2/lttng-modules-2.12.2/lttng-context-user-ns.o CC [M] /tmp/B.IHIodt/BUILD/lttng-modules-2.12.2/lttng-modules-2.12.2/wrapper/trace-clock.o CC [M] /tmp/B.IHIodt/BUILD/lttng-modules-2.12.2/lttng-modules-2.12.2/wrapper/page_alloc.o CC [M] /tmp/B.IHIodt/BUILD/lttng-modules-2.12.2/lttng-modules-2.12.2/wrapper/fdtable.o CC [M] /tmp/B.IHIodt/BUILD/lttng-modules-2.12.2/lttng-modules-2.12.2/wrapper/random.o CC [M] /tmp/B.IHIodt/BUILD/lttng-modules-2.12.2/lttng-modules-2.12.2/wrapper/irqdesc.o CC [M] /tmp/B.IHIodt/BUILD/lttng-modules-2.12.2/lttng-modules-2.12.2/lttng-wrapper-impl.o CC [M] /tmp/B.IHIodt/BUILD/lttng-modules-2.12.2/lttng-modules-2.12.2/wrapper/kallsyms.o LD [M] /tmp/B.IHIodt/BUILD/lttng-modules-2.12.2/lttng-modules-2.12.2/lttng-wrapper.o CC [M] /tmp/B.IHIodt/BUILD/lttng-modules-2.12.2/lttng-modules-2.12.2/lttng-statedump-impl.o LD [M] /tmp/B.IHIodt/BUILD/lttng-modules-2.12.2/lttng-modules-2.12.2/lttng-statedump.o CC [M] /tmp/B.IHIodt/BUILD/lttng-modules-2.12.2/lttng-modules-2.12.2/probes/lttng-probe-ext4.o make[2]: *** [scripts/Makefile.build:500: /tmp/B.IHIodt/BUILD/lttng-modules-2.12.2/lttng-modules-2.12.2/probes] Error 2 make[2]: *** Waiting for unfinished jobs.... CC [M] /tmp/B.IHIodt/BUILD/lttng-modules-2.12.2/lttng-modules-2.12.2/lttng-syscalls.o make[1]: *** [Makefile:1784: /tmp/B.IHIodt/BUILD/lttng-modules-2.12.2/lttng-modules-2.12.2] Error 2 make: *** [Makefile:153: modules] Error 2 error: Bad exit status from /tmp/B.IHIodt/BUILD/tmp/rpm-tmp.94806 (%build) RPM build errors: Bad exit status from /tmp/B.IHIodt/BUILD/tmp/rpm-tmp.94806 (%build) ended at: Tue Nov 17 20:46:27 2020, done in 0:01:25.301607 error: No files produced. + chmod -R u+rwX /tmp/B.IHIodt/BUILD + rm -rf /tmp/B.IHIodt/tmp /tmp/B.IHIodt/BUILD + rm -rf /tmp/B.IHIodt Begin-PLD-Builder-Info Build-Time: user:173.28s sys:18.23s real:91.71s (faults io:5 non-io:4114737) End-PLD-Builder-Info
[Back to list of logs] [View rpm -qa of builder]