FailedOk

th/SRPMS[OK]
th/x32[OK]
th/i686[OK]
th/x86_64[OK]

ac/SRPMS[OK]
ac/i386[OK]
ac/i586[OK]
ac/i686[OK]
ac/alpha[OK]
ac/amd64[OK]
ac/athlon[OK]
ac/ppc[OK]
ac/sparc[OK]
ac/sparc64[OK]

Advanced Search
main()
Powered by PLD Linux
(c) 2002-2018 PLD Team
$Revision: 1.37 $
Powered by Multics.
Your IP: 54.221.75.68

lttng-modules bf8107cd-e409-42d7-86d1-c979dda614cd

Status:Failed
Source URL:ftp://buildlogs.pld-linux.org/th/x86_64/FAIL/lttng-modules,bf8107cd-e409-42d7-86d1-c979dda614cd.bz2
text/plain URL:View!
full text:View!
rpm -qa of builder:View!
Date:2018/10/26 00:41:23
Runtime:0:00:54.691857

Toc:

  • error 1
  • /tmp/B.mANm8D/BUILD/lttng-modules-2.10.7/probes/../probes/lttng-tracepoint-event-impl.h:143:6: error: conflicting types for 'trace_sock_exceed_buf_limit'
  • error 2
  • make[3]: *** [scripts/Makefile.build:313: /tmp/B.mANm8D/BUILD/lttng-modules-2.10.7/probes/lttng-probe-sock.o] Error 1
  • error 3
  • make[2]: *** [scripts/Makefile.build:546: /tmp/B.mANm8D/BUILD/lttng-modules-2.10.7/probes] Error 2
  • error 4
  • make[1]: *** [Makefile:1517: _module_/tmp/B.mANm8D/BUILD/lttng-modules-2.10.7] Error 2
  • error 5
  • error: Bad exit status from /tmp/B.mANm8D/BUILD/tmp/rpm-tmp.54956 (%build)
  • error 6
  • RPM build errors:
  • error 7
  • error: No files produced.

Content:

+ rm -rf lttng-modules-2.10.7
+ /usr/bin/bzip2 -dc /tmp/B.mANm8D/lttng-modules-2.10.7.tar.bz2
+ /bin/tar -xf -
+ STATUS=0 
+ '[' 0 -ne 0 ']'
+ cd lttng-modules-2.10.7
+ /bin/id -u
+ '[' 1000 '=' 0 ']'
+ /bin/id -u
+ '[' 1000 '=' 0 ']'
+ /bin/chmod -Rf a+rX,u+w,g-w,o-w .
+ echo 'Patch #0 (build.patch):'
Patch #0 (build.patch):
+ '[' -f /tmp/B.mANm8D/build.patch ']'
+ /bin/cat /tmp/B.mANm8D/build.patch
+ /usr/bin/patch -s -p1
+ exit 0
Executing(%build): /bin/sh -e /tmp/B.mANm8D/BUILD/tmp/rpm-tmp.54956
TMP=/home/users/builder/tmp
HOME=/home/users/builder
PATH=/home/users/builder/GNUstep/Tools:/usr/local/bin:/usr/bin:/bin:/home/users/builder/bin
TMPDIR=/tmp/B.mANm8D/BUILD/tmp
+ umask 022
+ cd /tmp/B.mANm8D/BUILD
+ cd lttng-modules-2.10.7
+ /usr/bin/make -Otarget -j9 'KERNELDIR=/usr/src/linux'
/usr/bin/make -C /usr/src/linux M=/tmp/B.mANm8D/BUILD/lttng-modules-2.10.7 CONFIG_LTTNG=m CONFIG_LTTNG_CLOCK_PLUGIN_TEST=m modules
find: '/tmp/B.mANm8D/BUILD/lttng-modules-2.10.7/extra_version/patches/': No such file or directory
find: '/tmp/B.mANm8D/BUILD/lttng-modules-2.10.7/lib/../extra_version/patches/': No such file or directory
find: '/tmp/B.mANm8D/BUILD/lttng-modules-2.10.7/tests/../extra_version/patches/': No such file or directory
find: '/tmp/B.mANm8D/BUILD/lttng-modules-2.10.7/probes/../extra_version/patches/': No such file or directory
  CC [M]  /tmp/B.mANm8D/BUILD/lttng-modules-2.10.7/tests/probes/lttng-test.o
  CC [M]  /tmp/B.mANm8D/BUILD/lttng-modules-2.10.7/lttng-ring-buffer-metadata-mmap-client.o
  CC [M]  /tmp/B.mANm8D/BUILD/lttng-modules-2.10.7/lttng-ring-buffer-metadata-client.o
  CC [M]  /tmp/B.mANm8D/BUILD/lttng-modules-2.10.7/lttng-ring-buffer-client-discard.o
  CC [M]  /tmp/B.mANm8D/BUILD/lttng-modules-2.10.7/lttng-ring-buffer-client-mmap-overwrite.o
  CC [M]  /tmp/B.mANm8D/BUILD/lttng-modules-2.10.7/lttng-ring-buffer-client-overwrite.o
  CC [M]  /tmp/B.mANm8D/BUILD/lttng-modules-2.10.7/lttng-ring-buffer-client-mmap-discard.o
  CC [M]  /tmp/B.mANm8D/BUILD/lttng-modules-2.10.7/lttng-string-utils.o
  CC [M]  /tmp/B.mANm8D/BUILD/lttng-modules-2.10.7/tests/clock-plugin/lttng-clock-plugin-test.o
  LD [M]  /tmp/B.mANm8D/BUILD/lttng-modules-2.10.7/tests/lttng-test.o
  LD [M]  /tmp/B.mANm8D/BUILD/lttng-modules-2.10.7/tests/lttng-clock-plugin-test.o
  CC [M]  /tmp/B.mANm8D/BUILD/lttng-modules-2.10.7/lib/ringbuffer/ring_buffer_backend.o
  CC [M]  /tmp/B.mANm8D/BUILD/lttng-modules-2.10.7/probes/lttng-probe-sched.o
  CC [M]  /tmp/B.mANm8D/BUILD/lttng-modules-2.10.7/probes/lttng-probe-irq.o
  CC [M]  /tmp/B.mANm8D/BUILD/lttng-modules-2.10.7/lttng-clock.o
  CC [M]  /tmp/B.mANm8D/BUILD/lttng-modules-2.10.7/lttng-context.o
  CC [M]  /tmp/B.mANm8D/BUILD/lttng-modules-2.10.7/lttng-abi.o
  CC [M]  /tmp/B.mANm8D/BUILD/lttng-modules-2.10.7/lttng-probes.o
  CC [M]  /tmp/B.mANm8D/BUILD/lttng-modules-2.10.7/lttng-context-pid.o
  CC [M]  /tmp/B.mANm8D/BUILD/lttng-modules-2.10.7/lttng-events.o
  CC [M]  /tmp/B.mANm8D/BUILD/lttng-modules-2.10.7/lttng-context-procname.o
  CC [M]  /tmp/B.mANm8D/BUILD/lttng-modules-2.10.7/lttng-context-prio.o
  CC [M]  /tmp/B.mANm8D/BUILD/lttng-modules-2.10.7/lib/ringbuffer/ring_buffer_frontend.o
  CC [M]  /tmp/B.mANm8D/BUILD/lttng-modules-2.10.7/lib/ringbuffer/ring_buffer_vfs.o
  CC [M]  /tmp/B.mANm8D/BUILD/lttng-modules-2.10.7/lttng-context-nice.o
  CC [M]  /tmp/B.mANm8D/BUILD/lttng-modules-2.10.7/probes/lttng-probe-timer.o
  CC [M]  /tmp/B.mANm8D/BUILD/lttng-modules-2.10.7/probes/lttng-probe-kmem.o
  CC [M]  /tmp/B.mANm8D/BUILD/lttng-modules-2.10.7/probes/lttng-probe-module.o
  CC [M]  /tmp/B.mANm8D/BUILD/lttng-modules-2.10.7/probes/lttng-probe-power.o
  CC [M]  /tmp/B.mANm8D/BUILD/lttng-modules-2.10.7/probes/lttng-probe-statedump.o
  CC [M]  /tmp/B.mANm8D/BUILD/lttng-modules-2.10.7/probes/lttng-probe-i2c.o
  CC [M]  /tmp/B.mANm8D/BUILD/lttng-modules-2.10.7/lib/ringbuffer/ring_buffer_iterator.o
  CC [M]  /tmp/B.mANm8D/BUILD/lttng-modules-2.10.7/probes/lttng-probe-x86-irq-vectors.o
  CC [M]  /tmp/B.mANm8D/BUILD/lttng-modules-2.10.7/lib/prio_heap/lttng_prio_heap.o
  CC [M]  /tmp/B.mANm8D/BUILD/lttng-modules-2.10.7/lttng-context-tid.o
  CC [M]  /tmp/B.mANm8D/BUILD/lttng-modules-2.10.7/lib/ringbuffer/ring_buffer_mmap.o
  CC [M]  /tmp/B.mANm8D/BUILD/lttng-modules-2.10.7/lttng-context-vpid.o
  CC [M]  /tmp/B.mANm8D/BUILD/lttng-modules-2.10.7/lib/ringbuffer/ring_buffer_splice.o
  CC [M]  /tmp/B.mANm8D/BUILD/lttng-modules-2.10.7/lib/../wrapper/splice.o
  LD [M]  /tmp/B.mANm8D/BUILD/lttng-modules-2.10.7/lib/lttng-lib-ring-buffer.o
  CC [M]  /tmp/B.mANm8D/BUILD/lttng-modules-2.10.7/lttng-context-vtid.o
  CC [M]  /tmp/B.mANm8D/BUILD/lttng-modules-2.10.7/lttng-context-cpu-id.o
  CC [M]  /tmp/B.mANm8D/BUILD/lttng-modules-2.10.7/lttng-context-vppid.o
  CC [M]  /tmp/B.mANm8D/BUILD/lttng-modules-2.10.7/probes/lttng-probe-kvm.o
  CC [M]  /tmp/B.mANm8D/BUILD/lttng-modules-2.10.7/probes/lttng-probe-kvm-x86-mmu.o
  CC [M]  /tmp/B.mANm8D/BUILD/lttng-modules-2.10.7/lttng-context-interruptible.o
  CC [M]  /tmp/B.mANm8D/BUILD/lttng-modules-2.10.7/lttng-context-ppid.o
  CC [M]  /tmp/B.mANm8D/BUILD/lttng-modules-2.10.7/lttng-context-need-reschedule.o
  CC [M]  /tmp/B.mANm8D/BUILD/lttng-modules-2.10.7/probes/lttng-probe-kvm-x86.o
  CC [M]  /tmp/B.mANm8D/BUILD/lttng-modules-2.10.7/lttng-calibrate.o
  CC [M]  /tmp/B.mANm8D/BUILD/lttng-modules-2.10.7/wrapper/random.o
  CC [M]  /tmp/B.mANm8D/BUILD/lttng-modules-2.10.7/probes/lttng-probe-x86-exceptions.o
  CC [M]  /tmp/B.mANm8D/BUILD/lttng-modules-2.10.7/probes/lttng-probe-signal.o
  CC [M]  /tmp/B.mANm8D/BUILD/lttng-modules-2.10.7/probes/lttng-probe-napi.o
  CC [M]  /tmp/B.mANm8D/BUILD/lttng-modules-2.10.7/lttng-context-hostname.o
  CC [M]  /tmp/B.mANm8D/BUILD/lttng-modules-2.10.7/probes/lttng.o
  CC [M]  /tmp/B.mANm8D/BUILD/lttng-modules-2.10.7/wrapper/trace-clock.o
  CC [M]  /tmp/B.mANm8D/BUILD/lttng-modules-2.10.7/wrapper/page_alloc.o
  CC [M]  /tmp/B.mANm8D/BUILD/lttng-modules-2.10.7/lttng-tracker-pid.o
  CC [M]  /tmp/B.mANm8D/BUILD/lttng-modules-2.10.7/probes/lttng-probe-skb.o
  CC [M]  /tmp/B.mANm8D/BUILD/lttng-modules-2.10.7/lttng-filter.o
  CC [M]  /tmp/B.mANm8D/BUILD/lttng-modules-2.10.7/lttng-filter-specialize.o
  CC [M]  /tmp/B.mANm8D/BUILD/lttng-modules-2.10.7/lttng-filter-interpreter.o
  CC [M]  /tmp/B.mANm8D/BUILD/lttng-modules-2.10.7/probes/lttng-probe-net.o
  CC [M]  /tmp/B.mANm8D/BUILD/lttng-modules-2.10.7/probes/lttng-probe-sock.o
In file included from /tmp/B.mANm8D/BUILD/lttng-modules-2.10.7/probes/../probes/define_trace.h:100,
                 from /tmp/B.mANm8D/BUILD/lttng-modules-2.10.7/probes/../instrumentation/events/lttng-module/sock.h:63,
                 from /tmp/B.mANm8D/BUILD/lttng-modules-2.10.7/probes/lttng-probe-sock.c:40:
/tmp/B.mANm8D/BUILD/lttng-modules-2.10.7/probes/../probes/lttng-tracepoint-event-impl.h:143:6: error: conflicting types for 'trace_sock_exceed_buf_limit'
 void trace_##_name(_proto);
      ^~~~~~
/tmp/B.mANm8D/BUILD/lttng-modules-2.10.7/probes/../probes/lttng-tracepoint-event-impl.h:55:2: note: in expansion of macro 'LTTNG_TRACEPOINT_EVENT_INSTANCE_MAP'
  LTTNG_TRACEPOINT_EVENT_INSTANCE_MAP(map, name, map, PARAMS(proto), PARAMS(args))
  ^~~~~~~~~~~~~~~~~~~~~~~~~~~~~~~~~~~
/tmp/B.mANm8D/BUILD/lttng-modules-2.10.7/probes/../probes/lttng-tracepoint-event-impl.h:97:2: note: in expansion of macro 'LTTNG_TRACEPOINT_EVENT_MAP'
  LTTNG_TRACEPOINT_EVENT_MAP(name, name,    \
  ^~~~~~~~~~~~~~~~~~~~~~~~~~
/tmp/B.mANm8D/BUILD/lttng-modules-2.10.7/probes/../instrumentation/events/lttng-module/sock.h:26:1: note: in expansion of macro 'LTTNG_TRACEPOINT_EVENT'
 LTTNG_TRACEPOINT_EVENT(sock_exceed_buf_limit,
 ^~~~~~~~~~~~~~~~~~~~~~
In file included from ./include/trace/events/sock.h:10,
                 from /tmp/B.mANm8D/BUILD/lttng-modules-2.10.7/probes/lttng-probe-sock.c:31:
./include/linux/tracepoint.h:235:21: note: previous definition of 'trace_sock_exceed_buf_limit' was here
  static inline void trace_##name(proto)    \
                     ^~~~~~
./include/linux/tracepoint.h:398:2: note: in expansion of macro '__DECLARE_TRACE'
  __DECLARE_TRACE(name, PARAMS(proto), PARAMS(args),  \
  ^~~~~~~~~~~~~~~
./include/linux/tracepoint.h:534:2: note: in expansion of macro 'DECLARE_TRACE'
  DECLARE_TRACE(name, PARAMS(proto), PARAMS(args))
  ^~~~~~~~~~~~~
./include/trace/events/sock.h:92:1: note: in expansion of macro 'TRACE_EVENT'
 TRACE_EVENT(sock_exceed_buf_limit,
 ^~~~~~~~~~~
make[3]: *** [scripts/Makefile.build:313: /tmp/B.mANm8D/BUILD/lttng-modules-2.10.7/probes/lttng-probe-sock.o] Error 1
make[3]: *** Waiting for unfinished jobs....
  CC [M]  /tmp/B.mANm8D/BUILD/lttng-modules-2.10.7/probes/lttng-probe-block.o
  CC [M]  /tmp/B.mANm8D/BUILD/lttng-modules-2.10.7/lttng-filter-validator.o
  CC [M]  /tmp/B.mANm8D/BUILD/lttng-modules-2.10.7/probes/lttng-probe-udp.o
  CC [M]  /tmp/B.mANm8D/BUILD/lttng-modules-2.10.7/lttng-tp-mempool.o
  CC [M]  /tmp/B.mANm8D/BUILD/lttng-modules-2.10.7/probes/lttng-probe-user.o
  CC [M]  /tmp/B.mANm8D/BUILD/lttng-modules-2.10.7/lttng-tracepoint.o
/tmp/B.mANm8D/BUILD/lttng-modules-2.10.7/lttng-tracepoint.c: In function 'lttng_tracepoint_coming':
/tmp/B.mANm8D/BUILD/lttng-modules-2.10.7/lttng-tracepoint.c:244:6: warning: assignment to 'struct tracepoint *' from 'tracepoint_ptr_t' {aka 'const int'} makes pointer from integer without a cast [-Wint-conversion]
   tp = tp_mod->mod->tracepoints_ptrs[i];
      ^
/tmp/B.mANm8D/BUILD/lttng-modules-2.10.7/lttng-tracepoint.c: In function 'lttng_tracepoint_going':
/tmp/B.mANm8D/BUILD/lttng-modules-2.10.7/lttng-tracepoint.c:285:6: warning: assignment to 'struct tracepoint *' from 'tracepoint_ptr_t' {aka 'const int'} makes pointer from integer without a cast [-Wint-conversion]
   tp = tp_mod->mod->tracepoints_ptrs[i];
      ^
  CC [M]  /tmp/B.mANm8D/BUILD/lttng-modules-2.10.7/probes/lttng-probe-gpio.o
  CC [M]  /tmp/B.mANm8D/BUILD/lttng-modules-2.10.7/wrapper/irqdesc.o
  CC [M]  /tmp/B.mANm8D/BUILD/lttng-modules-2.10.7/lttng-context-perf-counters.o
  CC [M]  /tmp/B.mANm8D/BUILD/lttng-modules-2.10.7/wrapper/fdtable.o
  CC [M]  /tmp/B.mANm8D/BUILD/lttng-modules-2.10.7/probes/lttng-probe-asoc.o
make[2]: *** [scripts/Makefile.build:546: /tmp/B.mANm8D/BUILD/lttng-modules-2.10.7/probes] Error 2
make[2]: *** Waiting for unfinished jobs....
  CC [M]  /tmp/B.mANm8D/BUILD/lttng-modules-2.10.7/lttng-statedump-impl.o
  CC [M]  /tmp/B.mANm8D/BUILD/lttng-modules-2.10.7/lttng-syscalls.o
make[1]: *** [Makefile:1517: _module_/tmp/B.mANm8D/BUILD/lttng-modules-2.10.7] Error 2
make: *** [Makefile:111: modules] Error 2
error: Bad exit status from /tmp/B.mANm8D/BUILD/tmp/rpm-tmp.54956 (%build)


RPM build errors:
    Bad exit status from /tmp/B.mANm8D/BUILD/tmp/rpm-tmp.54956 (%build)
ended at: Fri Oct 26 00:41:22 2018, done in 0:00:54.691857
error: No files produced.
mesg: ttyname failed: Inappropriate ioctl for device
+ chmod -R u+rwX /tmp/B.mANm8D/BUILD
+ rm -rf /tmp/B.mANm8D/tmp /tmp/B.mANm8D/BUILD
mesg: ttyname failed: Inappropriate ioctl for device
+ rm -rf /tmp/B.mANm8D
Begin-PLD-Builder-Info
Build-Time: user:105.04s sys:11.38s real:61.55s (faults io:0 non-io:3275042)

End-PLD-Builder-Info
[Back to list of logs] [View rpm -qa of builder]