FailedOk

th/SRPMS[OK]
th/x32[OK]
th/i686[OK]
th/x86_64[OK]

ac/SRPMS[OK]
ac/i386[OK]
ac/i586[OK]
ac/i686[OK]
ac/alpha[OK]
ac/amd64[OK]
ac/athlon[OK]
ac/ppc[OK]
ac/sparc[OK]
ac/sparc64[OK]

Advanced Search
main()
Powered by PLD Linux
(c) 2002-2018 PLD Team
$Revision: 1.37 $
Powered by /dev/null.
Your IP: 54.80.103.120

lttng-modules d7bc72fe-414e-4557-a707-b4605af9ab57

Status:Failed
Source URL:ftp://buildlogs.pld-linux.org/th/x86_64/FAIL/lttng-modules,d7bc72fe-414e-4557-a707-b4605af9ab57.bz2
text/plain URL:View!
full text:View!
rpm -qa of builder:View!
Date:2018/04/07 12:47:54
Runtime:0:00:42.211205

Toc:

  • error 1
  • rpm: error: Failed build dependencies:
  • error 2
  • rpm: error: Failed build dependencies:
  • prep
  • Executing(%prep): /bin/sh -e /tmp/B.Iqpqo1/BUILD/tmp/rpm-tmp.88326
  • build
  • Executing(%build): /bin/sh -e /tmp/B.Iqpqo1/BUILD/tmp/rpm-tmp.88326
  • error 3
  • /tmp/B.Iqpqo1/BUILD/lttng-modules-2.10.4/probes/../probes/lttng-tracepoint-event-impl.h:142:6: error: conflicting types for 'trace_hrtimer_start'
  • error 4
  • error: Bad exit status from /tmp/B.Iqpqo1/BUILD/tmp/rpm-tmp.88326 (%build)
  • error 5
  • RPM build errors:
  • error 6
  • error: No files produced.

Content:

checking if we should skip the build
started at: Sat Apr  7 12:44:16 2018
killing old processes on a builder
mesg: ttyname failed: Inappropriate ioctl for device
sending signal 9 to pid -1
Killed
fetching https://srcbuilder.pld-linux.org/th//srpms/d7bc72fe-414e-4557-a707-b4605af9ab57/lttng-modules-2.10.4-3%404.16.0_1.src.rpm
fetched 326429 bytes, 670.4 K/s
installing srpm: lttng-modules-2.10.4-3@4.16.0_1.src.rpm
mesg: ttyname failed: Inappropriate ioctl for device
+ install -d /tmp/B.Iqpqo1/BUILD /tmp/B.Iqpqo1/RPMS
+ LC_ALL=en_US.UTF-8
+ rpm -qp --changelog lttng-modules-2.10.4-3@4.16.0_1.src.rpm
* Sat Apr 07 2018 PLD Linux Team <feedback@pld-linux.org>
- For complete changelog see: http://git.pld-linux.org/?p=packages/lttng-modules.git;a=log;h=auto/th/lttng-modules-2.10.4-3
* Mon Jan 29 2018 Jan Rękorajski <baggins@pld-linux.org> 9fd8375
- upstream fixes for kernel 4.15 - rel 3 * Fri Jan 19 2018 Jan Rękorajski <baggins@pld-linux.org> b1989bf
- upstream updates for kvm instrumentation - rel 2 * Thu Nov 16 2017 Jan Rękorajski <baggins@pld-linux.org> 3bb63f3
- up to 2.10.4 * Sat Sep 16 2017 Jan Rękorajski <baggins@pld-linux.org> f6e66b0
- updated to 2.10.0 with upstream fix for kernel 4.13 * Mon Jul 31 2017 Jakub Bogusz <qboosh@pld-linux.org> e3e5646
- updated to 2.9.3 * Wed May 10 2017 Jan Rękorajski <baggins@pld-linux.org> 31ce0d4
- up to 2.9.2 + rpm -Uhv --nodeps --define '_topdir /tmp/B.Iqpqo1' --define '_specdir %{_topdir}' --define '_sourcedir %{_specdir}' --define '_rpmdir %{_topdir}/RPMS' --define '_builddir %{_topdir}/BUILD' --without userspace --define 'build_kernels head,4.14,4.9,4.4' lttng-modules-2.10.4-3@4.16.0_1.src.rpm Preparing... ################################################## lttng-modules ################################################## + rm -f lttng-modules-2.10.4-3@4.16.0_1.src.rpm mesg: ttyname failed: Inappropriate ioctl for device + install -m 700 -d /tmp/B.Iqpqo1/BUILD/tmp mesg: ttyname failed: Inappropriate ioctl for device + TMPDIR=/tmp/B.Iqpqo1/BUILD/tmp + exec nice -n 0 rpmbuild -bp --short-circuit --nodeps --define '_topdir /tmp/B.Iqpqo1' --define '_specdir %{_topdir}' --define '_sourcedir %{_specdir}' --define '_rpmdir %{_topdir}/RPMS' --define '_builddir %{_topdir}/BUILD' --without userspace --target x86_64-pld-linux --define 'build_kernels head,4.14,4.9,4.4' --define 'prep exit 0' /tmp/B.Iqpqo1/lttng-modules.spec Building target platforms: x86_64-pld-linux checking BuildConflict-ing packages no BuildConflicts found checking BR rpm: error: Failed build dependencies: rpm: kernel-source >= 3:2.6.38 is needed by lttng-modules-2.10.4-3@4.16.0_1.src rpm: kernel-4.14-source >= 3:2.6.38 is needed by lttng-modules-2.10.4-3@4.16.0_1.src rpm: kernel-4.9-source >= 3:2.6.38 is needed by lttng-modules-2.10.4-3@4.16.0_1.src rpm: kernel-4.4-source >= 3:2.6.38 is needed by lttng-modules-2.10.4-3@4.16.0_1.src rpm: Building target platforms: x86_64-pld-linux updating poldek cache... ready is up to date Retrieving th::packages.ndir.md... Retrieving th::packages.ndir.diff.toc.gz... Retrieving diff::packages.ndir.2018.04.06-10.34.28.gz... ..............................done Retrieving diff::packages.ndir.dscr.2018.04.06-10.34.28.gz... Loading [pndir]th... Applying packages.ndir.2018.04.06-10.34.28.gz... Writing /root/.poldek-cache/[...]/packages.ndir.gz... Retrieving th::packages.ndir.md... th is up to date Retrieving th-ready::packages.ndir.md... th-ready is up to date Retrieving th-ready::packages.ndir.md... th-ready is up to date Retrieving th-test::packages.ndir.md... Retrieving th-test::packages.ndir.diff.toc.gz... th-test: desynchronized index, trying to update whole index... Retrieving th-test::packages.ndir.md... Retrieving th-test::packages.ndir.md... Retrieving th-test::packages.ndir.gz... ..............................done Retrieving th-test::packages.ndir.dscr.gz... ..............................done th-test is up to date Retrieving th-test::packages.ndir.md... Retrieving th-test::packages.ndir.diff.toc.gz... ..............................done Retrieving diff::packages.ndir.2018.04.06-01.47.03.gz... Retrieving diff::packages.ndir.dscr.2018.04.06-01.47.03.gz... Loading [pndir]th-test... Applying packages.ndir.2018.04.06-01.47.03.gz... Retrieving diff::packages.ndir.2018.04.06-20.46.01.gz... ..............................done Retrieving diff::packages.ndir.dscr.2018.04.06-20.46.01.gz... Applying packages.ndir.2018.04.06-20.46.01.gz... Retrieving diff::packages.ndir.2018.04.06-20.57.02.gz... ..............................done Retrieving diff::packages.ndir.dscr.2018.04.06-20.57.02.gz... Applying packages.ndir.2018.04.06-20.57.02.gz... Retrieving diff::packages.ndir.2018.04.06-22.01.06.gz... ..............................done Retrieving diff::packages.ndir.dscr.2018.04.06-22.01.06.gz... Applying packages.ndir.2018.04.06-22.01.06.gz... Retrieving diff::packages.ndir.2018.04.06-22.05.02.gz... ..............................done Retrieving diff::packages.ndir.dscr.2018.04.06-22.05.02.gz... Applying packages.ndir.2018.04.06-22.05.02.gz... Retrieving diff::packages.ndir.2018.04.06-22.07.01.gz... ..............................done Retrieving diff::packages.ndir.dscr.2018.04.06-22.07.01.gz... Applying packages.ndir.2018.04.06-22.07.01.gz... Retrieving diff::packages.ndir.2018.04.06-22.22.03.gz... ..............................done Retrieving diff::packages.ndir.dscr.2018.04.06-22.22.03.gz... Applying packages.ndir.2018.04.06-22.22.03.gz... Retrieving diff::packages.ndir.2018.04.07-08.15.05.gz... ..............................done Retrieving diff::packages.ndir.dscr.2018.04.07-08.15.05.gz... Applying packages.ndir.2018.04.07-08.15.05.gz... Retrieving diff::packages.ndir.2018.04.07-08.59.05.gz... ..............................done Retrieving diff::packages.ndir.dscr.2018.04.07-08.59.05.gz... Applying packages.ndir.2018.04.07-08.59.05.gz... Retrieving diff::packages.ndir.2018.04.07-09.56.05.gz... Retrieving diff::packages.ndir.dscr.2018.04.07-09.56.05.gz... Applying packages.ndir.2018.04.07-09.56.05.gz... Retrieving diff::packages.ndir.2018.04.07-10.41.02.gz... ..............................done Retrieving diff::packages.ndir.dscr.2018.04.07-10.41.02.gz... Applying packages.ndir.2018.04.07-10.41.02.gz... Retrieving diff::packages.ndir.2018.04.07-10.43.01.gz... Retrieving diff::packages.ndir.dscr.2018.04.07-10.43.01.gz... Applying packages.ndir.2018.04.07-10.43.01.gz... Writing /root/.poldek-cache/[...]/packages.ndir.gz... checking conflicting packages in BRed packages poldek: Loading [pndir]ready... poldek: Loading [pndir]th-test... poldek: Loading [pndir]th-test... poldek: Loading [pndir]th-ready... poldek: Loading [pndir]th-ready... poldek: Loading [pndir]th... poldek: Loading [pndir]th... poldek: 27427 packages read poldek: Removed 730 duplicate packages from available set poldek: Processing dependencies... poldek: There are 4 packages to install: poldek: I kernel-4.14-source-4.14.32-1.noarch kernel-4.4-source-4.4.126-1.noarch poldek: I kernel-4.9-source-4.9.92-1.noarch kernel-source-4.16.0-1.noarch poldek: This operation will use 2390.9MB of disk space. poldek: Need to get 335.1MB of archives. poldek: Executing pm-command.sh --upgrade -vh --test --root / --define _check_dirname_deps 1... poldek: Preparing... ################################################## no conflicts found checking BR rpm: error: Failed build dependencies: rpm: kernel-source >= 3:2.6.38 is needed by lttng-modules-2.10.4-3@4.16.0_1.src rpm: kernel-4.14-source >= 3:2.6.38 is needed by lttng-modules-2.10.4-3@4.16.0_1.src rpm: kernel-4.9-source >= 3:2.6.38 is needed by lttng-modules-2.10.4-3@4.16.0_1.src rpm: kernel-4.4-source >= 3:2.6.38 is needed by lttng-modules-2.10.4-3@4.16.0_1.src rpm: Building target platforms: x86_64-pld-linux installing BR: kernel\-source kernel\-4\.4\-source kernel\-4\.9\-source kernel\-4\.14\-source + poldek --noask --caplookup -Q -v '--ignore=hhvm-*' '--ignore=php4-*' '--ignore=php52-*' '--ignore=php54-*' '--ignore=php55-*' '--ignore=php56-*' '--ignore=php70-*' '--ignore=php71-*' '--ignore=php72-*' --upgrade kernel-source kernel-4.4-source kernel-4.9-source kernel-4.14-source Loading [pndir]ready... Loading [pndir]th-test... Loading [pndir]th-test... Loading [pndir]th-ready... Loading [pndir]th-ready... Loading [pndir]th... Loading [pndir]th... 27427 packages read Removed 730 duplicate packages from available set Processing dependencies... There are 4 packages to install: I kernel-4.14-source-4.14.32-1.noarch kernel-4.4-source-4.4.126-1.noarch I kernel-4.9-source-4.9.92-1.noarch kernel-source-4.16.0-1.noarch This operation will use 2390.9MB of disk space. Need to get 335.1MB of archives. Executing pm-command.sh --upgrade -vh --root / --define _check_dirname_deps 1... Preparing... ################################################## kernel-source ################################################## kernel-4.14-source ################################################## kernel-4.4-source ################################################## kernel-4.9-source ################################################## building RPM using: set -ex; : build-id: d7bc72fe-414e-4557-a707-b4605af9ab57; TMPDIR=/tmp/B.Iqpqo1/BUILD/tmp exec nice -n 0 rpmbuild -bb --define '_smp_mflags -j9' --define '_make_opts -Otarget' --define '_pld_builder 1' --define '_topdir /tmp/B.Iqpqo1' --define '_specdir %{_topdir}' --define '_sourcedir %{_specdir}' --define '_rpmdir %{_topdir}/RPMS' --define '_builddir %{_topdir}/BUILD' --without userspace --target x86_64-pld-linux --define 'build_kernels head,4.14,4.9,4.4' /tmp/B.Iqpqo1/lttng-modules.spec mesg: ttyname failed: Inappropriate ioctl for device + : build-id: d7bc72fe-414e-4557-a707-b4605af9ab57 + TMPDIR=/tmp/B.Iqpqo1/BUILD/tmp + exec nice -n 0 rpmbuild -bb --define '_smp_mflags -j9' --define '_make_opts -Otarget' --define '_pld_builder 1' --define '_topdir /tmp/B.Iqpqo1' --define '_specdir %{_topdir}' --define '_sourcedir %{_specdir}' --define '_rpmdir %{_topdir}/RPMS' --define '_builddir %{_topdir}/BUILD' --without userspace --target x86_64-pld-linux --define 'build_kernels head,4.14,4.9,4.4' /tmp/B.Iqpqo1/lttng-modules.spec Building target platforms: x86_64-pld-linux Executing(%prep): /bin/sh -e /tmp/B.Iqpqo1/BUILD/tmp/rpm-tmp.88326 + umask 022 + cd /tmp/B.Iqpqo1/BUILD + cd /tmp/B.Iqpqo1/BUILD + rm -rf lttng-modules-2.10.4 + /usr/bin/bzip2 -dc /tmp/B.Iqpqo1/lttng-modules-2.10.4.tar.bz2 + /bin/tar -xf - + STATUS=0 + '[' 0 -ne 0 ']' + cd lttng-modules-2.10.4 + /bin/id -u + '[' 1000 '=' 0 ']' + /bin/id -u + '[' 1000 '=' 0 ']' + /bin/chmod -Rf a+rX,u+w,g-w,o-w . + echo 'Patch #0 (build.patch):' Patch #0 (build.patch): + '[' -f /tmp/B.Iqpqo1/build.patch ']' + /bin/cat /tmp/B.Iqpqo1/build.patch + /usr/bin/patch -s -p1 + echo 'Patch #1 (kvm-update.patch):' Patch #1 (kvm-update.patch): + '[' -f /tmp/B.Iqpqo1/kvm-update.patch ']' + /bin/cat /tmp/B.Iqpqo1/kvm-update.patch + /usr/bin/patch -s -p1 + echo 'Patch #2 (kmem-update.patch):' Patch #2 (kmem-update.patch): + '[' -f /tmp/B.Iqpqo1/kmem-update.patch ']' + /bin/cat /tmp/B.Iqpqo1/kmem-update.patch + /usr/bin/patch -s -p1 + echo 'Patch #3 (kernel-4.15-timers.patch):' Patch #3 (kernel-4.15-timers.patch): + '[' -f /tmp/B.Iqpqo1/kernel-4.15-timers.patch ']' + /bin/cat /tmp/B.Iqpqo1/kernel-4.15-timers.patch + /usr/bin/patch -s -p1 + echo 'Patch #4 (kernel-4.15-atomics.patch):' Patch #4 (kernel-4.15-atomics.patch): + '[' -f /tmp/B.Iqpqo1/kernel-4.15-atomics.patch ']' + /bin/cat /tmp/B.Iqpqo1/kernel-4.15-atomics.patch + /usr/bin/patch -s -p1 + echo 'Patch #5 (sock-update.patch):' Patch #5 (sock-update.patch): + '[' -f /tmp/B.Iqpqo1/sock-update.patch ']' + /bin/cat /tmp/B.Iqpqo1/sock-update.patch + /usr/bin/patch -s -p1 + exit 0 Executing(%build): /bin/sh -e /tmp/B.Iqpqo1/BUILD/tmp/rpm-tmp.88326 TMP=/home/users/builder/tmp HOME=/home/users/builder PATH=/home/users/builder/GNUstep/Tools:/usr/local/bin:/usr/bin:/bin:/home/users/builder/bin TMPDIR=/tmp/B.Iqpqo1/BUILD/tmp + umask 022 + cd /tmp/B.Iqpqo1/BUILD + cd lttng-modules-2.10.4 + /usr/bin/make -Otarget -j9 'KERNELDIR=/usr/src/linux' /usr/bin/make -C /usr/src/linux M=/tmp/B.Iqpqo1/BUILD/lttng-modules-2.10.4 CONFIG_LTTNG=m CONFIG_LTTNG_CLOCK_PLUGIN_TEST=m modules CC [M] /tmp/B.Iqpqo1/BUILD/lttng-modules-2.10.4/lttng-ring-buffer-metadata-client.o CC [M] /tmp/B.Iqpqo1/BUILD/lttng-modules-2.10.4/lttng-ring-buffer-metadata-mmap-client.o CC [M] /tmp/B.Iqpqo1/BUILD/lttng-modules-2.10.4/lttng-ring-buffer-client-mmap-discard.o CC [M] /tmp/B.Iqpqo1/BUILD/lttng-modules-2.10.4/lttng-abi.o CC [M] /tmp/B.Iqpqo1/BUILD/lttng-modules-2.10.4/lttng-string-utils.o CC [M] /tmp/B.Iqpqo1/BUILD/lttng-modules-2.10.4/lttng-ring-buffer-client-overwrite.o CC [M] /tmp/B.Iqpqo1/BUILD/lttng-modules-2.10.4/lttng-ring-buffer-client-mmap-overwrite.o CC [M] /tmp/B.Iqpqo1/BUILD/lttng-modules-2.10.4/lttng-clock.o CC [M] /tmp/B.Iqpqo1/BUILD/lttng-modules-2.10.4/lttng-ring-buffer-client-discard.o CC [M] /tmp/B.Iqpqo1/BUILD/lttng-modules-2.10.4/lttng-context-pid.o CC [M] /tmp/B.Iqpqo1/BUILD/lttng-modules-2.10.4/lttng-context-vpid.o CC [M] /tmp/B.Iqpqo1/BUILD/lttng-modules-2.10.4/lttng-context-prio.o CC [M] /tmp/B.Iqpqo1/BUILD/lttng-modules-2.10.4/lttng-context-nice.o CC [M] /tmp/B.Iqpqo1/BUILD/lttng-modules-2.10.4/lttng-probes.o CC [M] /tmp/B.Iqpqo1/BUILD/lttng-modules-2.10.4/lttng-context.o CC [M] /tmp/B.Iqpqo1/BUILD/lttng-modules-2.10.4/lttng-events.o CC [M] /tmp/B.Iqpqo1/BUILD/lttng-modules-2.10.4/lttng-context-procname.o CC [M] /tmp/B.Iqpqo1/BUILD/lttng-modules-2.10.4/lttng-context-tid.o CC [M] /tmp/B.Iqpqo1/BUILD/lttng-modules-2.10.4/lttng-calibrate.o CC [M] /tmp/B.Iqpqo1/BUILD/lttng-modules-2.10.4/lttng-context-vtid.o CC [M] /tmp/B.Iqpqo1/BUILD/lttng-modules-2.10.4/lttng-context-cpu-id.o CC [M] /tmp/B.Iqpqo1/BUILD/lttng-modules-2.10.4/lttng-context-vppid.o CC [M] /tmp/B.Iqpqo1/BUILD/lttng-modules-2.10.4/lttng-context-interruptible.o CC [M] /tmp/B.Iqpqo1/BUILD/lttng-modules-2.10.4/lttng-context-need-reschedule.o CC [M] /tmp/B.Iqpqo1/BUILD/lttng-modules-2.10.4/wrapper/random.o CC [M] /tmp/B.Iqpqo1/BUILD/lttng-modules-2.10.4/lttng-context-hostname.o CC [M] /tmp/B.Iqpqo1/BUILD/lttng-modules-2.10.4/lttng-context-ppid.o CC [M] /tmp/B.Iqpqo1/BUILD/lttng-modules-2.10.4/probes/lttng.o CC [M] /tmp/B.Iqpqo1/BUILD/lttng-modules-2.10.4/wrapper/trace-clock.o CC [M] /tmp/B.Iqpqo1/BUILD/lttng-modules-2.10.4/lttng-filter.o CC [M] /tmp/B.Iqpqo1/BUILD/lttng-modules-2.10.4/wrapper/page_alloc.o CC [M] /tmp/B.Iqpqo1/BUILD/lttng-modules-2.10.4/lttng-filter-specialize.o CC [M] /tmp/B.Iqpqo1/BUILD/lttng-modules-2.10.4/probes/lttng-probe-user.o CC [M] /tmp/B.Iqpqo1/BUILD/lttng-modules-2.10.4/lttng-filter-interpreter.o CC [M] /tmp/B.Iqpqo1/BUILD/lttng-modules-2.10.4/lttng-tracker-pid.o CC [M] /tmp/B.Iqpqo1/BUILD/lttng-modules-2.10.4/lttng-filter-validator.o CC [M] /tmp/B.Iqpqo1/BUILD/lttng-modules-2.10.4/lttng-tracepoint.o CC [M] /tmp/B.Iqpqo1/BUILD/lttng-modules-2.10.4/wrapper/fdtable.o CC [M] /tmp/B.Iqpqo1/BUILD/lttng-modules-2.10.4/lttng-context-perf-counters.o CC [M] /tmp/B.Iqpqo1/BUILD/lttng-modules-2.10.4/wrapper/irqdesc.o CC [M] /tmp/B.Iqpqo1/BUILD/lttng-modules-2.10.4/tests/clock-plugin/lttng-clock-plugin-test.o LD [M] /tmp/B.Iqpqo1/BUILD/lttng-modules-2.10.4/tests/lttng-clock-plugin-test.o CC [M] /tmp/B.Iqpqo1/BUILD/lttng-modules-2.10.4/probes/lttng-probe-timer.o In file included from /tmp/B.Iqpqo1/BUILD/lttng-modules-2.10.4/probes/../probes/define_trace.h:100:0, from /tmp/B.Iqpqo1/BUILD/lttng-modules-2.10.4/probes/../instrumentation/events/lttng-module/timer.h:332, from /tmp/B.Iqpqo1/BUILD/lttng-modules-2.10.4/probes/lttng-probe-timer.c:43: /tmp/B.Iqpqo1/BUILD/lttng-modules-2.10.4/probes/../probes/lttng-tracepoint-event-impl.h:142:6: error: conflicting types for 'trace_hrtimer_start' void trace_##_name(_proto); ^ /tmp/B.Iqpqo1/BUILD/lttng-modules-2.10.4/probes/../probes/lttng-tracepoint-event-impl.h:54:2: note: in expansion of macro 'LTTNG_TRACEPOINT_EVENT_INSTANCE_MAP' LTTNG_TRACEPOINT_EVENT_INSTANCE_MAP(map, name, map, PARAMS(proto), PARAMS(args)) ^~~~~~~~~~~~~~~~~~~~~~~~~~~~~~~~~~~ /tmp/B.Iqpqo1/BUILD/lttng-modules-2.10.4/probes/../instrumentation/events/lttng-module/timer.h:163:1: note: in expansion of macro 'LTTNG_TRACEPOINT_EVENT_MAP' LTTNG_TRACEPOINT_EVENT_MAP(hrtimer_start, ^~~~~~~~~~~~~~~~~~~~~~~~~~ In file included from ./include/trace/events/timer.h:8:0, from /tmp/B.Iqpqo1/BUILD/lttng-modules-2.10.4/probes/lttng-probe-timer.c:32: ./include/linux/tracepoint.h:184:21: note: previous definition of 'trace_hrtimer_start' was here static inline void trace_##name(proto) \ ^ ./include/linux/tracepoint.h:349:2: note: in expansion of macro '__DECLARE_TRACE' __DECLARE_TRACE(name, PARAMS(proto), PARAMS(args), \ ^~~~~~~~~~~~~~~ ./include/linux/tracepoint.h:485:2: note: in expansion of macro 'DECLARE_TRACE' DECLARE_TRACE(name, PARAMS(proto), PARAMS(args)) ^~~~~~~~~~~~~ ./include/trace/events/timer.h:191:1: note: in expansion of macro 'TRACE_EVENT' TRACE_EVENT(hrtimer_start, ^~~~~~~~~~~ make[3]: *** [scripts/Makefile.build:330: /tmp/B.Iqpqo1/BUILD/lttng-modules-2.10.4/probes/lttng-probe-timer.o] Error 1 make[3]: *** Waiting for unfinished jobs.... CC [M] /tmp/B.Iqpqo1/BUILD/lttng-modules-2.10.4/tests/probes/lttng-test.o LD [M] /tmp/B.Iqpqo1/BUILD/lttng-modules-2.10.4/tests/lttng-test.o CC [M] /tmp/B.Iqpqo1/BUILD/lttng-modules-2.10.4/probes/lttng-probe-irq.o CC [M] /tmp/B.Iqpqo1/BUILD/lttng-modules-2.10.4/lttng-statedump-impl.o CC [M] /tmp/B.Iqpqo1/BUILD/lttng-modules-2.10.4/probes/lttng-probe-sched.o CC [M] /tmp/B.Iqpqo1/BUILD/lttng-modules-2.10.4/lib/ringbuffer/ring_buffer_backend.o CC [M] /tmp/B.Iqpqo1/BUILD/lttng-modules-2.10.4/probes/lttng-probe-kmem.o CC [M] /tmp/B.Iqpqo1/BUILD/lttng-modules-2.10.4/probes/lttng-probe-module.o CC [M] /tmp/B.Iqpqo1/BUILD/lttng-modules-2.10.4/lib/prio_heap/lttng_prio_heap.o make[2]: *** [scripts/Makefile.build:583: /tmp/B.Iqpqo1/BUILD/lttng-modules-2.10.4/probes] Error 2 make[2]: *** Waiting for unfinished jobs.... LD [M] /tmp/B.Iqpqo1/BUILD/lttng-modules-2.10.4/lttng-statedump.o CC [M] /tmp/B.Iqpqo1/BUILD/lttng-modules-2.10.4/lib/ringbuffer/ring_buffer_iterator.o CC [M] /tmp/B.Iqpqo1/BUILD/lttng-modules-2.10.4/lib/ringbuffer/ring_buffer_splice.o CC [M] /tmp/B.Iqpqo1/BUILD/lttng-modules-2.10.4/lib/ringbuffer/ring_buffer_vfs.o CC [M] /tmp/B.Iqpqo1/BUILD/lttng-modules-2.10.4/lib/ringbuffer/ring_buffer_mmap.o CC [M] /tmp/B.Iqpqo1/BUILD/lttng-modules-2.10.4/lib/../wrapper/splice.o CC [M] /tmp/B.Iqpqo1/BUILD/lttng-modules-2.10.4/lib/ringbuffer/ring_buffer_frontend.o LD [M] /tmp/B.Iqpqo1/BUILD/lttng-modules-2.10.4/lib/lttng-lib-ring-buffer.o CC [M] /tmp/B.Iqpqo1/BUILD/lttng-modules-2.10.4/lttng-syscalls.o In file included from /tmp/B.Iqpqo1/BUILD/lttng-modules-2.10.4/lttng-syscalls.c:37:0: /tmp/B.Iqpqo1/BUILD/lttng-modules-2.10.4/lttng-syscalls.c: In function 'lttng_channel_syscall_mask': /tmp/B.Iqpqo1/BUILD/lttng-modules-2.10.4/lib/bitfield.h:166:13: warning: '~' on a boolean expression [-Wbool-operation] __v &= ~((~(typeof(__v)) 0) << __length); \ ^ /tmp/B.Iqpqo1/BUILD/lttng-modules-2.10.4/lib/bitfield.h:221:2: note: in expansion of macro '_bt_bitfield_write_be' _bt_bitfield_write_be(ptr, unsigned char, _start, _length, _v) ^~~~~~~~~~~~~~~~~~~~~ /tmp/B.Iqpqo1/BUILD/lttng-modules-2.10.4/lttng-syscalls.c:1272:3: note: in expansion of macro 'bt_bitfield_write_be' bt_bitfield_write_be(tmp_mask, char, bit, 1, state); ^ /tmp/B.Iqpqo1/BUILD/lttng-modules-2.10.4/lib/bitfield.h:166:13: note: did you mean to use logical not? __v &= ~((~(typeof(__v)) 0) << __length); \ ^ /tmp/B.Iqpqo1/BUILD/lttng-modules-2.10.4/lib/bitfield.h:221:2: note: in expansion of macro '_bt_bitfield_write_be' _bt_bitfield_write_be(ptr, unsigned char, _start, _length, _v) ^~~~~~~~~~~~~~~~~~~~~ /tmp/B.Iqpqo1/BUILD/lttng-modules-2.10.4/lttng-syscalls.c:1272:3: note: in expansion of macro 'bt_bitfield_write_be' bt_bitfield_write_be(tmp_mask, char, bit, 1, state); ^ /tmp/B.Iqpqo1/BUILD/lttng-modules-2.10.4/lib/bitfield.h:166:13: warning: '~' on a boolean expression [-Wbool-operation] __v &= ~((~(typeof(__v)) 0) << __length); \ ^ /tmp/B.Iqpqo1/BUILD/lttng-modules-2.10.4/lib/bitfield.h:221:2: note: in expansion of macro '_bt_bitfield_write_be' _bt_bitfield_write_be(ptr, unsigned char, _start, _length, _v) ^~~~~~~~~~~~~~~~~~~~~ /tmp/B.Iqpqo1/BUILD/lttng-modules-2.10.4/lttng-syscalls.c:1286:3: note: in expansion of macro 'bt_bitfield_write_be' bt_bitfield_write_be(tmp_mask, char, bit, 1, state); ^ /tmp/B.Iqpqo1/BUILD/lttng-modules-2.10.4/lib/bitfield.h:166:13: note: did you mean to use logical not? __v &= ~((~(typeof(__v)) 0) << __length); \ ^ /tmp/B.Iqpqo1/BUILD/lttng-modules-2.10.4/lib/bitfield.h:221:2: note: in expansion of macro '_bt_bitfield_write_be' _bt_bitfield_write_be(ptr, unsigned char, _start, _length, _v) ^~~~~~~~~~~~~~~~~~~~~ /tmp/B.Iqpqo1/BUILD/lttng-modules-2.10.4/lttng-syscalls.c:1286:3: note: in expansion of macro 'bt_bitfield_write_be' bt_bitfield_write_be(tmp_mask, char, bit, 1, state); ^ make[1]: *** [Makefile:1561: _module_/tmp/B.Iqpqo1/BUILD/lttng-modules-2.10.4] Error 2 make: *** [Makefile:110: modules] Error 2 error: Bad exit status from /tmp/B.Iqpqo1/BUILD/tmp/rpm-tmp.88326 (%build) RPM build errors: Bad exit status from /tmp/B.Iqpqo1/BUILD/tmp/rpm-tmp.88326 (%build) ended at: Sat Apr 7 12:47:54 2018, done in 0:00:42.211205 error: No files produced. mesg: ttyname failed: Inappropriate ioctl for device + chmod -R u+rwX /tmp/B.Iqpqo1/BUILD + rm -rf /tmp/B.Iqpqo1/tmp /tmp/B.Iqpqo1/BUILD mesg: ttyname failed: Inappropriate ioctl for device + rm -rf /tmp/B.Iqpqo1 Begin-PLD-Builder-Info Build-Time: user:158.84s sys:37.73s real:218.21s (faults io:0 non-io:9413896) End-PLD-Builder-Info
[Back to list of logs] [View rpm -qa of builder]