FailedOk

th/SRPMS[OK]
th/x32[OK]
th/i686[OK]
th/x86_64[OK]

ac/SRPMS[OK]
ac/i386[OK]
ac/i586[OK]
ac/i686[OK]
ac/alpha[OK]
ac/amd64[OK]
ac/athlon[OK]
ac/ppc[OK]
ac/sparc[OK]
ac/sparc64[OK]

Advanced Search
main()
Powered by PLD Linux
(c) 2002-2020 PLD Team
$Revision: 1.37 $
Powered by php.
Your IP: 3.236.126.69

mailutils c0f496ba-35c6-49cf-9abd-500adb5b5983

Status:Failed
Source URL:https://buildlogs.pld-linux.org/pld/th/x86_64/FAIL/mailutils,c0f496ba-35c6-49cf-9abd-500adb5b5983.bz2
text/plain URL:View!
full text:View!
rpm -qa of builder:View!
Date:2020/06/02 09:38:59
Runtime:0:05:31.596769

Toc:

  • error 1
  • collect2: error: ld returned 1 exit status
  • error 2
  • make[3]: *** [Makefile:1232: pop3d] Error 1
  • error 3
  • make[2]: *** [Makefile:1353: all-recursive] Error 1
  • error 4
  • make[1]: *** [Makefile:1179: all-recursive] Error 1
  • error 5
  • error: Bad exit status from /tmp/B.HhBJS5/BUILD/tmp/rpm-tmp.23088 (%build)
  • error 6
  • RPM build errors:
  • error 7
  • error: No files produced.

Content:

Making all in scheme
make[2]: Entering directory '/tmp/B.HhBJS5/BUILD/mailutils-3.9/scheme'
echo 's,%GUILE_BINDIR%,/usr/bin,g' > package.sed
echo 's,%BINDIR%,/usr/bin,g' >> package.sed
echo 's,%GUILE_SITE%,/usr/share/guile/site/2.2,g' >> package.sed
echo 's,%PACKAGE%,mailutils,g' >> package.sed
echo 's,%VERSION%,3.9,g' >> package.sed
sed -f package.sed ./guimb.scmi > guimb
chmod +x guimb
make[2]: Leaving directory '/tmp/B.HhBJS5/BUILD/mailutils-3.9/scheme'
Making all in frm
make[2]: Entering directory '/tmp/B.HhBJS5/BUILD/mailutils-3.9/frm'
Making all in .
make[3]: Entering directory '/tmp/B.HhBJS5/BUILD/mailutils-3.9/frm'
x86_64-pld-linux-gcc -DHAVE_CONFIG_H -I. -I..  -I. -I../include -I../lib -I../lib/gnu -I../lib/gnu -I.. -I../include  -DSYSCONFDIR=\"/etc\"  -O2 -fwrapv -pipe -Wformat -Werror=format-security -gdwarf-4 -fno-debug-types-section -fvar-tracking-assignments -g2 -Wp,-D_FORTIFY_SOURCE=2 -fstack-protector-strong --param=ssp-buffer-size=4 -Werror=trampolines -fPIC -march=x86-64 -gdwarf-4 -fno-debug-types-section -fvar-tracking-assignments -g2  -Wall -Wdeclaration-after-statement -MT frm.o -MD -MP -MF .deps/frm.Tpo -c -o frm.o frm.c
mv -f .deps/frm.Tpo .deps/frm.Po
x86_64-pld-linux-gcc -DHAVE_CONFIG_H -I. -I..  -I. -I../include -I../lib -I../lib/gnu -I../lib/gnu -I.. -I../include  -DSYSCONFDIR=\"/etc\"  -O2 -fwrapv -pipe -Wformat -Werror=format-security -gdwarf-4 -fno-debug-types-section -fvar-tracking-assignments -g2 -Wp,-D_FORTIFY_SOURCE=2 -fstack-protector-strong --param=ssp-buffer-size=4 -Werror=trampolines -fPIC -march=x86-64 -gdwarf-4 -fno-debug-types-section -fvar-tracking-assignments -g2  -Wall -Wdeclaration-after-statement -MT common.o -MD -MP -MF .deps/common.Tpo -c -o common.o common.c
common.c: In function 'format_field_align':
common.c:306:10: warning: 'width' may be used uninitialized in this function [-Wmaybe-uninitialized]
  306 |   curcol += width;
      |          ^~
mv -f .deps/common.Tpo .deps/common.Po
/bin/sh ../libtool  --tag=CC   --mode=link x86_64-pld-linux-gcc  -O2 -fwrapv -pipe -Wformat -Werror=format-security -gdwarf-4 -fno-debug-types-section -fvar-tracking-assignments -g2 -Wp,-D_FORTIFY_SOURCE=2 -fstack-protector-strong --param=ssp-buffer-size=4 -Werror=trampolines -fPIC -march=x86-64 -gdwarf-4 -fno-debug-types-section -fvar-tracking-assignments -g2  -Wall -Wdeclaration-after-statement  -Wl,--as-needed -Wl,--no-copy-dt-needed-entries -Wl,-z,relro -Wl,-z,combreloc  -o frm frm.o common.o ../lib/libmuaux.la ../libproto/mbox/libmu_mbox.la  ../libproto/mh/libmu_mh.la ../libproto/maildir/libmu_maildir.la ../libproto/dotmail/libmu_dotmail.la ../libproto/imap/libmu_imap.la ../libproto/pop/libmu_pop.la ../libmu_auth/libmu_auth.la -lgsasl -lgnutls  -lldap -lpam -ldl ../libmailutils/libmailutils.la -lfribidi   -lcrypt  -lpthread
libtool: link: x86_64-pld-linux-gcc -O2 -fwrapv -pipe -Wformat -Werror=format-security -gdwarf-4 -fno-debug-types-section -fvar-tracking-assignments -g2 -Wp,-D_FORTIFY_SOURCE=2 -fstack-protector-strong --param=ssp-buffer-size=4 -Werror=trampolines -fPIC -march=x86-64 -gdwarf-4 -fno-debug-types-section -fvar-tracking-assignments -g2 -Wall -Wdeclaration-after-statement -Wl,--as-needed -Wl,--no-copy-dt-needed-entries -Wl,-z -Wl,relro -Wl,-z -Wl,combreloc -o .libs/frm frm.o common.o  ../lib/.libs/libmuaux.so ../libproto/mbox/.libs/libmu_mbox.so ../libproto/mh/.libs/libmu_mh.so ../libproto/maildir/.libs/libmu_maildir.so ../libproto/dotmail/.libs/libmu_dotmail.so ../libproto/imap/.libs/libmu_imap.so -L/usr/lib64 ../libproto/pop/.libs/libmu_pop.so /tmp/B.HhBJS5/BUILD/mailutils-3.9/libmu_auth/.libs/libmu_auth.so ../libmu_auth/.libs/libmu_auth.so /tmp/B.HhBJS5/BUILD/mailutils-3.9/libmailutils/.libs/libmailutils.so -lmysqlclient -lpq /usr/lib64/libodbc.so /usr/lib64/libltdl.so -lgsasl /usr/lib64/libgnutls.so -lp11-kit /usr/lib64/libidn2.so /usr/lib64/libunistring.so /usr/lib64/libtasn1.so -lnettle -lhogweed /usr/lib64/libgmp.so /usr/lib64/libldap.so /usr/lib64/liblber.so /usr/lib64/libsasl2.so /usr/lib64/libgssapi.so /usr/lib64/libheimntlm.so /usr/lib64/libkrb5.so /usr/lib64/libhx509.so /usr/lib64/libwind.so /usr/lib64/libsqlite3.so -lm -lz /usr/lib64/libhcrypto.so /usr/lib64/libheimbase.so /usr/lib64/libasn1.so /usr/lib64/libroken.so -lresolv -lcom_err -lssl -lcrypto /usr/lib64/libpam.so /usr/lib64/libaudit.so /usr/lib64/libcap-ng.so -ldl ../libmailutils/.libs/libmailutils.so /usr/lib64/libfribidi.so -lcrypt -lpthread -pthread
x86_64-pld-linux-gcc -DHAVE_CONFIG_H -I. -I..  -I. -I../include -I../lib -I../lib/gnu -I../lib/gnu -I.. -I../include  -DSYSCONFDIR=\"/etc\"  -O2 -fwrapv -pipe -Wformat -Werror=format-security -gdwarf-4 -fno-debug-types-section -fvar-tracking-assignments -g2 -Wp,-D_FORTIFY_SOURCE=2 -fstack-protector-strong --param=ssp-buffer-size=4 -Werror=trampolines -fPIC -march=x86-64 -gdwarf-4 -fno-debug-types-section -fvar-tracking-assignments -g2  -Wall -Wdeclaration-after-statement -MT from.o -MD -MP -MF .deps/from.Tpo -c -o from.o from.c
mv -f .deps/from.Tpo .deps/from.Po
/bin/sh ../libtool  --tag=CC   --mode=link x86_64-pld-linux-gcc  -O2 -fwrapv -pipe -Wformat -Werror=format-security -gdwarf-4 -fno-debug-types-section -fvar-tracking-assignments -g2 -Wp,-D_FORTIFY_SOURCE=2 -fstack-protector-strong --param=ssp-buffer-size=4 -Werror=trampolines -fPIC -march=x86-64 -gdwarf-4 -fno-debug-types-section -fvar-tracking-assignments -g2  -Wall -Wdeclaration-after-statement  -Wl,--as-needed -Wl,--no-copy-dt-needed-entries -Wl,-z,relro -Wl,-z,combreloc  -o from from.o common.o ../lib/libmuaux.la ../libproto/mbox/libmu_mbox.la  ../libproto/mh/libmu_mh.la ../libproto/maildir/libmu_maildir.la ../libproto/dotmail/libmu_dotmail.la ../libproto/imap/libmu_imap.la ../libproto/pop/libmu_pop.la ../libmu_auth/libmu_auth.la -lgsasl -lgnutls  -lldap -lpam -ldl ../libmailutils/libmailutils.la -lfribidi   -lcrypt  -lpthread
libtool: link: x86_64-pld-linux-gcc -O2 -fwrapv -pipe -Wformat -Werror=format-security -gdwarf-4 -fno-debug-types-section -fvar-tracking-assignments -g2 -Wp,-D_FORTIFY_SOURCE=2 -fstack-protector-strong --param=ssp-buffer-size=4 -Werror=trampolines -fPIC -march=x86-64 -gdwarf-4 -fno-debug-types-section -fvar-tracking-assignments -g2 -Wall -Wdeclaration-after-statement -Wl,--as-needed -Wl,--no-copy-dt-needed-entries -Wl,-z -Wl,relro -Wl,-z -Wl,combreloc -o .libs/from from.o common.o  ../lib/.libs/libmuaux.so ../libproto/mbox/.libs/libmu_mbox.so ../libproto/mh/.libs/libmu_mh.so ../libproto/maildir/.libs/libmu_maildir.so ../libproto/dotmail/.libs/libmu_dotmail.so ../libproto/imap/.libs/libmu_imap.so -L/usr/lib64 ../libproto/pop/.libs/libmu_pop.so /tmp/B.HhBJS5/BUILD/mailutils-3.9/libmu_auth/.libs/libmu_auth.so ../libmu_auth/.libs/libmu_auth.so /tmp/B.HhBJS5/BUILD/mailutils-3.9/libmailutils/.libs/libmailutils.so -lmysqlclient -lpq /usr/lib64/libodbc.so /usr/lib64/libltdl.so -lgsasl /usr/lib64/libgnutls.so -lp11-kit /usr/lib64/libidn2.so /usr/lib64/libunistring.so /usr/lib64/libtasn1.so -lnettle -lhogweed /usr/lib64/libgmp.so /usr/lib64/libldap.so /usr/lib64/liblber.so /usr/lib64/libsasl2.so /usr/lib64/libgssapi.so /usr/lib64/libheimntlm.so /usr/lib64/libkrb5.so /usr/lib64/libhx509.so /usr/lib64/libwind.so /usr/lib64/libsqlite3.so -lm -lz /usr/lib64/libhcrypto.so /usr/lib64/libheimbase.so /usr/lib64/libasn1.so /usr/lib64/libroken.so -lresolv -lcom_err -lssl -lcrypto /usr/lib64/libpam.so /usr/lib64/libaudit.so /usr/lib64/libcap-ng.so -ldl ../libmailutils/.libs/libmailutils.so /usr/lib64/libfribidi.so -lcrypt -lpthread -pthread
make[3]: Leaving directory '/tmp/B.HhBJS5/BUILD/mailutils-3.9/frm'
Making all in tests
make[3]: Entering directory '/tmp/B.HhBJS5/BUILD/mailutils-3.9/frm/tests'
make[3]: Nothing to be done for 'all'.
make[3]: Leaving directory '/tmp/B.HhBJS5/BUILD/mailutils-3.9/frm/tests'
make[2]: Leaving directory '/tmp/B.HhBJS5/BUILD/mailutils-3.9/frm'
Making all in pop3d
make[2]: Entering directory '/tmp/B.HhBJS5/BUILD/mailutils-3.9/pop3d'
Making all in .
make[3]: Entering directory '/tmp/B.HhBJS5/BUILD/mailutils-3.9/pop3d'
x86_64-pld-linux-gcc -DHAVE_CONFIG_H -I. -I..  -I. -I../include -I../lib -I../lib/gnu -I../lib/gnu -I.. -I../include  -DSYSCONFDIR=\"/etc\"  -O2 -fwrapv -pipe -Wformat -Werror=format-security -gdwarf-4 -fno-debug-types-section -fvar-tracking-assignments -g2 -Wp,-D_FORTIFY_SOURCE=2 -fstack-protector-strong --param=ssp-buffer-size=4 -Werror=trampolines -fPIC -march=x86-64 -gdwarf-4 -fno-debug-types-section -fvar-tracking-assignments -g2  -Wall -Wdeclaration-after-statement -MT popauth.o -MD -MP -MF .deps/popauth.Tpo -c -o popauth.o popauth.c
popauth.c: In function 'action_create':
popauth.c:481:3: warning: ignoring return value of 'setuid' declared with attribute 'warn_unused_result' [-Wunused-result]
  481 |   setuid (getuid ());
      |   ^~~~~~~~~~~~~~~~~~
mv -f .deps/popauth.Tpo .deps/popauth.Po
/bin/sh ../libtool  --tag=CC   --mode=link x86_64-pld-linux-gcc  -O2 -fwrapv -pipe -Wformat -Werror=format-security -gdwarf-4 -fno-debug-types-section -fvar-tracking-assignments -g2 -Wp,-D_FORTIFY_SOURCE=2 -fstack-protector-strong --param=ssp-buffer-size=4 -Werror=trampolines -fPIC -march=x86-64 -gdwarf-4 -fno-debug-types-section -fvar-tracking-assignments -g2  -Wall -Wdeclaration-after-statement  -Wl,--as-needed -Wl,--no-copy-dt-needed-entries -Wl,-z,relro -Wl,-z,combreloc  -o popauth popauth.o ../lib/libmuaux.la ../libmailutils/libmailutils.la   ../libmu_dbm/libmu_dbm.la -ldb -ldb -lcrypt  -lpthread
libtool: link: x86_64-pld-linux-gcc -O2 -fwrapv -pipe -Wformat -Werror=format-security -gdwarf-4 -fno-debug-types-section -fvar-tracking-assignments -g2 -Wp,-D_FORTIFY_SOURCE=2 -fstack-protector-strong --param=ssp-buffer-size=4 -Werror=trampolines -fPIC -march=x86-64 -gdwarf-4 -fno-debug-types-section -fvar-tracking-assignments -g2 -Wall -Wdeclaration-after-statement -Wl,--as-needed -Wl,--no-copy-dt-needed-entries -Wl,-z -Wl,relro -Wl,-z -Wl,combreloc -o .libs/popauth popauth.o  ../lib/.libs/libmuaux.so ../libmailutils/.libs/libmailutils.so ../libmu_dbm/.libs/libmu_dbm.so -L/usr/lib64 /tmp/B.HhBJS5/BUILD/mailutils-3.9/libmailutils/.libs/libmailutils.so -lgsasl /usr/lib64/libgnutls.so -lp11-kit /usr/lib64/libidn2.so /usr/lib64/libunistring.so /usr/lib64/libtasn1.so -lnettle -lhogweed /usr/lib64/libgmp.so /usr/lib64/libldap.so /usr/lib64/liblber.so /usr/lib64/libsasl2.so /usr/lib64/libgssapi.so /usr/lib64/libheimntlm.so /usr/lib64/libkrb5.so /usr/lib64/libhx509.so /usr/lib64/libwind.so /usr/lib64/libsqlite3.so -lm -lz /usr/lib64/libhcrypto.so /usr/lib64/libheimbase.so /usr/lib64/libasn1.so /usr/lib64/libroken.so -lresolv -lcom_err -lssl -lcrypto /usr/lib64/libpam.so /usr/lib64/libaudit.so /usr/lib64/libcap-ng.so -ldl /usr/lib64/libdb-5.3.so -lcrypt -lpthread -pthread
x86_64-pld-linux-gcc -DHAVE_CONFIG_H -I. -I..  -I. -I../include -I../lib -I../lib/gnu -I../lib/gnu -I.. -I../include  -DSYSCONFDIR=\"/etc\"  -O2 -fwrapv -pipe -Wformat -Werror=format-security -gdwarf-4 -fno-debug-types-section -fvar-tracking-assignments -g2 -Wp,-D_FORTIFY_SOURCE=2 -fstack-protector-strong --param=ssp-buffer-size=4 -Werror=trampolines -fPIC -march=x86-64 -gdwarf-4 -fno-debug-types-section -fvar-tracking-assignments -g2  -Wall -Wdeclaration-after-statement -MT apop.o -MD -MP -MF .deps/apop.Tpo -c -o apop.o apop.c
mv -f .deps/apop.Tpo .deps/apop.Po
x86_64-pld-linux-gcc -DHAVE_CONFIG_H -I. -I..  -I. -I../include -I../lib -I../lib/gnu -I../lib/gnu -I.. -I../include  -DSYSCONFDIR=\"/etc\"  -O2 -fwrapv -pipe -Wformat -Werror=format-security -gdwarf-4 -fno-debug-types-section -fvar-tracking-assignments -g2 -Wp,-D_FORTIFY_SOURCE=2 -fstack-protector-strong --param=ssp-buffer-size=4 -Werror=trampolines -fPIC -march=x86-64 -gdwarf-4 -fno-debug-types-section -fvar-tracking-assignments -g2  -Wall -Wdeclaration-after-statement -MT auth.o -MD -MP -MF .deps/auth.Tpo -c -o auth.o auth.c
mv -f .deps/auth.Tpo .deps/auth.Po
x86_64-pld-linux-gcc -DHAVE_CONFIG_H -I. -I..  -I. -I../include -I../lib -I../lib/gnu -I../lib/gnu -I.. -I../include  -DSYSCONFDIR=\"/etc\"  -O2 -fwrapv -pipe -Wformat -Werror=format-security -gdwarf-4 -fno-debug-types-section -fvar-tracking-assignments -g2 -Wp,-D_FORTIFY_SOURCE=2 -fstack-protector-strong --param=ssp-buffer-size=4 -Werror=trampolines -fPIC -march=x86-64 -gdwarf-4 -fno-debug-types-section -fvar-tracking-assignments -g2  -Wall -Wdeclaration-after-statement -MT bulletin.o -MD -MP -MF .deps/bulletin.Tpo -c -o bulletin.o bulletin.c
mv -f .deps/bulletin.Tpo .deps/bulletin.Po
x86_64-pld-linux-gcc -DHAVE_CONFIG_H -I. -I..  -I. -I../include -I../lib -I../lib/gnu -I../lib/gnu -I.. -I../include  -DSYSCONFDIR=\"/etc\"  -O2 -fwrapv -pipe -Wformat -Werror=format-security -gdwarf-4 -fno-debug-types-section -fvar-tracking-assignments -g2 -Wp,-D_FORTIFY_SOURCE=2 -fstack-protector-strong --param=ssp-buffer-size=4 -Werror=trampolines -fPIC -march=x86-64 -gdwarf-4 -fno-debug-types-section -fvar-tracking-assignments -g2  -Wall -Wdeclaration-after-statement -MT capa.o -MD -MP -MF .deps/capa.Tpo -c -o capa.o capa.c
mv -f .deps/capa.Tpo .deps/capa.Po
x86_64-pld-linux-gcc -DHAVE_CONFIG_H -I. -I..  -I. -I../include -I../lib -I../lib/gnu -I../lib/gnu -I.. -I../include  -DSYSCONFDIR=\"/etc\"  -O2 -fwrapv -pipe -Wformat -Werror=format-security -gdwarf-4 -fno-debug-types-section -fvar-tracking-assignments -g2 -Wp,-D_FORTIFY_SOURCE=2 -fstack-protector-strong --param=ssp-buffer-size=4 -Werror=trampolines -fPIC -march=x86-64 -gdwarf-4 -fno-debug-types-section -fvar-tracking-assignments -g2  -Wall -Wdeclaration-after-statement -MT cmd.o -MD -MP -MF .deps/cmd.Tpo -c -o cmd.o cmd.c
mv -f .deps/cmd.Tpo .deps/cmd.Po
x86_64-pld-linux-gcc -DHAVE_CONFIG_H -I. -I..  -I. -I../include -I../lib -I../lib/gnu -I../lib/gnu -I.. -I../include  -DSYSCONFDIR=\"/etc\"  -O2 -fwrapv -pipe -Wformat -Werror=format-security -gdwarf-4 -fno-debug-types-section -fvar-tracking-assignments -g2 -Wp,-D_FORTIFY_SOURCE=2 -fstack-protector-strong --param=ssp-buffer-size=4 -Werror=trampolines -fPIC -march=x86-64 -gdwarf-4 -fno-debug-types-section -fvar-tracking-assignments -g2  -Wall -Wdeclaration-after-statement -MT dele.o -MD -MP -MF .deps/dele.Tpo -c -o dele.o dele.c
mv -f .deps/dele.Tpo .deps/dele.Po
x86_64-pld-linux-gcc -DHAVE_CONFIG_H -I. -I..  -I. -I../include -I../lib -I../lib/gnu -I../lib/gnu -I.. -I../include  -DSYSCONFDIR=\"/etc\"  -O2 -fwrapv -pipe -Wformat -Werror=format-security -gdwarf-4 -fno-debug-types-section -fvar-tracking-assignments -g2 -Wp,-D_FORTIFY_SOURCE=2 -fstack-protector-strong --param=ssp-buffer-size=4 -Werror=trampolines -fPIC -march=x86-64 -gdwarf-4 -fno-debug-types-section -fvar-tracking-assignments -g2  -Wall -Wdeclaration-after-statement -MT expire.o -MD -MP -MF .deps/expire.Tpo -c -o expire.o expire.c
mv -f .deps/expire.Tpo .deps/expire.Po
x86_64-pld-linux-gcc -DHAVE_CONFIG_H -I. -I..  -I. -I../include -I../lib -I../lib/gnu -I../lib/gnu -I.. -I../include  -DSYSCONFDIR=\"/etc\"  -O2 -fwrapv -pipe -Wformat -Werror=format-security -gdwarf-4 -fno-debug-types-section -fvar-tracking-assignments -g2 -Wp,-D_FORTIFY_SOURCE=2 -fstack-protector-strong --param=ssp-buffer-size=4 -Werror=trampolines -fPIC -march=x86-64 -gdwarf-4 -fno-debug-types-section -fvar-tracking-assignments -g2  -Wall -Wdeclaration-after-statement -MT extra.o -MD -MP -MF .deps/extra.Tpo -c -o extra.o extra.c
mv -f .deps/extra.Tpo .deps/extra.Po
x86_64-pld-linux-gcc -DHAVE_CONFIG_H -I. -I..  -I. -I../include -I../lib -I../lib/gnu -I../lib/gnu -I.. -I../include  -DSYSCONFDIR=\"/etc\"  -O2 -fwrapv -pipe -Wformat -Werror=format-security -gdwarf-4 -fno-debug-types-section -fvar-tracking-assignments -g2 -Wp,-D_FORTIFY_SOURCE=2 -fstack-protector-strong --param=ssp-buffer-size=4 -Werror=trampolines -fPIC -march=x86-64 -gdwarf-4 -fno-debug-types-section -fvar-tracking-assignments -g2  -Wall -Wdeclaration-after-statement -MT list.o -MD -MP -MF .deps/list.Tpo -c -o list.o list.c
mv -f .deps/list.Tpo .deps/list.Po
x86_64-pld-linux-gcc -DHAVE_CONFIG_H -I. -I..  -I. -I../include -I../lib -I../lib/gnu -I../lib/gnu -I.. -I../include  -DSYSCONFDIR=\"/etc\"  -O2 -fwrapv -pipe -Wformat -Werror=format-security -gdwarf-4 -fno-debug-types-section -fvar-tracking-assignments -g2 -Wp,-D_FORTIFY_SOURCE=2 -fstack-protector-strong --param=ssp-buffer-size=4 -Werror=trampolines -fPIC -march=x86-64 -gdwarf-4 -fno-debug-types-section -fvar-tracking-assignments -g2  -Wall -Wdeclaration-after-statement -MT logindelay.o -MD -MP -MF .deps/logindelay.Tpo -c -o logindelay.o logindelay.c
mv -f .deps/logindelay.Tpo .deps/logindelay.Po
x86_64-pld-linux-gcc -DHAVE_CONFIG_H -I. -I..  -I. -I../include -I../lib -I../lib/gnu -I../lib/gnu -I.. -I../include  -DSYSCONFDIR=\"/etc\"  -O2 -fwrapv -pipe -Wformat -Werror=format-security -gdwarf-4 -fno-debug-types-section -fvar-tracking-assignments -g2 -Wp,-D_FORTIFY_SOURCE=2 -fstack-protector-strong --param=ssp-buffer-size=4 -Werror=trampolines -fPIC -march=x86-64 -gdwarf-4 -fno-debug-types-section -fvar-tracking-assignments -g2  -Wall -Wdeclaration-after-statement -MT noop.o -MD -MP -MF .deps/noop.Tpo -c -o noop.o noop.c
mv -f .deps/noop.Tpo .deps/noop.Po
x86_64-pld-linux-gcc -DHAVE_CONFIG_H -I. -I..  -I. -I../include -I../lib -I../lib/gnu -I../lib/gnu -I.. -I../include  -DSYSCONFDIR=\"/etc\"  -O2 -fwrapv -pipe -Wformat -Werror=format-security -gdwarf-4 -fno-debug-types-section -fvar-tracking-assignments -g2 -Wp,-D_FORTIFY_SOURCE=2 -fstack-protector-strong --param=ssp-buffer-size=4 -Werror=trampolines -fPIC -march=x86-64 -gdwarf-4 -fno-debug-types-section -fvar-tracking-assignments -g2  -Wall -Wdeclaration-after-statement -MT pop3d.o -MD -MP -MF .deps/pop3d.Tpo -c -o pop3d.o pop3d.c
pop3d.c: In function 'main':
pop3d.c:564:7: warning: ignoring return value of 'chdir' declared with attribute 'warn_unused_result' [-Wunused-result]
  564 |       chdir ("/");
      |       ^~~~~~~~~~~
mv -f .deps/pop3d.Tpo .deps/pop3d.Po
x86_64-pld-linux-gcc -DHAVE_CONFIG_H -I. -I..  -I. -I../include -I../lib -I../lib/gnu -I../lib/gnu -I.. -I../include  -DSYSCONFDIR=\"/etc\"  -O2 -fwrapv -pipe -Wformat -Werror=format-security -gdwarf-4 -fno-debug-types-section -fvar-tracking-assignments -g2 -Wp,-D_FORTIFY_SOURCE=2 -fstack-protector-strong --param=ssp-buffer-size=4 -Werror=trampolines -fPIC -march=x86-64 -gdwarf-4 -fno-debug-types-section -fvar-tracking-assignments -g2  -Wall -Wdeclaration-after-statement -MT quit.o -MD -MP -MF .deps/quit.Tpo -c -o quit.o quit.c
mv -f .deps/quit.Tpo .deps/quit.Po
x86_64-pld-linux-gcc -DHAVE_CONFIG_H -I. -I..  -I. -I../include -I../lib -I../lib/gnu -I../lib/gnu -I.. -I../include  -DSYSCONFDIR=\"/etc\"  -O2 -fwrapv -pipe -Wformat -Werror=format-security -gdwarf-4 -fno-debug-types-section -fvar-tracking-assignments -g2 -Wp,-D_FORTIFY_SOURCE=2 -fstack-protector-strong --param=ssp-buffer-size=4 -Werror=trampolines -fPIC -march=x86-64 -gdwarf-4 -fno-debug-types-section -fvar-tracking-assignments -g2  -Wall -Wdeclaration-after-statement -MT retr.o -MD -MP -MF .deps/retr.Tpo -c -o retr.o retr.c
mv -f .deps/retr.Tpo .deps/retr.Po
x86_64-pld-linux-gcc -DHAVE_CONFIG_H -I. -I..  -I. -I../include -I../lib -I../lib/gnu -I../lib/gnu -I.. -I../include  -DSYSCONFDIR=\"/etc\"  -O2 -fwrapv -pipe -Wformat -Werror=format-security -gdwarf-4 -fno-debug-types-section -fvar-tracking-assignments -g2 -Wp,-D_FORTIFY_SOURCE=2 -fstack-protector-strong --param=ssp-buffer-size=4 -Werror=trampolines -fPIC -march=x86-64 -gdwarf-4 -fno-debug-types-section -fvar-tracking-assignments -g2  -Wall -Wdeclaration-after-statement -MT rset.o -MD -MP -MF .deps/rset.Tpo -c -o rset.o rset.c
mv -f .deps/rset.Tpo .deps/rset.Po
x86_64-pld-linux-gcc -DHAVE_CONFIG_H -I. -I..  -I. -I../include -I../lib -I../lib/gnu -I../lib/gnu -I.. -I../include  -DSYSCONFDIR=\"/etc\"  -O2 -fwrapv -pipe -Wformat -Werror=format-security -gdwarf-4 -fno-debug-types-section -fvar-tracking-assignments -g2 -Wp,-D_FORTIFY_SOURCE=2 -fstack-protector-strong --param=ssp-buffer-size=4 -Werror=trampolines -fPIC -march=x86-64 -gdwarf-4 -fno-debug-types-section -fvar-tracking-assignments -g2  -Wall -Wdeclaration-after-statement -MT signal.o -MD -MP -MF .deps/signal.Tpo -c -o signal.o signal.c
mv -f .deps/signal.Tpo .deps/signal.Po
x86_64-pld-linux-gcc -DHAVE_CONFIG_H -I. -I..  -I. -I../include -I../lib -I../lib/gnu -I../lib/gnu -I.. -I../include  -DSYSCONFDIR=\"/etc\"  -O2 -fwrapv -pipe -Wformat -Werror=format-security -gdwarf-4 -fno-debug-types-section -fvar-tracking-assignments -g2 -Wp,-D_FORTIFY_SOURCE=2 -fstack-protector-strong --param=ssp-buffer-size=4 -Werror=trampolines -fPIC -march=x86-64 -gdwarf-4 -fno-debug-types-section -fvar-tracking-assignments -g2  -Wall -Wdeclaration-after-statement -MT stat.o -MD -MP -MF .deps/stat.Tpo -c -o stat.o stat.c
mv -f .deps/stat.Tpo .deps/stat.Po
x86_64-pld-linux-gcc -DHAVE_CONFIG_H -I. -I..  -I. -I../include -I../lib -I../lib/gnu -I../lib/gnu -I.. -I../include  -DSYSCONFDIR=\"/etc\"  -O2 -fwrapv -pipe -Wformat -Werror=format-security -gdwarf-4 -fno-debug-types-section -fvar-tracking-assignments -g2 -Wp,-D_FORTIFY_SOURCE=2 -fstack-protector-strong --param=ssp-buffer-size=4 -Werror=trampolines -fPIC -march=x86-64 -gdwarf-4 -fno-debug-types-section -fvar-tracking-assignments -g2  -Wall -Wdeclaration-after-statement -MT stls.o -MD -MP -MF .deps/stls.Tpo -c -o stls.o stls.c
mv -f .deps/stls.Tpo .deps/stls.Po
x86_64-pld-linux-gcc -DHAVE_CONFIG_H -I. -I..  -I. -I../include -I../lib -I../lib/gnu -I../lib/gnu -I.. -I../include  -DSYSCONFDIR=\"/etc\"  -O2 -fwrapv -pipe -Wformat -Werror=format-security -gdwarf-4 -fno-debug-types-section -fvar-tracking-assignments -g2 -Wp,-D_FORTIFY_SOURCE=2 -fstack-protector-strong --param=ssp-buffer-size=4 -Werror=trampolines -fPIC -march=x86-64 -gdwarf-4 -fno-debug-types-section -fvar-tracking-assignments -g2  -Wall -Wdeclaration-after-statement -MT top.o -MD -MP -MF .deps/top.Tpo -c -o top.o top.c
mv -f .deps/top.Tpo .deps/top.Po
x86_64-pld-linux-gcc -DHAVE_CONFIG_H -I. -I..  -I. -I../include -I../lib -I../lib/gnu -I../lib/gnu -I.. -I../include  -DSYSCONFDIR=\"/etc\"  -O2 -fwrapv -pipe -Wformat -Werror=format-security -gdwarf-4 -fno-debug-types-section -fvar-tracking-assignments -g2 -Wp,-D_FORTIFY_SOURCE=2 -fstack-protector-strong --param=ssp-buffer-size=4 -Werror=trampolines -fPIC -march=x86-64 -gdwarf-4 -fno-debug-types-section -fvar-tracking-assignments -g2  -Wall -Wdeclaration-after-statement -MT uidl.o -MD -MP -MF .deps/uidl.Tpo -c -o uidl.o uidl.c
mv -f .deps/uidl.Tpo .deps/uidl.Po
x86_64-pld-linux-gcc -DHAVE_CONFIG_H -I. -I..  -I. -I../include -I../lib -I../lib/gnu -I../lib/gnu -I.. -I../include  -DSYSCONFDIR=\"/etc\"  -O2 -fwrapv -pipe -Wformat -Werror=format-security -gdwarf-4 -fno-debug-types-section -fvar-tracking-assignments -g2 -Wp,-D_FORTIFY_SOURCE=2 -fstack-protector-strong --param=ssp-buffer-size=4 -Werror=trampolines -fPIC -march=x86-64 -gdwarf-4 -fno-debug-types-section -fvar-tracking-assignments -g2  -Wall -Wdeclaration-after-statement -MT user.o -MD -MP -MF .deps/user.Tpo -c -o user.o user.c
user.c: In function 'pop3d_begin_session':
user.c:41:5: warning: ignoring return value of 'setuid' declared with attribute 'warn_unused_result' [-Wunused-result]
   41 |     setuid (auth_data->uid);
      |     ^~~~~~~~~~~~~~~~~~~~~~~
mv -f .deps/user.Tpo .deps/user.Po
/bin/sh ../libtool  --tag=CC   --mode=link x86_64-pld-linux-gcc  -O2 -fwrapv -pipe -Wformat -Werror=format-security -gdwarf-4 -fno-debug-types-section -fvar-tracking-assignments -g2 -Wp,-D_FORTIFY_SOURCE=2 -fstack-protector-strong --param=ssp-buffer-size=4 -Werror=trampolines -fPIC -march=x86-64 -gdwarf-4 -fno-debug-types-section -fvar-tracking-assignments -g2  -Wall -Wdeclaration-after-statement  -Wl,--as-needed -Wl,--no-copy-dt-needed-entries -Wl,-z,relro -Wl,-z,combreloc  -o pop3d apop.o auth.o bulletin.o capa.o cmd.o dele.o expire.o extra.o list.o logindelay.o noop.o pop3d.o quit.o retr.o rset.o signal.o stat.o stls.o top.o uidl.o user.o ../lib/libmuaux.la ../libproto/mbox/libmu_mbox.la  ../libproto/mh/libmu_mh.la ../libproto/maildir/libmu_maildir.la ../libproto/dotmail/libmu_dotmail.la ../libmu_auth/libmu_auth.la -lgsasl -lgnutls  -lldap -lpam -ldl ../libmailutils/libmailutils.la   ../libmu_dbm/libmu_dbm.la -ldb -ldb ../lib/libmutcpwrap.a  -lwrap -lcrypt  -lpthread
libtool: link: x86_64-pld-linux-gcc -O2 -fwrapv -pipe -Wformat -Werror=format-security -gdwarf-4 -fno-debug-types-section -fvar-tracking-assignments -g2 -Wp,-D_FORTIFY_SOURCE=2 -fstack-protector-strong --param=ssp-buffer-size=4 -Werror=trampolines -fPIC -march=x86-64 -gdwarf-4 -fno-debug-types-section -fvar-tracking-assignments -g2 -Wall -Wdeclaration-after-statement -Wl,--as-needed -Wl,--no-copy-dt-needed-entries -Wl,-z -Wl,relro -Wl,-z -Wl,combreloc -o .libs/pop3d apop.o auth.o bulletin.o capa.o cmd.o dele.o expire.o extra.o list.o logindelay.o noop.o pop3d.o quit.o retr.o rset.o signal.o stat.o stls.o top.o uidl.o user.o  ../lib/.libs/libmuaux.so ../libproto/mbox/.libs/libmu_mbox.so ../libproto/mh/.libs/libmu_mh.so ../libproto/maildir/.libs/libmu_maildir.so ../libproto/dotmail/.libs/libmu_dotmail.so ../libmu_auth/.libs/libmu_auth.so -L/usr/lib64 -lmysqlclient -lpq /usr/lib64/libodbc.so /usr/lib64/libltdl.so ../libmailutils/.libs/libmailutils.so ../libmu_dbm/.libs/libmu_dbm.so /tmp/B.HhBJS5/BUILD/mailutils-3.9/libmailutils/.libs/libmailutils.so -lgsasl /usr/lib64/libgnutls.so -lp11-kit /usr/lib64/libidn2.so /usr/lib64/libunistring.so /usr/lib64/libtasn1.so -lnettle -lhogweed /usr/lib64/libgmp.so /usr/lib64/libldap.so /usr/lib64/liblber.so /usr/lib64/libsasl2.so /usr/lib64/libgssapi.so /usr/lib64/libheimntlm.so /usr/lib64/libkrb5.so /usr/lib64/libhx509.so /usr/lib64/libwind.so /usr/lib64/libsqlite3.so -lm -lz /usr/lib64/libhcrypto.so /usr/lib64/libheimbase.so /usr/lib64/libasn1.so /usr/lib64/libroken.so -lresolv -lcom_err -lssl -lcrypto /usr/lib64/libpam.so /usr/lib64/libaudit.so /usr/lib64/libcap-ng.so -ldl /usr/lib64/libdb-5.3.so ../lib/libmutcpwrap.a /usr/lib64/libwrap.so -lcrypt -lpthread -pthread
/usr/bin/ld: ../lib/libmutcpwrap.a(tcpwrap.o):/tmp/B.HhBJS5/BUILD/mailutils-3.9/lib/tcpwrap.h:20: multiple definition of `mu_tcp_wrapper_daemon'; pop3d.o:/tmp/B.HhBJS5/BUILD/mailutils-3.9/pop3d/../lib/tcpwrap.h:20: first defined here
collect2: error: ld returned 1 exit status
make[3]: *** [Makefile:1232: pop3d] Error 1
make[3]: Leaving directory '/tmp/B.HhBJS5/BUILD/mailutils-3.9/pop3d'
make[2]: *** [Makefile:1353: all-recursive] Error 1
make[2]: Leaving directory '/tmp/B.HhBJS5/BUILD/mailutils-3.9/pop3d'
make[1]: *** [Makefile:1179: all-recursive] Error 1
make[1]: Leaving directory '/tmp/B.HhBJS5/BUILD/mailutils-3.9'
make: *** [Makefile:1064: all] Error 2
error: Bad exit status from /tmp/B.HhBJS5/BUILD/tmp/rpm-tmp.23088 (%build)


RPM build errors:
    Bad exit status from /tmp/B.HhBJS5/BUILD/tmp/rpm-tmp.23088 (%build)
ended at: Tue Jun  2 09:38:58 2020, done in 0:05:31.596769
error: No files produced.
+ chmod -R u+rwX /tmp/B.HhBJS5/BUILD
+ rm -rf /tmp/B.HhBJS5/tmp /tmp/B.HhBJS5/BUILD
+ rm -rf /tmp/B.HhBJS5
Begin-PLD-Builder-Info
Build-Time: user:206.80s sys:54.16s real:334.99s (faults io:57 non-io:30184765)

End-PLD-Builder-Info
[Back to list of logs] [View rpm -qa of builder]