FailedOk

th/SRPMS[OK]
th/x32[OK]
th/i686[OK]
th/x86_64[OK]

ac/SRPMS[OK]
ac/i386[OK]
ac/i586[OK]
ac/i686[OK]
ac/alpha[OK]
ac/amd64[OK]
ac/athlon[OK]
ac/ppc[OK]
ac/sparc[OK]
ac/sparc64[OK]

Advanced Search
main()
Powered by PLD Linux
(c) 2002-2020 PLD Team
$Revision: 1.37 $
Powered by six Cray XMT Supercomputers.
Your IP: 54.236.35.159

mbrowse 34c4aa16-1f41-4a8d-82ae-c933c70690d5

Status:Failed
Source URL:https://buildlogs.pld-linux.org/pld/th/x86_64/FAIL/mbrowse,34c4aa16-1f41-4a8d-82ae-c933c70690d5.bz2
text/plain URL:View!
rpm -qa of builder:View!
Date:2020/10/08 21:10:33
Runtime:0:00:04.847210

Toc:

  • prep
  • Executing(%prep): /bin/sh -e /tmp/B.6M_ceO/BUILD/tmp/rpm-tmp.67289
  • build
  • Executing(%build): /bin/sh -e /tmp/B.6M_ceO/BUILD/tmp/rpm-tmp.67289
  • error 1
  • collect2: error: ld returned 1 exit status
  • error 2
  • make[2]: *** [Makefile:356: mbrowse] Error 1
  • error 3
  • make[1]: *** [Makefile:357: all-recursive] Error 1
  • error 4
  • error: Bad exit status from /tmp/B.6M_ceO/BUILD/tmp/rpm-tmp.67289 (%build)
  • error 5
  • RPM build errors:
  • error 6
  • error: No files produced.

Content:

request from: qboosh
checking if we should skip the build
started at: Thu Oct  8 21:10:25 2020
killing old processes on a builder
sending signal 9 to pid -1
Killed
cleaning up /tmp
fetching https://srcbuilder.pld-linux.org/th//srpms/34c4aa16-1f41-4a8d-82ae-c933c70690d5/mbrowse-0.3.1-9.src.rpm
fetched 114119 bytes, 413.2 K/s
installing srpm: mbrowse-0.3.1-9.src.rpm
+ install -d /tmp/B.6M_ceO/BUILD /tmp/B.6M_ceO/RPMS
+ LC_ALL=en_US.UTF-8
+ rpm -qp --changelog mbrowse-0.3.1-9.src.rpm
* Thu Oct 08 2020 PLD Linux Team <feedback@pld-linux.org>
- For complete changelog see: http://git.pld-linux.org/?p=packages/mbrowse.git;a=log;h=master
* Mon Oct 05 2020 Jan Rękorajski <baggins@pld-linux.org> 26f8eef
- release 9 (by relup.sh) + rpm -Uhv --nodeps --define '_topdir /tmp/B.6M_ceO' --define '_specdir %{_topdir}' --define '_sourcedir %{_specdir}' --define '_rpmdir %{_topdir}/RPMS' --define '_builddir %{_topdir}/BUILD' mbrowse-0.3.1-9.src.rpm Preparing... ################################################## mbrowse ################################################## + rm -f mbrowse-0.3.1-9.src.rpm + install -m 700 -d /tmp/B.6M_ceO/BUILD/tmp + TMPDIR=/tmp/B.6M_ceO/BUILD/tmp + exec nice -n 0 rpmbuild -bp --short-circuit --nodeps --define '_topdir /tmp/B.6M_ceO' --define '_specdir %{_topdir}' --define '_sourcedir %{_specdir}' --define '_rpmdir %{_topdir}/RPMS' --define '_builddir %{_topdir}/BUILD' --target x86_64-pld-linux --define 'prep exit 0' /tmp/B.6M_ceO/mbrowse.spec Building target platforms: x86_64-pld-linux checking BuildConflict-ing packages no BuildConflicts found checking BR rpm: Building target platforms: x86_64-pld-linux no BR needed building RPM using: set -ex; : build-id: 34c4aa16-1f41-4a8d-82ae-c933c70690d5; TMPDIR=/tmp/B.6M_ceO/BUILD/tmp exec nice -n 0 rpmbuild -bb --define '_smp_mflags -j9' --define '_make_opts -Otarget' --define '_pld_builder 1' --define '_topdir /tmp/B.6M_ceO' --define '_specdir %{_topdir}' --define '_sourcedir %{_specdir}' --define '_rpmdir %{_topdir}/RPMS' --define '_builddir %{_topdir}/BUILD' --target x86_64-pld-linux /tmp/B.6M_ceO/mbrowse.spec + : build-id: 34c4aa16-1f41-4a8d-82ae-c933c70690d5 + TMPDIR=/tmp/B.6M_ceO/BUILD/tmp + exec nice -n 0 rpmbuild -bb --define '_smp_mflags -j9' --define '_make_opts -Otarget' --define '_pld_builder 1' --define '_topdir /tmp/B.6M_ceO' --define '_specdir %{_topdir}' --define '_sourcedir %{_specdir}' --define '_rpmdir %{_topdir}/RPMS' --define '_builddir %{_topdir}/BUILD' --target x86_64-pld-linux /tmp/B.6M_ceO/mbrowse.spec Building target platforms: x86_64-pld-linux Executing(%prep): /bin/sh -e /tmp/B.6M_ceO/BUILD/tmp/rpm-tmp.67289 + umask 022 + cd /tmp/B.6M_ceO/BUILD + cd /tmp/B.6M_ceO/BUILD + rm -rf mbrowse-0.3.1 + /bin/gzip -dc /tmp/B.6M_ceO/mbrowse-0.3.1.tar.gz + /bin/tar -xf - + STATUS=0 + '[' 0 -ne 0 ']' + cd mbrowse-0.3.1 + /bin/id -u + '[' 1000 '=' 0 ']' + /bin/id -u + '[' 1000 '=' 0 ']' + /bin/chmod -Rf a+rX,u+w,g-w,o-w . + echo 'Patch #0 (mbrowse-ac_fixes.patch):' Patch #0 (mbrowse-ac_fixes.patch): + '[' -f /tmp/B.6M_ceO/mbrowse-ac_fixes.patch ']' + /bin/cat /tmp/B.6M_ceO/mbrowse-ac_fixes.patch + /usr/bin/patch -s -p1 + echo 'Patch #1 (mbrowse-gcc.patch):' Patch #1 (mbrowse-gcc.patch): + '[' -f /tmp/B.6M_ceO/mbrowse-gcc.patch ']' + /bin/cat /tmp/B.6M_ceO/mbrowse-gcc.patch + /usr/bin/patch -s -p1 + exit 0 Executing(%build): /bin/sh -e /tmp/B.6M_ceO/BUILD/tmp/rpm-tmp.67289 TMP=/home/users/builder/tmp HOME=/home/users/builder PATH=/home/users/builder/GNUstep/Tools:/bin:/usr/bin:/usr/local/bin:/home/users/builder/bin TMPDIR=/tmp/B.6M_ceO/BUILD/tmp + umask 022 + cd /tmp/B.6M_ceO/BUILD + cd mbrowse-0.3.1 + aclocal aclocal: warning: autoconf input should be named 'configure.ac', not 'configure.in' acinclude.m4:20: warning: underquoted definition of AM_PATH_NETSNMP acinclude.m4:20: run info Automake 'Extending aclocal' acinclude.m4:20: or see https://www.gnu.org/software/automake/manual/automake.html#Extending-aclocal + autoconf + autoheader autoheader: WARNING: Using auxiliary files such as `acconfig.h', `config.h.bot' autoheader: WARNING: and `config.h.top', to define templates for `config.h.in' autoheader: WARNING: is deprecated and discouraged. autoheader: autoheader: WARNING: Using the third argument of `AC_DEFINE' and autoheader: WARNING: `AC_DEFINE_UNQUOTED' allows one to define a template without autoheader: WARNING: `acconfig.h': autoheader: autoheader: WARNING: AC_DEFINE([NEED_FUNC_MAIN], 1, autoheader: [Define if a function `main' is needed.]) autoheader: autoheader: WARNING: More sophisticated templates can also be produced, see the autoheader: WARNING: documentation. + automake -a -c -f --foreign automake: warning: autoconf input should be named 'configure.ac', not 'configure.in' configure.in:4: warning: AM_INIT_AUTOMAKE: two- and three-arguments forms are deprecated. For more info, see: configure.in:4: https://www.gnu.org/software/automake/manual/automake.html#Modernize-AM_005fINIT_005fAUTOMAKE-invocation configure.in:7: installing './compile' src/Makefile.am:2: warning: 'INCLUDES' is the old name for 'AM_CPPFLAGS' (or '*_CPPFLAGS') automake: warning: autoconf input should be named 'configure.ac', not 'configure.in' + ./configure 'LDFLAGS=-Wl,--as-needed -Wl,--no-copy-dt-needed-entries -Wl,-z,relro -Wl,-z,combreloc ' 'CFLAGS=-O2 -fwrapv -pipe -Wformat -Werror=format-security -gdwarf-4 -fno-debug-types-section -fvar-tracking-assignments -g2 -Wp,-D_FORTIFY_SOURCE=2 -fstack-protector-strong --param=ssp-buffer-size=4 -Werror=trampolines -fPIC -march=x86-64 -gdwarf-4 -fno-debug-types-section -fvar-tracking-assignments -g2 ' 'CXXFLAGS=-O2 -fwrapv -pipe -Wformat -Werror=format-security -gdwarf-4 -fno-debug-types-section -fvar-tracking-assignments -g2 -Wp,-D_FORTIFY_SOURCE=2 -fstack-protector-strong --param=ssp-buffer-size=4 -Werror=trampolines -fPIC -march=x86-64 -gdwarf-4 -fno-debug-types-section -fvar-tracking-assignments -g2 ' 'FFLAGS=-O2 -fwrapv -pipe -Wformat -Werror=format-security -gdwarf-4 -fno-debug-types-section -fvar-tracking-assignments -g2 -Wp,-D_FORTIFY_SOURCE=2 -fstack-protector-strong --param=ssp-buffer-size=4 -Werror=trampolines -fPIC -march=x86-64 -gdwarf-4 -fno-debug-types-section -fvar-tracking-assignments -g2 ' 'FCFLAGS=-O2 -fwrapv -pipe -Wformat -Werror=format-security -gdwarf-4 -fno-debug-types-section -fvar-tracking-assignments -g2 -Wp,-D_FORTIFY_SOURCE=2 -fstack-protector-strong --param=ssp-buffer-size=4 -Werror=trampolines -fPIC -march=x86-64 -gdwarf-4 -fno-debug-types-section -fvar-tracking-assignments -g2 ' 'CPPFLAGS=' 'CC=x86_64-pld-linux-gcc' 'CXX=x86_64-pld-linux-g++' '--host=x86_64-pld-linux' '--build=x86_64-pld-linux' '--prefix=/usr' '--exec-prefix=/usr' '--bindir=/usr/bin' '--sbindir=/usr/sbin' '--sysconfdir=/etc' '--datadir=/usr/share' '--includedir=/usr/include' '--libdir=/usr/lib64' '--libexecdir=/usr/libexec' '--localstatedir=/var' '--sharedstatedir=/var/lib' '--mandir=/usr/share/man' '--infodir=/usr/share/info' '--x-libraries=/usr/lib64' '--with-snmp-lib=/usr/lib64' checking for a BSD-compatible install... /usr/bin/install -c checking whether build environment is sane... yes checking for a thread-safe mkdir -p... /bin/mkdir -p checking for mawk... mawk checking whether make sets $(MAKE)... yes checking whether make supports nested variables... yes checking whether make supports the include directive... yes (GNU style) checking for x86_64-pld-linux-gcc... x86_64-pld-linux-gcc checking whether the C compiler works... yes checking for C compiler default output file name... a.out checking for suffix of executables... checking whether we are cross compiling... no checking for suffix of object files... o checking whether we are using the GNU C compiler... yes checking whether x86_64-pld-linux-gcc accepts -g... yes checking for x86_64-pld-linux-gcc option to accept ISO C89... none needed checking whether x86_64-pld-linux-gcc understands -c and -o together... yes checking dependency style of x86_64-pld-linux-gcc... gcc3 checking for library containing strerror... none required checking for x86_64-pld-linux-gcc... (cached) x86_64-pld-linux-gcc checking whether we are using the GNU C compiler... (cached) yes checking whether x86_64-pld-linux-gcc accepts -g... (cached) yes checking for x86_64-pld-linux-gcc option to accept ISO C89... (cached) none needed checking whether x86_64-pld-linux-gcc understands -c and -o together... (cached) yes checking dependency style of x86_64-pld-linux-gcc... (cached) gcc3 checking for x86_64-pld-linux-gcc... (cached) x86_64-pld-linux-gcc checking whether we are using the GNU C compiler... (cached) yes checking whether x86_64-pld-linux-gcc accepts -g... (cached) yes checking for x86_64-pld-linux-gcc option to accept ISO C89... (cached) none needed checking whether x86_64-pld-linux-gcc understands -c and -o together... (cached) yes checking dependency style of x86_64-pld-linux-gcc... (cached) gcc3 checking how to run the C preprocessor... x86_64-pld-linux-gcc -E checking for grep that handles long lines and -e... /bin/grep checking for egrep... /bin/grep -E checking for ANSI C header files... yes checking for snmp-type... net checking for net-snmp >= v4.2... yes checking for bprintf in -lsnmp... no checking for gtk-config... /usr/bin/gtk-config checking for GTK - version >= 1.2.0... yes checking that generated files are newer than configure... done configure: creating ./config.status config.status: creating Makefile config.status: creating src/Makefile config.status: creating config.h config.status: executing depfiles commands + /usr/bin/make -Otarget -j9 /usr/bin/make all-recursive Making all in src make[2]: Entering directory '/tmp/B.6M_ceO/BUILD/mbrowse-0.3.1/src' x86_64-pld-linux-gcc -DHAVE_CONFIG_H -I. -I.. -I/usr/include/gtk-1.2 -I/usr/include/glib-1.2 -I/usr/lib64/glib/include -I/usr/include -DHAVE_NETSNMP -O2 -fwrapv -pipe -Wformat -Werror=format-security -gdwarf-4 -fno-debug-types-section -fvar-tracking-assignments -g2 -Wp,-D_FORTIFY_SOURCE=2 -fstack-protector-strong --param=ssp-buffer-size=4 -Werror=trampolines -fPIC -march=x86-64 -gdwarf-4 -fno-debug-types-section -fvar-tracking-assignments -g2 -Wall -MT main.o -MD -MP -MF .deps/main.Tpo -c -o main.o main.c mv -f .deps/main.Tpo .deps/main.Po make[2]: Leaving directory '/tmp/B.6M_ceO/BUILD/mbrowse-0.3.1/src' make[2]: Entering directory '/tmp/B.6M_ceO/BUILD/mbrowse-0.3.1/src' x86_64-pld-linux-gcc -DHAVE_CONFIG_H -I. -I.. -I/usr/include/gtk-1.2 -I/usr/include/glib-1.2 -I/usr/lib64/glib/include -I/usr/include -DHAVE_NETSNMP -O2 -fwrapv -pipe -Wformat -Werror=format-security -gdwarf-4 -fno-debug-types-section -fvar-tracking-assignments -g2 -Wp,-D_FORTIFY_SOURCE=2 -fstack-protector-strong --param=ssp-buffer-size=4 -Werror=trampolines -fPIC -march=x86-64 -gdwarf-4 -fno-debug-types-section -fvar-tracking-assignments -g2 -Wall -MT callbacks.o -MD -MP -MF .deps/callbacks.Tpo -c -o callbacks.o callbacks.c callbacks.c: In function 'on_get_butt_clicked': callbacks.c:113:19: warning: variable 'mwid' set but not used [-Wunused-but-set-variable] 113 | main_widgets_t *mwid; | ^~~~ callbacks.c: In function 'on_walk_butt_clicked': callbacks.c:134:19: warning: variable 'mwid' set but not used [-Wunused-but-set-variable] 134 | main_widgets_t *mwid; | ^~~~ callbacks.c: In function 'on_set_butt_clicked': callbacks.c:179:19: warning: variable 'mwid' set but not used [-Wunused-but-set-variable] 179 | main_widgets_t *mwid; | ^~~~ callbacks.c: In function 'oid_entry_changed': callbacks.c:258:17: warning: variable 'selection' set but not used [-Wunused-but-set-variable] 258 | GtkCTreeNode *selection = NULL; | ^~~~~~~~~ mv -f .deps/callbacks.Tpo .deps/callbacks.Po make[2]: Leaving directory '/tmp/B.6M_ceO/BUILD/mbrowse-0.3.1/src' make[2]: Entering directory '/tmp/B.6M_ceO/BUILD/mbrowse-0.3.1/src' x86_64-pld-linux-gcc -DHAVE_CONFIG_H -I. -I.. -I/usr/include/gtk-1.2 -I/usr/include/glib-1.2 -I/usr/lib64/glib/include -I/usr/include -DHAVE_NETSNMP -O2 -fwrapv -pipe -Wformat -Werror=format-security -gdwarf-4 -fno-debug-types-section -fvar-tracking-assignments -g2 -Wp,-D_FORTIFY_SOURCE=2 -fstack-protector-strong --param=ssp-buffer-size=4 -Werror=trampolines -fPIC -march=x86-64 -gdwarf-4 -fno-debug-types-section -fvar-tracking-assignments -g2 -Wall -MT search.o -MD -MP -MF .deps/search.Tpo -c -o search.o search.c mv -f .deps/search.Tpo .deps/search.Po make[2]: Leaving directory '/tmp/B.6M_ceO/BUILD/mbrowse-0.3.1/src' make[2]: Entering directory '/tmp/B.6M_ceO/BUILD/mbrowse-0.3.1/src' x86_64-pld-linux-gcc -DHAVE_CONFIG_H -I. -I.. -I/usr/include/gtk-1.2 -I/usr/include/glib-1.2 -I/usr/lib64/glib/include -I/usr/include -DHAVE_NETSNMP -O2 -fwrapv -pipe -Wformat -Werror=format-security -gdwarf-4 -fno-debug-types-section -fvar-tracking-assignments -g2 -Wp,-D_FORTIFY_SOURCE=2 -fstack-protector-strong --param=ssp-buffer-size=4 -Werror=trampolines -fPIC -march=x86-64 -gdwarf-4 -fno-debug-types-section -fvar-tracking-assignments -g2 -Wall -MT mibtree.o -MD -MP -MF .deps/mibtree.Tpo -c -o mibtree.o mibtree.c mv -f .deps/mibtree.Tpo .deps/mibtree.Po make[2]: Leaving directory '/tmp/B.6M_ceO/BUILD/mbrowse-0.3.1/src' make[2]: Entering directory '/tmp/B.6M_ceO/BUILD/mbrowse-0.3.1/src' x86_64-pld-linux-gcc -DHAVE_CONFIG_H -I. -I.. -I/usr/include/gtk-1.2 -I/usr/include/glib-1.2 -I/usr/lib64/glib/include -I/usr/include -DHAVE_NETSNMP -O2 -fwrapv -pipe -Wformat -Werror=format-security -gdwarf-4 -fno-debug-types-section -fvar-tracking-assignments -g2 -Wp,-D_FORTIFY_SOURCE=2 -fstack-protector-strong --param=ssp-buffer-size=4 -Werror=trampolines -fPIC -march=x86-64 -gdwarf-4 -fno-debug-types-section -fvar-tracking-assignments -g2 -Wall -MT details.o -MD -MP -MF .deps/details.Tpo -c -o details.o details.c mv -f .deps/details.Tpo .deps/details.Po make[2]: Leaving directory '/tmp/B.6M_ceO/BUILD/mbrowse-0.3.1/src' make[2]: Entering directory '/tmp/B.6M_ceO/BUILD/mbrowse-0.3.1/src' x86_64-pld-linux-gcc -DHAVE_CONFIG_H -I. -I.. -I/usr/include/gtk-1.2 -I/usr/include/glib-1.2 -I/usr/lib64/glib/include -I/usr/include -DHAVE_NETSNMP -O2 -fwrapv -pipe -Wformat -Werror=format-security -gdwarf-4 -fno-debug-types-section -fvar-tracking-assignments -g2 -Wp,-D_FORTIFY_SOURCE=2 -fstack-protector-strong --param=ssp-buffer-size=4 -Werror=trampolines -fPIC -march=x86-64 -gdwarf-4 -fno-debug-types-section -fvar-tracking-assignments -g2 -Wall -MT bookmarks.o -MD -MP -MF .deps/bookmarks.Tpo -c -o bookmarks.o bookmarks.c mv -f .deps/bookmarks.Tpo .deps/bookmarks.Po make[2]: Leaving directory '/tmp/B.6M_ceO/BUILD/mbrowse-0.3.1/src' make[2]: Entering directory '/tmp/B.6M_ceO/BUILD/mbrowse-0.3.1/src' x86_64-pld-linux-gcc -DHAVE_CONFIG_H -I. -I.. -I/usr/include/gtk-1.2 -I/usr/include/glib-1.2 -I/usr/lib64/glib/include -I/usr/include -DHAVE_NETSNMP -O2 -fwrapv -pipe -Wformat -Werror=format-security -gdwarf-4 -fno-debug-types-section -fvar-tracking-assignments -g2 -Wp,-D_FORTIFY_SOURCE=2 -fstack-protector-strong --param=ssp-buffer-size=4 -Werror=trampolines -fPIC -march=x86-64 -gdwarf-4 -fno-debug-types-section -fvar-tracking-assignments -g2 -Wall -MT snmpstuff.o -MD -MP -MF .deps/snmpstuff.Tpo -c -o snmpstuff.o snmpstuff.c snmpstuff.c: In function 'mbrowse_create_snmp_session': snmpstuff.c:66:3: warning: 'remote_port' is deprecated [-Wdeprecated-declarations] 66 | session->remote_port = config->snmp_port; | ^~~~~~~ In file included from /usr/include/net-snmp/definitions.h:22, from /usr/include/net-snmp/net-snmp-includes.h:24, from callbacks.h:7, from snmpstuff.c:25: /usr/include/net-snmp/types.h:307:21: note: declared here 307 | u_short remote_port NETSNMP_ATTRIBUTE_DEPRECATED; | ^~~~~~~~~~~ snmpstuff.c:69:26: warning: pointer targets in assignment from 'char *' to 'u_char *' {aka 'unsigned char *'} differ in signedness [-Wpointer-sign] 69 | session->community = get_writecomm(); | ^ snmpstuff.c:73:26: warning: pointer targets in assignment from 'char *' to 'u_char *' {aka 'unsigned char *'} differ in signedness [-Wpointer-sign] 73 | session->community = get_readcomm(); | ^ snmpstuff.c:76:42: warning: pointer targets in passing argument 1 of 'strlen' differ in signedness [-Wpointer-sign] 76 | session->community_len = strlen(session->community); | ~~~~~~~^~~~~~~~~~~ | | | u_char * {aka unsigned char *} In file included from snmpstuff.c:23: /usr/include/string.h:391:35: note: expected 'const char *' but argument is of type 'u_char *' {aka 'unsigned char *'} 391 | extern size_t strlen (const char *__s) | ~~~~~~~~~~~~^~~ snmpstuff.c: In function 'snmpget': snmpstuff.c:139:5: warning: this 'else' clause does not guard... [-Wmisleading-indentation] 139 | } else | ^~~~ snmpstuff.c:142:5: note: ...this statement, but the latter is misleadingly indented as if it were guarded by the 'else' 142 | status = snmp_synch_response(ss, pdu, &response); | ^~~~~~ mv -f .deps/snmpstuff.Tpo .deps/snmpstuff.Po make[2]: Leaving directory '/tmp/B.6M_ceO/BUILD/mbrowse-0.3.1/src' make[2]: Entering directory '/tmp/B.6M_ceO/BUILD/mbrowse-0.3.1/src' x86_64-pld-linux-gcc -DHAVE_CONFIG_H -I. -I.. -I/usr/include/gtk-1.2 -I/usr/include/glib-1.2 -I/usr/lib64/glib/include -I/usr/include -DHAVE_NETSNMP -O2 -fwrapv -pipe -Wformat -Werror=format-security -gdwarf-4 -fno-debug-types-section -fvar-tracking-assignments -g2 -Wp,-D_FORTIFY_SOURCE=2 -fstack-protector-strong --param=ssp-buffer-size=4 -Werror=trampolines -fPIC -march=x86-64 -gdwarf-4 -fno-debug-types-section -fvar-tracking-assignments -g2 -Wall -MT interface.o -MD -MP -MF .deps/interface.Tpo -c -o interface.o interface.c mv -f .deps/interface.Tpo .deps/interface.Po make[2]: Leaving directory '/tmp/B.6M_ceO/BUILD/mbrowse-0.3.1/src' make[2]: Entering directory '/tmp/B.6M_ceO/BUILD/mbrowse-0.3.1/src' x86_64-pld-linux-gcc -DHAVE_CONFIG_H -I. -I.. -I/usr/include/gtk-1.2 -I/usr/include/glib-1.2 -I/usr/lib64/glib/include -I/usr/include -DHAVE_NETSNMP -O2 -fwrapv -pipe -Wformat -Werror=format-security -gdwarf-4 -fno-debug-types-section -fvar-tracking-assignments -g2 -Wp,-D_FORTIFY_SOURCE=2 -fstack-protector-strong --param=ssp-buffer-size=4 -Werror=trampolines -fPIC -march=x86-64 -gdwarf-4 -fno-debug-types-section -fvar-tracking-assignments -g2 -Wall -MT configuration.o -MD -MP -MF .deps/configuration.Tpo -c -o configuration.o configuration.c configuration.c: In function 'set_expand_style': configuration.c:272:54: warning: cast from pointer to integer of different size [-Wpointer-to-int-cast] 272 | gtk_ctree_set_expander_style(GTK_CTREE(test_ctree),(int)data); | ^ configuration.c: In function 'set_line_style': configuration.c:281:21: warning: cast from pointer to integer of different size [-Wpointer-to-int-cast] 281 | config.tree_line =(int) data; | ^ configuration.c:282:50: warning: cast from pointer to integer of different size [-Wpointer-to-int-cast] 282 | gtk_ctree_set_line_style(GTK_CTREE(test_ctree),(int)data); | ^ configuration.c: In function 'set_snmp_version': configuration.c:288:21: warning: cast from pointer to integer of different size [-Wpointer-to-int-cast] 288 | config.snmp_ver = (int) data; | ^ In file included from /usr/include/string.h:519, from configuration.c:20: In function 'strncpy', inlined from 'load_config' at configuration.c:166:3: /usr/include/bits/string_fortified.h:106:10: warning: '__builtin_strncpy' specified bound 1023 equals destination size [-Wstringop-truncation] 106 | return __builtin___strncpy_chk (__dest, __src, __len, __bos (__dest)); | ^~~~~~~~~~~~~~~~~~~~~~~~~~~~~~~~~~~~~~~~~~~~~~~~~~~~~~~~~~~~~~ mv -f .deps/configuration.Tpo .deps/configuration.Po make[2]: Leaving directory '/tmp/B.6M_ceO/BUILD/mbrowse-0.3.1/src' make[2]: Entering directory '/tmp/B.6M_ceO/BUILD/mbrowse-0.3.1/src' x86_64-pld-linux-gcc -O2 -fwrapv -pipe -Wformat -Werror=format-security -gdwarf-4 -fno-debug-types-section -fvar-tracking-assignments -g2 -Wp,-D_FORTIFY_SOURCE=2 -fstack-protector-strong --param=ssp-buffer-size=4 -Werror=trampolines -fPIC -march=x86-64 -gdwarf-4 -fno-debug-types-section -fvar-tracking-assignments -g2 -Wall -o mbrowse main.o interface.o details.o callbacks.o snmpstuff.o bookmarks.o mibtree.o configuration.o search.o -lgtk -lgdk -rdynamic -lgmodule -lglib -ldl -lXi -lXext -lX11 -lm -L/usr/lib64 -lnetsnmp -lm -lcom_err -lkrb5 -lssh2 -lssl -lssl -lcrypto /usr/bin/ld: bookmarks.o:/tmp/B.6M_ceO/BUILD/mbrowse-0.3.1/src/bookmarks.c:35: multiple definition of `bookmark_items'; callbacks.o:/tmp/B.6M_ceO/BUILD/mbrowse-0.3.1/src/callbacks.c:36: first defined here collect2: error: ld returned 1 exit status make[2]: *** [Makefile:356: mbrowse] Error 1 make[2]: Leaving directory '/tmp/B.6M_ceO/BUILD/mbrowse-0.3.1/src' make[1]: *** [Makefile:357: all-recursive] Error 1 make: *** [Makefile:298: all] Error 2 error: Bad exit status from /tmp/B.6M_ceO/BUILD/tmp/rpm-tmp.67289 (%build) RPM build errors: Bad exit status from /tmp/B.6M_ceO/BUILD/tmp/rpm-tmp.67289 (%build) ended at: Thu Oct 8 21:10:33 2020, done in 0:00:04.847210 error: No files produced. + chmod -R u+rwX /tmp/B.6M_ceO/BUILD + rm -rf /tmp/B.6M_ceO/tmp /tmp/B.6M_ceO/BUILD + rm -rf /tmp/B.6M_ceO Begin-PLD-Builder-Info Build-Time: user:7.40s sys:0.84s real:8.17s (faults io:0 non-io:401334) End-PLD-Builder-Info
[Back to list of logs] [View rpm -qa of builder]