FailedOk

th/SRPMS[OK]
th/x32[OK]
th/i686[OK]
th/x86_64[OK]

ac/SRPMS[OK]
ac/i386[OK]
ac/i586[OK]
ac/i686[OK]
ac/alpha[OK]
ac/amd64[OK]
ac/athlon[OK]
ac/ppc[OK]
ac/sparc[OK]
ac/sparc64[OK]

Advanced Search
main()
Powered by PLD Linux
(c) 2002-2020 PLD Team
$Revision: 1.37 $
Powered by vim.
Your IP: 3.228.220.31

mongodb b247711f-2316-4c26-84f0-2822ed8bd083

Status:Failed
Source URL:https://buildlogs.pld-linux.org/pld/th/x86_64/FAIL/mongodb,b247711f-2316-4c26-84f0-2822ed8bd083.bz2
text/plain URL:View!
rpm -qa of builder:View!
Date:2020/08/01 11:03:18
Runtime:0:00:07.596659

Toc:

  • prep
  • Executing(%prep): /bin/sh -e /tmp/B.yAQ3c1/BUILD/tmp/rpm-tmp.37158
  • build
  • Executing(%build): /bin/sh -e /tmp/B.yAQ3c1/BUILD/tmp/rpm-tmp.37158
  • error 1
  • src/mongo/util/goodies.h:21:10: fatal error: boost/detail/endian.hpp: No such file or directory
  • error 2
  • compilation terminated.
  • error 3
  • src/mongo/util/goodies.h:21:10: fatal error: boost/detail/endian.hpp: No such file or directory
  • error 4
  • compilation terminated.
  • error 5
  • src/mongo/util/goodies.h:21:10: fatal error: boost/detail/endian.hpp: No such file or directory
  • error 6
  • compilation terminated.
  • error 7
  • src/mongo/util/goodies.h:21:10: fatal error: boost/detail/endian.hpp: No such file or directory
  • error 8
  • compilation terminated.
  • error 9
  • src/mongo/util/goodies.h:21:10: fatal error: boost/detail/endian.hpp: No such file or directory
  • error 10
  • compilation terminated.
  • error 11
  • src/mongo/util/goodies.h:21:10: fatal error: boost/detail/endian.hpp: No such file or directory
  • error 12
  • compilation terminated.
  • error 13
  • src/mongo/util/goodies.h:21:10: fatal error: boost/detail/endian.hpp: No such file or directory
  • error 14
  • compilation terminated.
  • error 15
  • src/mongo/util/goodies.h:21:10: fatal error: boost/detail/endian.hpp: No such file or directory
  • error 16
  • compilation terminated.
  • error 17
  • src/mongo/util/goodies.h:21:10: fatal error: boost/detail/endian.hpp: No such file or directory
  • error 18
  • compilation terminated.
  • error 19
  • error: Bad exit status from /tmp/B.yAQ3c1/BUILD/tmp/rpm-tmp.37158 (%build)
  • error 20
  • RPM build errors:
  • error 21
  • error: No files produced.

Content:

request from: baggins
checking if we should skip the build
started at: Sat Aug  1 11:03:06 2020
killing old processes on a builder
sending signal 9 to pid -1
Killed
cleaning up /tmp
fetching https://srcbuilder.pld-linux.org/th//srpms/b247711f-2316-4c26-84f0-2822ed8bd083/mongodb-2.2.4-11.src.rpm
fetched 10151659 bytes, 7875.7 K/s
installing srpm: mongodb-2.2.4-11.src.rpm
+ install -d /tmp/B.yAQ3c1/BUILD /tmp/B.yAQ3c1/RPMS
+ LC_ALL=en_US.UTF-8
+ rpm -qp --changelog mongodb-2.2.4-11.src.rpm
* Sat Aug 01 2020 PLD Linux Team <feedback@pld-linux.org>
- For complete changelog see: http://git.pld-linux.org/?p=packages/mongodb.git;a=log;h=master
* Mon Oct 07 2019 Jan Rękorajski <baggins@pld-linux.org> a39084e
- rebuild with boost 1.71 - release 11 (by relup.sh) + rpm -Uhv --nodeps --define '_topdir /tmp/B.yAQ3c1' --define '_specdir %{_topdir}' --define '_sourcedir %{_specdir}' --define '_rpmdir %{_topdir}/RPMS' --define '_builddir %{_topdir}/BUILD' mongodb-2.2.4-11.src.rpm Preparing... ################################################## mongodb ################################################## + rm -f mongodb-2.2.4-11.src.rpm + install -m 700 -d /tmp/B.yAQ3c1/BUILD/tmp + TMPDIR=/tmp/B.yAQ3c1/BUILD/tmp + exec nice -n 0 rpmbuild -bp --short-circuit --nodeps --define '_topdir /tmp/B.yAQ3c1' --define '_specdir %{_topdir}' --define '_sourcedir %{_specdir}' --define '_rpmdir %{_topdir}/RPMS' --define '_builddir %{_topdir}/BUILD' --target x86_64-pld-linux --define 'prep exit 0' /tmp/B.yAQ3c1/mongodb.spec Building target platforms: x86_64-pld-linux checking BuildConflict-ing packages no BuildConflicts found checking BR rpm: Building target platforms: x86_64-pld-linux no BR needed building RPM using: set -ex; : build-id: b247711f-2316-4c26-84f0-2822ed8bd083; TMPDIR=/tmp/B.yAQ3c1/BUILD/tmp exec nice -n 0 rpmbuild -bb --define '_smp_mflags -j9' --define '_make_opts -Otarget' --define '_pld_builder 1' --define '_topdir /tmp/B.yAQ3c1' --define '_specdir %{_topdir}' --define '_sourcedir %{_specdir}' --define '_rpmdir %{_topdir}/RPMS' --define '_builddir %{_topdir}/BUILD' --target x86_64-pld-linux /tmp/B.yAQ3c1/mongodb.spec + : build-id: b247711f-2316-4c26-84f0-2822ed8bd083 + TMPDIR=/tmp/B.yAQ3c1/BUILD/tmp + exec nice -n 0 rpmbuild -bb --define '_smp_mflags -j9' --define '_make_opts -Otarget' --define '_pld_builder 1' --define '_topdir /tmp/B.yAQ3c1' --define '_specdir %{_topdir}' --define '_sourcedir %{_specdir}' --define '_rpmdir %{_topdir}/RPMS' --define '_builddir %{_topdir}/BUILD' --target x86_64-pld-linux /tmp/B.yAQ3c1/mongodb.spec Building target platforms: x86_64-pld-linux Executing(%prep): /bin/sh -e /tmp/B.yAQ3c1/BUILD/tmp/rpm-tmp.37158 + umask 022 + cd /tmp/B.yAQ3c1/BUILD + cd /tmp/B.yAQ3c1/BUILD + rm -rf mongodb-src-r2.2.4 + /bin/gzip -dc /tmp/B.yAQ3c1/mongodb-src-r2.2.4.tar.gz + /bin/tar -xf - + STATUS=0 + '[' 0 -ne 0 ']' + cd mongodb-src-r2.2.4 + /bin/id -u + '[' 1000 '=' 0 ']' + /bin/id -u + '[' 1000 '=' 0 ']' + /bin/chmod -Rf a+rX,u+w,g-w,o-w . + echo 'Patch #0 (mongodb-cflags.patch):' Patch #0 (mongodb-cflags.patch): + '[' -f /tmp/B.yAQ3c1/mongodb-cflags.patch ']' + /bin/cat /tmp/B.yAQ3c1/mongodb-cflags.patch + /usr/bin/patch -s -p1 + echo 'Patch #1 (mongodb-system-libs.patch):' Patch #1 (mongodb-system-libs.patch): + '[' -f /tmp/B.yAQ3c1/mongodb-system-libs.patch ']' + /bin/cat /tmp/B.yAQ3c1/mongodb-system-libs.patch + /usr/bin/patch -s -p1 + echo 'Patch #2 (boost-1.50.patch):' Patch #2 (boost-1.50.patch): + '[' -f /tmp/B.yAQ3c1/boost-1.50.patch ']' + /bin/cat /tmp/B.yAQ3c1/boost-1.50.patch + /usr/bin/patch -s -p1 + echo 'Patch #3 (mongodb-install.patch):' Patch #3 (mongodb-install.patch): + '[' -f /tmp/B.yAQ3c1/mongodb-install.patch ']' + /bin/cat /tmp/B.yAQ3c1/mongodb-install.patch + /usr/bin/patch -s -p1 + echo 'Patch #4 (mongodb-shared.patch):' Patch #4 (mongodb-shared.patch): + '[' -f /tmp/B.yAQ3c1/mongodb-shared.patch ']' + /bin/cat /tmp/B.yAQ3c1/mongodb-shared.patch + /usr/bin/patch -s -p1 + echo 'Patch #5 (gcc4.patch):' Patch #5 (gcc4.patch): + '[' -f /tmp/B.yAQ3c1/gcc4.patch ']' + /bin/cat /tmp/B.yAQ3c1/gcc4.patch + /usr/bin/patch -s -p1 + echo 'Patch #6 (no-Werror.patch):' Patch #6 (no-Werror.patch): + '[' -f /tmp/B.yAQ3c1/no-Werror.patch ']' + /bin/cat /tmp/B.yAQ3c1/no-Werror.patch + /usr/bin/patch -s -p1 + echo 'Patch #7 (gcc6.patch):' Patch #7 (gcc6.patch): + '[' -f /tmp/B.yAQ3c1/gcc6.patch ']' + /bin/cat /tmp/B.yAQ3c1/gcc6.patch + /usr/bin/patch -s -p1 + echo 'Patch #8 (mongodb-pcap.patch):' Patch #8 (mongodb-pcap.patch): + '[' -f /tmp/B.yAQ3c1/mongodb-pcap.patch ']' + /bin/cat /tmp/B.yAQ3c1/mongodb-pcap.patch + /usr/bin/patch -s -p1 + find -type f -executable + xargs chmod a-x + /bin/rm '--interactive=never' -r src/third_party/js-1.7 src/third_party/pcre-8.30 src/third_party/snappy src/third_party/boost + exit 0 Executing(%build): /bin/sh -e /tmp/B.yAQ3c1/BUILD/tmp/rpm-tmp.37158 TMP=/home/users/builder/tmp HOME=/home/users/builder PATH=/home/users/builder/GNUstep/Tools:/bin:/usr/bin:/usr/local/bin:/home/users/builder/bin TMPDIR=/tmp/B.yAQ3c1/BUILD/tmp + umask 022 + cd /tmp/B.yAQ3c1/BUILD + cd mongodb-src-r2.2.4 + /usr/bin/scons -j9 'LDFLAGS=-Wl,--as-needed -Wl,--no-copy-dt-needed-entries -Wl,-z,relro -Wl,-z,combreloc ' 'CFLAGS=-O2 -fwrapv -pipe -Wformat -Werror=format-security -gdwarf-4 -fno-debug-types-section -fvar-tracking-assignments -g2 -Wp,-D_FORTIFY_SOURCE=2 -fstack-protector-strong --param=ssp-buffer-size=4 -Werror=trampolines -fPIC -march=x86-64 -gdwarf-4 -fno-debug-types-section -fvar-tracking-assignments -g2 ' 'CXXFLAGS=-O2 -fwrapv -pipe -Wformat -Werror=format-security -gdwarf-4 -fno-debug-types-section -fvar-tracking-assignments -g2 -Wp,-D_FORTIFY_SOURCE=2 -fstack-protector-strong --param=ssp-buffer-size=4 -Werror=trampolines -fPIC -march=x86-64 -gdwarf-4 -fno-debug-types-section -fvar-tracking-assignments -g2 ' 'FFLAGS=-O2 -fwrapv -pipe -Wformat -Werror=format-security -gdwarf-4 -fno-debug-types-section -fvar-tracking-assignments -g2 -Wp,-D_FORTIFY_SOURCE=2 -fstack-protector-strong --param=ssp-buffer-size=4 -Werror=trampolines -fPIC -march=x86-64 -gdwarf-4 -fno-debug-types-section -fvar-tracking-assignments -g2 ' 'CPPFLAGS=' 'CC=x86_64-pld-linux-gcc' 'CXX=x86_64-pld-linux-g++' 'libsuffix=lib64' 'prefix=/usr' 'CPPFLAGS= -DXP_UNIX' '--use-system-all=yes' '--extralib=pcrecpp,pcre,snappy' '--prefix=/tmp/B.yAQ3c1/BUILD/tmp/mongodb-2.2.4-root-builder/usr' '--full=all' --sharedclient --usev8 '--cxx=x86_64-pld-linux-g++' scons: Reading SConscript files ... Mkdir(".scons/Linux/nohost") scons version: 3.1.2 python version: 2 7 18 'final' 0 Checking whether the C++ compiler works... yes Checking for C++ header file boost/filesystem/operations.hpp... yes Checking for C++ library boost_thread-mt... no Checking for C++ library boost_thread... yes Checking for C++ library boost_filesystem-mt... no Checking for C++ library boost_filesystem... yes Checking for C++ library boost_program_options-mt... no Checking for C++ library boost_program_options... yes Checking for C++ library boost_system-mt... no Checking for C++ library boost_system... yes Checking for C header file unistd.h... yes Checking whether clock_gettime is declared... yes Checking for C library rt... yes Checking for C++ header file execinfo.h... yes Checking whether backtrace is declared... yes Checking whether backtrace_symbols is declared... yes Checking for C library pcap... yes Checking for C library v8... yes Checking for C library tcmalloc... yes scons: done reading SConscript files. scons: Building targets ... x86_64-pld-linux-g++ -o build/linux2/cxx_x86_64-pld-linux-g++/extralib_pcrecpp_pcre_snappy/use-system-all/usev8/mongo/db/db.o -c -Wnon-virtual-dtor -Woverloaded-virtual -fPIC -fno-strict-aliasing -ggdb -pthread -Wall -Wsign-compare -Wno-unknown-pragmas -Winvalid-pch -pipe -fno-builtin-memcmp -O2 -fwrapv -pipe -Wformat -Werror=format-security -gdwarf-4 -fno-debug-types-section -fvar-tracking-assignments -g2 -Wp,-D_FORTIFY_SOURCE=2 -fstack-protector-strong --param=ssp-buffer-size=4 -Werror=trampolines -fPIC -march=x86-64 -gdwarf-4 -fno-debug-types-section -fvar-tracking-assignments -g2 -D_SCONS -DMONGO_EXPOSE_MACROS -DSUPPORT_UTF8 -D_FILE_OFFSET_BITS=64 -DXP_UNIX -DMONGO_HAVE_HEADER_UNISTD_H -DMONGO_HAVE_EXECINFO_BACKTRACE -Ibuild/linux2/cxx_x86_64-pld-linux-g++/extralib_pcrecpp_pcre_snappy/use-system-all/usev8 -Isrc -Ibuild/linux2/cxx_x86_64-pld-linux-g++/extralib_pcrecpp_pcre_snappy/use-system-all/usev8/mongo -Isrc/mongo -I/tmp/B.yAQ3c1/BUILD/v8/include src/mongo/db/db.cpp x86_64-pld-linux-g++ -o build/linux2/cxx_x86_64-pld-linux-g++/extralib_pcrecpp_pcre_snappy/use-system-all/usev8/mongo/db/compact.o -c -Wnon-virtual-dtor -Woverloaded-virtual -fPIC -fno-strict-aliasing -ggdb -pthread -Wall -Wsign-compare -Wno-unknown-pragmas -Winvalid-pch -pipe -fno-builtin-memcmp -O2 -fwrapv -pipe -Wformat -Werror=format-security -gdwarf-4 -fno-debug-types-section -fvar-tracking-assignments -g2 -Wp,-D_FORTIFY_SOURCE=2 -fstack-protector-strong --param=ssp-buffer-size=4 -Werror=trampolines -fPIC -march=x86-64 -gdwarf-4 -fno-debug-types-section -fvar-tracking-assignments -g2 -D_SCONS -DMONGO_EXPOSE_MACROS -DSUPPORT_UTF8 -D_FILE_OFFSET_BITS=64 -DXP_UNIX -DMONGO_HAVE_HEADER_UNISTD_H -DMONGO_HAVE_EXECINFO_BACKTRACE -Ibuild/linux2/cxx_x86_64-pld-linux-g++/extralib_pcrecpp_pcre_snappy/use-system-all/usev8 -Isrc -Ibuild/linux2/cxx_x86_64-pld-linux-g++/extralib_pcrecpp_pcre_snappy/use-system-all/usev8/mongo -Isrc/mongo -I/tmp/B.yAQ3c1/BUILD/v8/include src/mongo/db/compact.cpp x86_64-pld-linux-g++ -o build/linux2/cxx_x86_64-pld-linux-g++/extralib_pcrecpp_pcre_snappy/use-system-all/usev8/mongo/db/commands/touch.o -c -Wnon-virtual-dtor -Woverloaded-virtual -fPIC -fno-strict-aliasing -ggdb -pthread -Wall -Wsign-compare -Wno-unknown-pragmas -Winvalid-pch -pipe -fno-builtin-memcmp -O2 -fwrapv -pipe -Wformat -Werror=format-security -gdwarf-4 -fno-debug-types-section -fvar-tracking-assignments -g2 -Wp,-D_FORTIFY_SOURCE=2 -fstack-protector-strong --param=ssp-buffer-size=4 -Werror=trampolines -fPIC -march=x86-64 -gdwarf-4 -fno-debug-types-section -fvar-tracking-assignments -g2 -D_SCONS -DMONGO_EXPOSE_MACROS -DSUPPORT_UTF8 -D_FILE_OFFSET_BITS=64 -DXP_UNIX -DMONGO_HAVE_HEADER_UNISTD_H -DMONGO_HAVE_EXECINFO_BACKTRACE -Ibuild/linux2/cxx_x86_64-pld-linux-g++/extralib_pcrecpp_pcre_snappy/use-system-all/usev8 -Isrc -Ibuild/linux2/cxx_x86_64-pld-linux-g++/extralib_pcrecpp_pcre_snappy/use-system-all/usev8/mongo -Isrc/mongo -I/tmp/B.yAQ3c1/BUILD/v8/include src/mongo/db/commands/touch.cpp x86_64-pld-linux-g++ -o build/linux2/cxx_x86_64-pld-linux-g++/extralib_pcrecpp_pcre_snappy/use-system-all/usev8/mongo/bson/oid.o -c -Wnon-virtual-dtor -Woverloaded-virtual -fPIC -fno-strict-aliasing -ggdb -pthread -Wall -Wsign-compare -Wno-unknown-pragmas -Winvalid-pch -pipe -fno-builtin-memcmp -O2 -fwrapv -pipe -Wformat -Werror=format-security -gdwarf-4 -fno-debug-types-section -fvar-tracking-assignments -g2 -Wp,-D_FORTIFY_SOURCE=2 -fstack-protector-strong --param=ssp-buffer-size=4 -Werror=trampolines -fPIC -march=x86-64 -gdwarf-4 -fno-debug-types-section -fvar-tracking-assignments -g2 -D_SCONS -DMONGO_EXPOSE_MACROS -DSUPPORT_UTF8 -D_FILE_OFFSET_BITS=64 -DXP_UNIX -DMONGO_HAVE_HEADER_UNISTD_H -DMONGO_HAVE_EXECINFO_BACKTRACE -Ibuild/linux2/cxx_x86_64-pld-linux-g++/extralib_pcrecpp_pcre_snappy/use-system-all/usev8 -Isrc -Ibuild/linux2/cxx_x86_64-pld-linux-g++/extralib_pcrecpp_pcre_snappy/use-system-all/usev8/mongo -Isrc/mongo -I/tmp/B.yAQ3c1/BUILD/v8/include src/mongo/bson/oid.cpp x86_64-pld-linux-g++ -o build/linux2/cxx_x86_64-pld-linux-g++/extralib_pcrecpp_pcre_snappy/use-system-all/usev8/mongo/db/nonce.o -c -Wnon-virtual-dtor -Woverloaded-virtual -fPIC -fno-strict-aliasing -ggdb -pthread -Wall -Wsign-compare -Wno-unknown-pragmas -Winvalid-pch -pipe -fno-builtin-memcmp -O2 -fwrapv -pipe -Wformat -Werror=format-security -gdwarf-4 -fno-debug-types-section -fvar-tracking-assignments -g2 -Wp,-D_FORTIFY_SOURCE=2 -fstack-protector-strong --param=ssp-buffer-size=4 -Werror=trampolines -fPIC -march=x86-64 -gdwarf-4 -fno-debug-types-section -fvar-tracking-assignments -g2 -D_SCONS -DMONGO_EXPOSE_MACROS -DSUPPORT_UTF8 -D_FILE_OFFSET_BITS=64 -DXP_UNIX -DMONGO_HAVE_HEADER_UNISTD_H -DMONGO_HAVE_EXECINFO_BACKTRACE -Ibuild/linux2/cxx_x86_64-pld-linux-g++/extralib_pcrecpp_pcre_snappy/use-system-all/usev8 -Isrc -Ibuild/linux2/cxx_x86_64-pld-linux-g++/extralib_pcrecpp_pcre_snappy/use-system-all/usev8/mongo -Isrc/mongo -I/tmp/B.yAQ3c1/BUILD/v8/include src/mongo/db/nonce.cpp x86_64-pld-linux-g++ -o build/linux2/cxx_x86_64-pld-linux-g++/extralib_pcrecpp_pcre_snappy/use-system-all/usev8/mongo/db/jsobj.o -c -Wnon-virtual-dtor -Woverloaded-virtual -fPIC -fno-strict-aliasing -ggdb -pthread -Wall -Wsign-compare -Wno-unknown-pragmas -Winvalid-pch -pipe -fno-builtin-memcmp -O2 -fwrapv -pipe -Wformat -Werror=format-security -gdwarf-4 -fno-debug-types-section -fvar-tracking-assignments -g2 -Wp,-D_FORTIFY_SOURCE=2 -fstack-protector-strong --param=ssp-buffer-size=4 -Werror=trampolines -fPIC -march=x86-64 -gdwarf-4 -fno-debug-types-section -fvar-tracking-assignments -g2 -D_SCONS -DMONGO_EXPOSE_MACROS -DSUPPORT_UTF8 -D_FILE_OFFSET_BITS=64 -DXP_UNIX -DMONGO_HAVE_HEADER_UNISTD_H -DMONGO_HAVE_EXECINFO_BACKTRACE -Ibuild/linux2/cxx_x86_64-pld-linux-g++/extralib_pcrecpp_pcre_snappy/use-system-all/usev8 -Isrc -Ibuild/linux2/cxx_x86_64-pld-linux-g++/extralib_pcrecpp_pcre_snappy/use-system-all/usev8/mongo -Isrc/mongo -I/tmp/B.yAQ3c1/BUILD/v8/include src/mongo/db/jsobj.cpp x86_64-pld-linux-g++ -o build/linux2/cxx_x86_64-pld-linux-g++/extralib_pcrecpp_pcre_snappy/use-system-all/usev8/mongo/db/json.o -c -Wnon-virtual-dtor -Woverloaded-virtual -fPIC -fno-strict-aliasing -ggdb -pthread -Wall -Wsign-compare -Wno-unknown-pragmas -Winvalid-pch -pipe -fno-builtin-memcmp -O2 -fwrapv -pipe -Wformat -Werror=format-security -gdwarf-4 -fno-debug-types-section -fvar-tracking-assignments -g2 -Wp,-D_FORTIFY_SOURCE=2 -fstack-protector-strong --param=ssp-buffer-size=4 -Werror=trampolines -fPIC -march=x86-64 -gdwarf-4 -fno-debug-types-section -fvar-tracking-assignments -g2 -D_SCONS -DMONGO_EXPOSE_MACROS -DSUPPORT_UTF8 -D_FILE_OFFSET_BITS=64 -DXP_UNIX -DMONGO_HAVE_HEADER_UNISTD_H -DMONGO_HAVE_EXECINFO_BACKTRACE -Ibuild/linux2/cxx_x86_64-pld-linux-g++/extralib_pcrecpp_pcre_snappy/use-system-all/usev8 -Isrc -Ibuild/linux2/cxx_x86_64-pld-linux-g++/extralib_pcrecpp_pcre_snappy/use-system-all/usev8/mongo -Isrc/mongo -I/tmp/B.yAQ3c1/BUILD/v8/include src/mongo/db/json.cpp x86_64-pld-linux-g++ -o build/linux2/cxx_x86_64-pld-linux-g++/extralib_pcrecpp_pcre_snappy/use-system-all/usev8/mongo/scripting/bson_template_evaluator.o -c -Wnon-virtual-dtor -Woverloaded-virtual -fPIC -fno-strict-aliasing -ggdb -pthread -Wall -Wsign-compare -Wno-unknown-pragmas -Winvalid-pch -pipe -fno-builtin-memcmp -O2 -fwrapv -pipe -Wformat -Werror=format-security -gdwarf-4 -fno-debug-types-section -fvar-tracking-assignments -g2 -Wp,-D_FORTIFY_SOURCE=2 -fstack-protector-strong --param=ssp-buffer-size=4 -Werror=trampolines -fPIC -march=x86-64 -gdwarf-4 -fno-debug-types-section -fvar-tracking-assignments -g2 -D_SCONS -DMONGO_EXPOSE_MACROS -DSUPPORT_UTF8 -D_FILE_OFFSET_BITS=64 -DXP_UNIX -DMONGO_HAVE_HEADER_UNISTD_H -DMONGO_HAVE_EXECINFO_BACKTRACE -Ibuild/linux2/cxx_x86_64-pld-linux-g++/extralib_pcrecpp_pcre_snappy/use-system-all/usev8 -Isrc -Ibuild/linux2/cxx_x86_64-pld-linux-g++/extralib_pcrecpp_pcre_snappy/use-system-all/usev8/mongo -Isrc/mongo -I/tmp/B.yAQ3c1/BUILD/v8/include src/mongo/scripting/bson_template_evaluator.cpp x86_64-pld-linux-g++ -o build/linux2/cxx_x86_64-pld-linux-g++/extralib_pcrecpp_pcre_snappy/use-system-all/usev8/mongo/client/authentication_table_server.o -c -Wnon-virtual-dtor -Woverloaded-virtual -fPIC -fno-strict-aliasing -ggdb -pthread -Wall -Wsign-compare -Wno-unknown-pragmas -Winvalid-pch -pipe -fno-builtin-memcmp -O2 -fwrapv -pipe -Wformat -Werror=format-security -gdwarf-4 -fno-debug-types-section -fvar-tracking-assignments -g2 -Wp,-D_FORTIFY_SOURCE=2 -fstack-protector-strong --param=ssp-buffer-size=4 -Werror=trampolines -fPIC -march=x86-64 -gdwarf-4 -fno-debug-types-section -fvar-tracking-assignments -g2 -D_SCONS -DMONGO_EXPOSE_MACROS -DSUPPORT_UTF8 -D_FILE_OFFSET_BITS=64 -DXP_UNIX -DMONGO_HAVE_HEADER_UNISTD_H -DMONGO_HAVE_EXECINFO_BACKTRACE -Ibuild/linux2/cxx_x86_64-pld-linux-g++/extralib_pcrecpp_pcre_snappy/use-system-all/usev8 -Isrc -Ibuild/linux2/cxx_x86_64-pld-linux-g++/extralib_pcrecpp_pcre_snappy/use-system-all/usev8/mongo -Isrc/mongo -I/tmp/B.yAQ3c1/BUILD/v8/include src/mongo/client/authentication_table_server.cpp In file included from src/mongo/pch.h:78, from src/mongo/db/db.cpp:19: src/mongo/util/goodies.h:21:10: fatal error: boost/detail/endian.hpp: No such file or directory 21 | #include <boost/detail/endian.hpp> | ^~~~~~~~~~~~~~~~~~~~~~~~~ compilation terminated. scons: *** [build/linux2/cxx_x86_64-pld-linux-g++/extralib_pcrecpp_pcre_snappy/use-system-all/usev8/mongo/db/db.o] Error 1 In file included from src/mongo/pch.h:78, from src/mongo/db/compact.cpp:21: src/mongo/util/goodies.h:21:10: fatal error: boost/detail/endian.hpp: No such file or directory 21 | #include <boost/detail/endian.hpp> | ^~~~~~~~~~~~~~~~~~~~~~~~~ compilation terminated. scons: *** [build/linux2/cxx_x86_64-pld-linux-g++/extralib_pcrecpp_pcre_snappy/use-system-all/usev8/mongo/db/compact.o] Error 1 In file included from src/mongo/pch.h:78, from src/mongo/db/commands/touch.cpp:21: src/mongo/util/goodies.h:21:10: fatal error: boost/detail/endian.hpp: No such file or directory 21 | #include <boost/detail/endian.hpp> | ^~~~~~~~~~~~~~~~~~~~~~~~~ compilation terminated. scons: *** [build/linux2/cxx_x86_64-pld-linux-g++/extralib_pcrecpp_pcre_snappy/use-system-all/usev8/mongo/db/commands/touch.o] Error 1 In file included from src/mongo/pch.h:78, from src/mongo/bson/oid.cpp:18: src/mongo/util/goodies.h:21:10: fatal error: boost/detail/endian.hpp: No such file or directory 21 | #include <boost/detail/endian.hpp> | ^~~~~~~~~~~~~~~~~~~~~~~~~ compilation terminated. scons: *** [build/linux2/cxx_x86_64-pld-linux-g++/extralib_pcrecpp_pcre_snappy/use-system-all/usev8/mongo/bson/oid.o] Error 1 In file included from src/mongo/pch.h:78, from src/mongo/db/nonce.cpp:18: src/mongo/util/goodies.h:21:10: fatal error: boost/detail/endian.hpp: No such file or directory 21 | #include <boost/detail/endian.hpp> | ^~~~~~~~~~~~~~~~~~~~~~~~~ compilation terminated. scons: *** [build/linux2/cxx_x86_64-pld-linux-g++/extralib_pcrecpp_pcre_snappy/use-system-all/usev8/mongo/db/nonce.o] Error 1 In file included from src/mongo/pch.h:78, from src/mongo/db/jsobj.cpp:20: src/mongo/util/goodies.h:21:10: fatal error: boost/detail/endian.hpp: No such file or directory 21 | #include <boost/detail/endian.hpp> | ^~~~~~~~~~~~~~~~~~~~~~~~~ compilation terminated. scons: *** [build/linux2/cxx_x86_64-pld-linux-g++/extralib_pcrecpp_pcre_snappy/use-system-all/usev8/mongo/db/jsobj.o] Error 1 In file included from src/mongo/pch.h:78, from src/mongo/db/json.cpp:19: src/mongo/util/goodies.h:21:10: fatal error: boost/detail/endian.hpp: No such file or directory 21 | #include <boost/detail/endian.hpp> | ^~~~~~~~~~~~~~~~~~~~~~~~~ compilation terminated. scons: *** [build/linux2/cxx_x86_64-pld-linux-g++/extralib_pcrecpp_pcre_snappy/use-system-all/usev8/mongo/db/json.o] Error 1 In file included from src/mongo/pch.h:78, from src/mongo/db/jsobj.h:31, from src/mongo/scripting/bson_template_evaluator.h:42, from src/mongo/scripting/bson_template_evaluator.cpp:19: src/mongo/util/goodies.h:21:10: fatal error: boost/detail/endian.hpp: No such file or directory 21 | #include <boost/detail/endian.hpp> | ^~~~~~~~~~~~~~~~~~~~~~~~~ compilation terminated. scons: *** [build/linux2/cxx_x86_64-pld-linux-g++/extralib_pcrecpp_pcre_snappy/use-system-all/usev8/mongo/scripting/bson_template_evaluator.o] Error 1 In file included from src/mongo/pch.h:78, from src/mongo/db/jsobj.h:31, from src/mongo/client/authentication_table.h:23, from src/mongo/client/authentication_table_server.cpp:17: src/mongo/util/goodies.h:21:10: fatal error: boost/detail/endian.hpp: No such file or directory 21 | #include <boost/detail/endian.hpp> | ^~~~~~~~~~~~~~~~~~~~~~~~~ compilation terminated. scons: *** [build/linux2/cxx_x86_64-pld-linux-g++/extralib_pcrecpp_pcre_snappy/use-system-all/usev8/mongo/client/authentication_table_server.o] Error 1 scons: building terminated because of errors. error: Bad exit status from /tmp/B.yAQ3c1/BUILD/tmp/rpm-tmp.37158 (%build) RPM build errors: Bad exit status from /tmp/B.yAQ3c1/BUILD/tmp/rpm-tmp.37158 (%build) ended at: Sat Aug 1 11:03:17 2020, done in 0:00:07.596659 error: No files produced. + chmod -R u+rwX /tmp/B.yAQ3c1/BUILD + rm -rf /tmp/B.yAQ3c1/tmp /tmp/B.yAQ3c1/BUILD + rm -rf /tmp/B.yAQ3c1 Begin-PLD-Builder-Info Build-Time: user:9.40s sys:1.79s real:11.45s (faults io:0 non-io:406781) End-PLD-Builder-Info
[Back to list of logs] [View rpm -qa of builder]