FailedOk

th/SRPMS[OK]
th/x32[OK]
th/i686[OK]
th/x86_64[OK]

ac/SRPMS[OK]
ac/i386[OK]
ac/i586[OK]
ac/i686[OK]
ac/alpha[OK]
ac/amd64[OK]
ac/athlon[OK]
ac/ppc[OK]
ac/sparc[OK]
ac/sparc64[OK]

Advanced Search
main()
Powered by PLD Linux
(c) 2002-2018 PLD Team
$Revision: 1.37 $
Powered by PDP-11.
Your IP: 54.235.48.106

mstflint 8bd6a48f-ed5c-4f1c-8ce2-fdeed64f84ff

Status:Failed
Source URL:ftp://buildlogs.pld-linux.org/th/x86_64/FAIL/mstflint,8bd6a48f-ed5c-4f1c-8ce2-fdeed64f84ff.bz2
text/plain URL:View!
full text:View!
rpm -qa of builder:View!
Date:2018/10/31 22:13:01
Runtime:0:01:50.157913

Toc:

  • error 1
  • make[2]: *** [Makefile:462: install-dev_mgt_pylibDATA] Error 1
  • error 2
  • make[1]: *** [Makefile:598: install-am] Error 2
  • error 3
  • error: Bad exit status from /tmp/B.tJ4CnE/BUILD/tmp/rpm-tmp.9480 (%install)
  • error 4
  • RPM build errors:
  • error 5
  • error: No files produced.

Content:

make[3]: Nothing to be done for 'all-am'.
+ exit 0
Executing(%install): /bin/sh -e /tmp/B.tJ4CnE/BUILD/tmp/rpm-tmp.9480
TMP=/home/users/builder/tmp
HOME=/home/users/builder
PATH=/home/users/builder/GNUstep/Tools:/usr/local/bin:/usr/bin:/bin:/home/users/builder/bin
TMPDIR=/tmp/B.tJ4CnE/BUILD/tmp
+ umask 022
+ cd /tmp/B.tJ4CnE/BUILD
+ /bin/rm '--interactive=never' -rf /tmp/B.tJ4CnE/BUILD/tmp/mstflint-4.10.0-root-builder
+ /bin/mkdir -p /tmp/B.tJ4CnE/BUILD/tmp/mstflint-4.10.0-root-builder
+ cd mstflint-4.10.0
+ rm -rf /tmp/B.tJ4CnE/BUILD/tmp/mstflint-4.10.0-root-builder
+ /usr/bin/make -Otarget -j9 install 'DESTDIR=/tmp/B.tJ4CnE/BUILD/tmp/mstflint-4.10.0-root-builder'
Making install in common
make[2]: Nothing to be done for 'install-exec-am'.
make[2]: Entering directory '/tmp/B.tJ4CnE/BUILD/mstflint-4.10.0/common'
 /bin/mkdir -p '/tmp/B.tJ4CnE/BUILD/tmp/mstflint-4.10.0-root-builder/usr/lib64/mstflint/python_tools/'
 /usr/bin/install -c -m 644 tools_version.py '/tmp/B.tJ4CnE/BUILD/tmp/mstflint-4.10.0-root-builder/usr/lib64/mstflint/python_tools/'
make[2]: Leaving directory '/tmp/B.tJ4CnE/BUILD/mstflint-4.10.0/common'
Making install in mft_utils
make[2]: Nothing to be done for 'install-exec-am'.
make[2]: Nothing to be done for 'install-data-am'.
Making install in ext_libs
Making install in muparser
make[3]: Nothing to be done for 'install-exec-am'.
make[3]: Nothing to be done for 'install-data-am'.
Making install in sqlite
make[3]: Nothing to be done for 'install-exec-am'.
make[3]: Nothing to be done for 'install-data-am'.
Making install in iniParser
make[3]: Nothing to be done for 'install-exec-am'.
make[3]: Nothing to be done for 'install-data-am'.
Making install in minixz
make[3]: Nothing to be done for 'install-exec-am'.
make[3]: Nothing to be done for 'install-data-am'.
Making install in json
make[3]: Nothing to be done for 'install-exec-am'.
make[3]: Nothing to be done for 'install-data-am'.
make[3]: Nothing to be done for 'install-exec-am'.
make[3]: Nothing to be done for 'install-data-am'.
Making install in tools_crypto
make[2]: Nothing to be done for 'install-exec-am'.
make[2]: Nothing to be done for 'install-data-am'.
Making install in mlxsign_lib
make[2]: Nothing to be done for 'install-exec-am'.
make[2]: Nothing to be done for 'install-data-am'.
Making install in tools_layouts
make[2]: Nothing to be done for 'install-exec-am'.
make[2]: Nothing to be done for 'install-data-am'.
Making install in mtcr_ul
make[2]: Entering directory '/tmp/B.tJ4CnE/BUILD/mstflint-4.10.0/mtcr_ul'
 /bin/mkdir -p '/tmp/B.tJ4CnE/BUILD/tmp/mstflint-4.10.0-root-builder/usr/include/mstflint'
 /usr/bin/install -c -m 644 ../include/mtcr_ul/mtcr.h ../include/mtcr_ul/mtcr_com_defs.h '/tmp/B.tJ4CnE/BUILD/tmp/mstflint-4.10.0-root-builder/usr/include/mstflint'
make[2]: Leaving directory '/tmp/B.tJ4CnE/BUILD/mstflint-4.10.0/mtcr_ul'
make[2]: Entering directory '/tmp/B.tJ4CnE/BUILD/mstflint-4.10.0/mtcr_ul'
 /bin/mkdir -p '/tmp/B.tJ4CnE/BUILD/tmp/mstflint-4.10.0-root-builder/usr/lib64/mstflint'
 /usr/bin/install -c -m 644  libmtcr_ul.a '/tmp/B.tJ4CnE/BUILD/tmp/mstflint-4.10.0-root-builder/usr/lib64/mstflint'
 ( cd '/tmp/B.tJ4CnE/BUILD/tmp/mstflint-4.10.0-root-builder/usr/lib64/mstflint' && ranlib libmtcr_ul.a )
make[2]: Leaving directory '/tmp/B.tJ4CnE/BUILD/mstflint-4.10.0/mtcr_ul'
Making install in mtcr_py
make[2]: Nothing to be done for 'install-exec-am'.
make[2]: Entering directory '/tmp/B.tJ4CnE/BUILD/mstflint-4.10.0/mtcr_py'
 /bin/mkdir -p '/tmp/B.tJ4CnE/BUILD/tmp/mstflint-4.10.0-root-builder/usr/lib64/mstflint/python_tools/'
 /usr/bin/install -c -m 644 mtcr.py '/tmp/B.tJ4CnE/BUILD/tmp/mstflint-4.10.0-root-builder/usr/lib64/mstflint/python_tools/'
make[2]: Leaving directory '/tmp/B.tJ4CnE/BUILD/mstflint-4.10.0/mtcr_py'
make[2]: Entering directory '/tmp/B.tJ4CnE/BUILD/mstflint-4.10.0/mtcr_py'
 /bin/mkdir -p '/tmp/B.tJ4CnE/BUILD/tmp/mstflint-4.10.0-root-builder/usr/lib64/mstflint/python_tools/'
 /usr/bin/install -c -m 644 cmtcr.so mtcr.py '/tmp/B.tJ4CnE/BUILD/tmp/mstflint-4.10.0-root-builder/usr/lib64/mstflint/python_tools/'
make[2]: Leaving directory '/tmp/B.tJ4CnE/BUILD/mstflint-4.10.0/mtcr_py'
Making install in mad_ifc
make[2]: Nothing to be done for 'install-exec-am'.
make[2]: Nothing to be done for 'install-data-am'.
Making install in reg_access
make[2]: Nothing to be done for 'install-exec-am'.
make[2]: Entering directory '/tmp/B.tJ4CnE/BUILD/mstflint-4.10.0/reg_access'
 /bin/mkdir -p '/tmp/B.tJ4CnE/BUILD/tmp/mstflint-4.10.0-root-builder/usr/lib64/mstflint/python_tools/'
 /usr/bin/install -c -m 644 regaccess.py '/tmp/B.tJ4CnE/BUILD/tmp/mstflint-4.10.0-root-builder/usr/lib64/mstflint/python_tools/'
make[2]: Leaving directory '/tmp/B.tJ4CnE/BUILD/mstflint-4.10.0/reg_access'
make[2]: Entering directory '/tmp/B.tJ4CnE/BUILD/mstflint-4.10.0/reg_access'
 /bin/mkdir -p '/tmp/B.tJ4CnE/BUILD/tmp/mstflint-4.10.0-root-builder/usr/lib64/mstflint/python_tools/'
 /usr/bin/install -c -m 644 rreg_access.so regaccess.py '/tmp/B.tJ4CnE/BUILD/tmp/mstflint-4.10.0-root-builder/usr/lib64/mstflint/python_tools/'
make[2]: Leaving directory '/tmp/B.tJ4CnE/BUILD/mstflint-4.10.0/reg_access'
Making install in cmdif
make[2]: Nothing to be done for 'install-exec-am'.
make[2]: Entering directory '/tmp/B.tJ4CnE/BUILD/mstflint-4.10.0/cmdif'
 /bin/mkdir -p '/tmp/B.tJ4CnE/BUILD/tmp/mstflint-4.10.0-root-builder/usr/lib64/mstflint/python_tools/'
 /usr/bin/install -c -m 644 ccmdif.so cmdif.py '/tmp/B.tJ4CnE/BUILD/tmp/mstflint-4.10.0-root-builder/usr/lib64/mstflint/python_tools/'
make[2]: Leaving directory '/tmp/B.tJ4CnE/BUILD/mstflint-4.10.0/cmdif'
Making install in dev_mgt
make[2]: Nothing to be done for 'install-exec-am'.
make[2]: Entering directory '/tmp/B.tJ4CnE/BUILD/mstflint-4.10.0/dev_mgt'
 /bin/mkdir -p '/tmp/B.tJ4CnE/BUILD/tmp/mstflint-4.10.0-root-builder/usr/lib64/mstflint/python_tools/'
 /usr/bin/install -c -m 644 dev_mgt.py '/tmp/B.tJ4CnE/BUILD/tmp/mstflint-4.10.0-root-builder/usr/lib64/mstflint/python_tools/'
make[2]: Leaving directory '/tmp/B.tJ4CnE/BUILD/mstflint-4.10.0/dev_mgt'
make[2]: Entering directory '/tmp/B.tJ4CnE/BUILD/mstflint-4.10.0/dev_mgt'
 /bin/mkdir -p '/tmp/B.tJ4CnE/BUILD/tmp/mstflint-4.10.0-root-builder/usr/lib64/mstflint/python_tools/'
 /usr/bin/install -c -m 644 c_dev_mgt.so dev_mgt.py '/tmp/B.tJ4CnE/BUILD/tmp/mstflint-4.10.0-root-builder/usr/lib64/mstflint/python_tools/'
/usr/bin/install: cannot create regular file '/tmp/B.tJ4CnE/BUILD/tmp/mstflint-4.10.0-root-builder/usr/lib64/mstflint/python_tools/dev_mgt.py': File exists
make[2]: *** [Makefile:462: install-dev_mgt_pylibDATA] Error 1
make[2]: Leaving directory '/tmp/B.tJ4CnE/BUILD/mstflint-4.10.0/dev_mgt'
make[1]: *** [Makefile:598: install-am] Error 2
make: *** [Makefile:522: install-recursive] Error 1
error: Bad exit status from /tmp/B.tJ4CnE/BUILD/tmp/rpm-tmp.9480 (%install)


RPM build errors:
    Bad exit status from /tmp/B.tJ4CnE/BUILD/tmp/rpm-tmp.9480 (%install)
ended at: Wed Oct 31 22:13:01 2018, done in 0:01:50.157913
error: No files produced.
mesg: ttyname failed: Inappropriate ioctl for device
+ chmod -R u+rwX /tmp/B.tJ4CnE/BUILD
+ rm -rf /tmp/B.tJ4CnE/tmp /tmp/B.tJ4CnE/BUILD
mesg: ttyname failed: Inappropriate ioctl for device
+ rm -rf /tmp/B.tJ4CnE
Begin-PLD-Builder-Info
Build-Time: user:231.22s sys:16.40s real:115.38s (faults io:0 non-io:4992889)

End-PLD-Builder-Info
[Back to list of logs] [View rpm -qa of builder]