FailedOk

th/SRPMS[OK]
th/x32[OK]
th/i686[OK]
th/x86_64[OK]

ac/SRPMS[OK]
ac/i386[OK]
ac/i586[OK]
ac/i686[OK]
ac/alpha[OK]
ac/amd64[OK]
ac/athlon[OK]
ac/ppc[OK]
ac/sparc[OK]
ac/sparc64[OK]

Advanced Search
main()
Powered by PLD Linux
(c) 2002-2017 PLD Team
$Revision: 1.37 $
Powered by Linux.
Your IP: 54.198.52.8

museek+ 17ffdc03-77be-485a-808d-be36330d1ff4

Status:Failed
Source URL:ftp://buildlogs.pld-linux.org/th/x86_64/FAIL/museek+,17ffdc03-77be-485a-808d-be36330d1ff4.bz2
text/plain URL:View!
rpm -qa of builder:View!
Date:2017/04/13 20:34:22
Runtime:0:00:12.092719

Toc:

  • prep
  • Executing(%prep): /bin/sh -e /tmp/B.MA95yN/BUILD/tmp/rpm-tmp.88280
  • build
  • Executing(%build): /bin/sh -e /tmp/B.MA95yN/BUILD/tmp/rpm-tmp.90745
  • error 1
  • /tmp/B.MA95yN/BUILD/museek+-0.2/NewNet/nnsocket.h:89:22: error: 'struct event' has no member named 'ev_flags'; did you mean 'ev_fd'?
  • error 2
  • error: Bad exit status from /tmp/B.MA95yN/BUILD/tmp/rpm-tmp.90745 (%build)
  • error 3
  • RPM build errors:
  • error 4
  • error: No files produced.

Content:

request from: qboosh
checking if we should skip the build
started at: Thu Apr 13 20:34:07 2017
fetching https://srcbuilder.pld-linux.org/th//srpms/17ffdc03-77be-485a-808d-be36330d1ff4/museek%2B-0.2-7.src.rpm
fetched 1228091 bytes, 1137.7 K/s
installing srpm: museek+-0.2-7.src.rpm
mesg: ttyname failed: Inappropriate ioctl for device
+ install -d /tmp/B.MA95yN/BUILD /tmp/B.MA95yN/RPMS
+ LC_ALL=en_US.UTF-8
+ rpm -qp --changelog museek+-0.2-7.src.rpm
* Thu Apr 13 2017 PLD Linux Team <feedback@pld-linux.org>
- For complete changelog see: http://git.pld-linux.org/?p=packages/museek+.git;a=log;h=master
+ rpm -Uhv --nodeps --define '_topdir /tmp/B.MA95yN' --define '_specdir %{_topdir}' --define '_sourcedir %{_specdir}' --define '_rpmdir %{_topdir}/RPMS' --define '_builddir %{_topdir}/BUILD' museek+-0.2-7.src.rpm Preparing... ################################################## museek+ ################################################## + rm -f museek+-0.2-7.src.rpm mesg: ttyname failed: Inappropriate ioctl for device + install -m 700 -d /tmp/B.MA95yN/BUILD/tmp mesg: ttyname failed: Inappropriate ioctl for device + TMPDIR=/tmp/B.MA95yN/BUILD/tmp + exec nice -n 0 rpmbuild -bp --short-circuit --nodeps --define '_topdir /tmp/B.MA95yN' --define '_specdir %{_topdir}' --define '_sourcedir %{_specdir}' --define '_rpmdir %{_topdir}/RPMS' --define '_builddir %{_topdir}/BUILD' --target x86_64-pld-linux --define 'prep exit 0' /tmp/B.MA95yN/museek+.spec Building target platforms: x86_64-pld-linux checking BuildConflict-ing packages no BuildConflicts found checking BR rpm: Building target platforms: x86_64-pld-linux no BR needed building RPM using: set -ex; : build-id: 17ffdc03-77be-485a-808d-be36330d1ff4; TMPDIR=/tmp/B.MA95yN/BUILD/tmp exec nice -n 0 rpmbuild -bb --define '_smp_mflags -j5' --define '_make_opts -Otarget' --define '_pld_builder 1' --define '_topdir /tmp/B.MA95yN' --define '_specdir %{_topdir}' --define '_sourcedir %{_specdir}' --define '_rpmdir %{_topdir}/RPMS' --define '_builddir %{_topdir}/BUILD' --target x86_64-pld-linux /tmp/B.MA95yN/museek+.spec mesg: ttyname failed: Inappropriate ioctl for device + : build-id: 17ffdc03-77be-485a-808d-be36330d1ff4 + TMPDIR=/tmp/B.MA95yN/BUILD/tmp + exec nice -n 0 rpmbuild -bb --define '_smp_mflags -j5' --define '_make_opts -Otarget' --define '_pld_builder 1' --define '_topdir /tmp/B.MA95yN' --define '_specdir %{_topdir}' --define '_sourcedir %{_specdir}' --define '_rpmdir %{_topdir}/RPMS' --define '_builddir %{_topdir}/BUILD' --target x86_64-pld-linux /tmp/B.MA95yN/museek+.spec Building target platforms: x86_64-pld-linux Executing(%prep): /bin/sh -e /tmp/B.MA95yN/BUILD/tmp/rpm-tmp.88280 + umask 022 + cd /tmp/B.MA95yN/BUILD + cd /tmp/B.MA95yN/BUILD + rm -rf museek+-0.2 + /usr/bin/bzip2 -dc /tmp/B.MA95yN/museek+-0.2.tar.bz2 + /bin/tar -xf - + STATUS=0 + '[' 0 -ne 0 ']' + cd museek+-0.2 + /bin/id -u + '[' 1000 '=' 0 ']' + /bin/id -u + '[' 1000 '=' 0 ']' + /bin/chmod -Rf a+rX,u+w,g-w,o-w . + echo 'Patch #0 (sitescriptdir.patch):' Patch #0 (sitescriptdir.patch): + '[' -f /tmp/B.MA95yN/sitescriptdir.patch ']' + /bin/cat /tmp/B.MA95yN/sitescriptdir.patch + /usr/bin/patch -s -p1 + echo 'Patch #1 (museek+-desktop.patch):' Patch #1 (museek+-desktop.patch): + '[' -f /tmp/B.MA95yN/museek+-desktop.patch ']' + /bin/cat /tmp/B.MA95yN/museek+-desktop.patch + /usr/bin/patch -s -p1 + echo 'Patch #2 (museek+-python.patch):' Patch #2 (museek+-python.patch): + '[' -f /tmp/B.MA95yN/museek+-python.patch ']' + /bin/cat /tmp/B.MA95yN/museek+-python.patch + /usr/bin/patch -s -p1 + grep -r /usr/bin/env . -l + xargs sed -i -e '1s,#!.*env python,#!/usr/bin/python2,' + exit 0 Executing(%build): /bin/sh -e /tmp/B.MA95yN/BUILD/tmp/rpm-tmp.90745 TMP=/home/users/builder/tmp HOME=/home/users/builder PATH=/home/users/builder/GNUstep/Tools:/usr/local/bin:/usr/bin:/bin:/home/users/builder/bin TMPDIR=/tmp/B.MA95yN/BUILD/tmp + umask 022 + cd /tmp/B.MA95yN/BUILD + cd museek+-0.2 + mkdir build + cd build + CXXFLAGS='-O2 -fwrapv -pipe -Wformat -Werror=format-security -gdwarf-4 -fno-debug-types-section -fvar-tracking-assignments -g2 -Wp,-D_FORTIFY_SOURCE=2 -fstack-protector-strong --param=ssp-buffer-size=4 -fPIC -march=x86-64 -gdwarf-4 -fno-debug-types-section -fvar-tracking-assignments -g2 -std=c++0x' + CC=x86_64-pld-linux-gcc CXX=x86_64-pld-linux-g++ CPPFLAGS= /usr/bin/cmake '-DCMAKE_VERBOSE_MAKEFILE=ON' '-DCMAKE_BUILD_TYPE=PLD' '-DCMAKE_INSTALL_BINDIR:PATH=/usr/bin' '-DCMAKE_INSTALL_SBINDIR:PATH=/usr/sbin' '-DCMAKE_INSTALL_LIBEXECDIR:PATH=/usr/lib64' '-DCMAKE_INSTALL_SYSCONFDIR:PATH=/etc' '-DCMAKE_INSTALL_SHAREDSTATEDIRPATH:PATH=/var/lib' '-DCMAKE_INSTALL_LOCALSTATEDIRPATH:PATH=/var' '-DCMAKE_INSTALL_LIBDIR:PATH=/usr/lib64' '-DCMAKE_INSTALL_INCLUDEDIR:PATH=/usr/include' '-DCMAKE_INSTALL_OLDINCLUDEDIR:PATH=/usr/include' '-DCMAKE_INSTALL_DATAROOTDIR:PATH=/usr/share' '-DCMAKE_INSTALL_DATADIR:PATH=/usr/share' '-DCMAKE_INSTALL_INFODIR:PATH=/usr/share/info' '-DCMAKE_INSTALL_LOCALEDIR:PATH=/usr/share/locale' '-DCMAKE_INSTALL_MANDIR:PATH=/usr/share/man' '-DCMAKE_INSTALL_DOCDIR:PATH=/usr/share/doc' '-DCMAKE_INSTALL_PREFIX:PATH=/usr' '-DSYSCONF_INSTALL_DIR:PATH=/etc' '-DCMAKE_CXX_FLAGS_PLD=-O2 -fwrapv -pipe -Wformat -Werror=format-security -gdwarf-4 -fno-debug-types-section -fvar-tracking-assignments -g2 -Wp,-D_FORTIFY_SOURCE=2 -fstack-protector-strong --param=ssp-buffer-size=4 -fPIC -march=x86-64 -gdwarf-4 -fno-debug-types-section -fvar-tracking-assignments -g2 -std=c++0x' '-DCMAKE_C_FLAGS_PLD=-O2 -fwrapv -pipe -Wformat -Werror=format-security -gdwarf-4 -fno-debug-types-section -fvar-tracking-assignments -g2 -Wp,-D_FORTIFY_SOURCE=2 -fstack-protector-strong --param=ssp-buffer-size=4 -fPIC -march=x86-64 -gdwarf-4 -fno-debug-types-section -fvar-tracking-assignments -g2 -DNDEBUG -DQT_NO_DEBUG' '-DCMAKE_Fortran_FLAGS_PLD=-O2 -fwrapv -pipe -Wformat -Werror=format-security -gdwarf-4 -fno-debug-types-section -fvar-tracking-assignments -g2 -Wp,-D_FORTIFY_SOURCE=2 -fstack-protector-strong --param=ssp-buffer-size=4 -fPIC -march=x86-64 -gdwarf-4 -fno-debug-types-section -fvar-tracking-assignments -g2 -DNDEBUG -DQT_NO_DEBUG' '-DCMAKE_EXE_LINKER_FLAGS_PLD=-Wl,--as-needed -Wl,--no-copy-dt-needed-entries -Wl,-z,relro -Wl,-z,combreloc ' '-DCMAKE_SHARED_LINKER_FLAGS_PLD=-Wl,--as-needed -Wl,--no-copy-dt-needed-entries -Wl,-z,relro -Wl,-z,combreloc ' '-DCMAKE_MODULE_LINKER_FLAGS_PLD=-Wl,--as-needed -Wl,--no-copy-dt-needed-entries -Wl,-z,relro -Wl,-z,combreloc ' '-DLIB_SUFFIX=64' '-DBUILD_SHARED_LIBS:BOOL=ON' .. '-DEVERYTHING=1' '-DMANDIR=/usr/share/man' '-DPYTHON_EXECUTABLE:PATH=/usr/bin/python2' -- The C compiler identification is GNU 6.3.0 -- The CXX compiler identification is GNU 6.3.0 -- Check for working C compiler: /usr/bin/x86_64-pld-linux-gcc -- Check for working C compiler: /usr/bin/x86_64-pld-linux-gcc -- works -- Detecting C compiler ABI info -- Detecting C compiler ABI info - done -- Detecting C compile features -- Detecting C compile features - done -- Check for working CXX compiler: /usr/bin/x86_64-pld-linux-g++ -- Check for working CXX compiler: /usr/bin/x86_64-pld-linux-g++ -- works -- Detecting CXX compiler ABI info -- Detecting CXX compiler ABI info - done -- Detecting CXX compile features -- Detecting CXX compile features - done DECLARATIONS: PREFIX (/usr), MANDIR (PREFIX/man) Package options: EVERYTHING, NO_MUSEEKD, NO_MUSCAN, NO_SETUP, NO_MUSEEQ, NO_PYMUCIPHER, BINDINGS, MURMUR, MUCOUS, CLIENTS Museeq options: BINRELOC, DATADIR (PREFIX/share), RELOAD_TRANSLATIONS Prefix these declarations with -D and set them with either 1, 0 or a path. Set -DEVERYTHING=1 if you want it all -- Looking for include file stdlib.h -- Looking for include file stdlib.h - found -- Looking for include file stdio.h -- Looking for include file stdio.h - found -- Looking for include file stdarg.h -- Looking for include file stdarg.h - found -- Looking for include file stdint.h -- Looking for include file stdint.h - found -- Looking for include file stddef.h -- Looking for include file stddef.h - found -- Looking for include file unistd.h -- Looking for include file unistd.h - found -- Looking for include file string.h -- Looking for include file string.h - found -- Looking for include file strings.h -- Looking for include file strings.h - found -- Looking for include file errno.h -- Looking for include file errno.h - found -- Looking for include file fcntl.h -- Looking for include file fcntl.h - found -- Looking for include file netdb.h -- Looking for include file netdb.h - found -- Looking for include file sys/types.h -- Looking for include file sys/types.h - found -- Looking for include file sys/time.h -- Looking for include file sys/time.h - found -- Looking for include file inttypes.h, -- Looking for include file inttypes.h, - not found -- Looking for include file time.h -- Looking for include file time.h - found -- Looking for include file memory.h -- Looking for include file memory.h - found -- Looking for include file sys/socket.h -- Looking for include file sys/socket.h - found -- Looking for include file sys/poll.h -- Looking for include file sys/poll.h - found -- Looking for include file sys/epoll.h -- Looking for include file sys/epoll.h - found -- Looking for include file sys/signal.h -- Looking for include file sys/signal.h - found -- Looking for include file sys/un.h -- Looking for include file sys/un.h - found -- Looking for include file sys/syslog.h -- Looking for include file sys/syslog.h - found -- Looking for include file sys/stat.h -- Looking for include file sys/stat.h - found -- Looking for include file dirent.h -- Looking for include file dirent.h - found -- Looking for include file sys/ndir.h -- Looking for include file sys/ndir.h - not found -- Looking for include file sys/dir.h -- Looking for include file sys/dir.h - found -- Looking for include file ndir.h -- Looking for include file ndir.h - not found -- Looking for include file vorbis/vorbisfile.h -- Looking for include file vorbis/vorbisfile.h - found -- Looking for include file pwd.h -- Looking for include file pwd.h - found -- Looking for include file netinet/in.h -- Looking for include file netinet/in.h - found -- Looking for include file netinet/tcp.h -- Looking for include file netinet/tcp.h - found -- Looking for include file windows.h -- Looking for include file windows.h - not found -- Looking for include file winsock.h -- Looking for include file winsock.h - not found -- Check size of unsigned char -- Check size of unsigned char - done -- Check size of unsigned short -- Check size of unsigned short - done -- Check size of unsigned int -- Check size of unsigned int - done -- Check size of unsigned long -- Check size of unsigned long - done -- Check size of unsigned long long -- Check size of unsigned long long - done -- Check size of uint -- Check size of uint - done -- Check size of uint32 -- Check size of uint32 - failed -- Looking for include file iconv.h -- Looking for include file iconv.h - found -- Looking for iconv -- Looking for iconv - found -- Performing Test ICONV_CONST -- Performing Test ICONV_CONST - Failed -- Performing Test ICONV_NON_CONST -- Performing Test ICONV_NON_CONST - Success -- Performing Test SIGNAL_TYPE -- Performing Test SIGNAL_TYPE - Success -- Performing Test DIR_H -- Performing Test DIR_H - Success -- Performing Test DIR_SCANDIR_H -- Performing Test DIR_SCANDIR_H - Success -- Vorbisfile library found at /usr/lib64/libvorbisfile.so. -- Found Event: /usr/include -- Found SWIG: /usr/bin/swig (found version "3.0.12") -- Found PythonInterp: /usr/bin/python2 (found version "2.7.13") -- Found PythonLibs: /usr/lib64/libpython2.7.so (found version "2.7.13") --> PyMucipher will be installed.. [NO_PYMUCIPHER=1] -- Found PkgConfig: /usr/bin/pkg-config (found version "0.29.2") -- Checking for one of the modules 'libxml++-2.6' -- Found Gamin: good choice, it's better then FAM -- Found FAM (provided by Gamin): /usr/lib64/libgamin-1.so --> muscan (file scanner) will be installed.. --> muscand (FAM-based file scanning daemon) will be installed.. -- Found ZLIB: /usr/lib64/libz.so (found version "1.2.11") -- Found LibXml2: /usr/lib64/libxml2.so (found version "2.9.4") --> Museek Daemon (museekd) will be installed.. --> Python Bindings will be installed.. --> mulog, museekchat, museekcontrol, musirc.py will be installed.. --> musetup, musetup-gtk, musetup-qt will be installed.. --> Mucous will be installed.. --> Murmur will be installed.. -- Looking for Q_WS_X11 -- Looking for Q_WS_X11 - found -- Looking for Q_WS_WIN -- Looking for Q_WS_WIN - not found -- Looking for Q_WS_QWS -- Looking for Q_WS_QWS - not found -- Looking for Q_WS_MAC -- Looking for Q_WS_MAC - not found -- Found Qt4: /usr/bin/qmake-qt4 (found version "4.8.7") -- Qt Script available -- Qt UI Tools available -- moc binary:/usr/lib64/qt4/bin/moc --> Museeq-qt4 will be installed.. [NO_MUSEEQ=1] * without Binary Relocation.. [BINRELOC=1] -- Configuring done -- Generating done CMake Warning: Manually-specified variables were not used by the project: CMAKE_Fortran_FLAGS_PLD CMAKE_INSTALL_BINDIR CMAKE_INSTALL_DATADIR CMAKE_INSTALL_DATAROOTDIR CMAKE_INSTALL_DOCDIR CMAKE_INSTALL_INCLUDEDIR CMAKE_INSTALL_INFODIR CMAKE_INSTALL_LIBDIR CMAKE_INSTALL_LIBEXECDIR CMAKE_INSTALL_LOCALEDIR CMAKE_INSTALL_LOCALSTATEDIRPATH CMAKE_INSTALL_MANDIR CMAKE_INSTALL_OLDINCLUDEDIR CMAKE_INSTALL_SBINDIR CMAKE_INSTALL_SHAREDSTATEDIRPATH CMAKE_INSTALL_SYSCONFDIR CMAKE_SHARED_LINKER_FLAGS_PLD LIB_SUFFIX SYSCONF_INSTALL_DIR -- Build files have been written to: /tmp/B.MA95yN/BUILD/museek+-0.2/build + /usr/bin/make -Otarget -j5 /usr/bin/cmake -H/tmp/B.MA95yN/BUILD/museek+-0.2 -B/tmp/B.MA95yN/BUILD/museek+-0.2/build --check-build-system CMakeFiles/Makefile.cmake 0 /usr/bin/cmake -E cmake_progress_start /tmp/B.MA95yN/BUILD/museek+-0.2/build/CMakeFiles /tmp/B.MA95yN/BUILD/museek+-0.2/build/CMakeFiles/progress.marks /usr/bin/make -f CMakeFiles/Makefile2 all /usr/bin/make -f NewNet/CMakeFiles/NewNet.dir/build.make NewNet/CMakeFiles/NewNet.dir/depend /usr/bin/make -f Mucipher/CMakeFiles/Mucipher.dir/build.make Mucipher/CMakeFiles/Mucipher.dir/depend /usr/bin/make -f Mucipher/PyMucipher/CMakeFiles/_mucipherc.dir/build.make Mucipher/PyMucipher/CMakeFiles/_mucipherc.dir/depend /usr/bin/make -f muscan/CMakeFiles/Tools.dir/build.make muscan/CMakeFiles/Tools.dir/depend make[2]: Entering directory '/tmp/B.MA95yN/BUILD/museek+-0.2/build' cd /tmp/B.MA95yN/BUILD/museek+-0.2/build && /usr/bin/cmake -E cmake_depends "Unix Makefiles" /tmp/B.MA95yN/BUILD/museek+-0.2 /tmp/B.MA95yN/BUILD/museek+-0.2/Mucipher /tmp/B.MA95yN/BUILD/museek+-0.2/build /tmp/B.MA95yN/BUILD/museek+-0.2/build/Mucipher /tmp/B.MA95yN/BUILD/museek+-0.2/build/Mucipher/CMakeFiles/Mucipher.dir/DependInfo.cmake --color= Scanning dependencies of target Mucipher make[2]: Leaving directory '/tmp/B.MA95yN/BUILD/museek+-0.2/build' /usr/bin/make -f Mucipher/CMakeFiles/Mucipher.dir/build.make Mucipher/CMakeFiles/Mucipher.dir/build make[2]: Entering directory '/tmp/B.MA95yN/BUILD/museek+-0.2/build' cd /tmp/B.MA95yN/BUILD/museek+-0.2/build && /usr/bin/cmake -E cmake_depends "Unix Makefiles" /tmp/B.MA95yN/BUILD/museek+-0.2 /tmp/B.MA95yN/BUILD/museek+-0.2/muscan /tmp/B.MA95yN/BUILD/museek+-0.2/build /tmp/B.MA95yN/BUILD/museek+-0.2/build/muscan /tmp/B.MA95yN/BUILD/museek+-0.2/build/muscan/CMakeFiles/Tools.dir/DependInfo.cmake --color= Scanning dependencies of target Tools make[2]: Leaving directory '/tmp/B.MA95yN/BUILD/museek+-0.2/build' /usr/bin/make -f muscan/CMakeFiles/Tools.dir/build.make muscan/CMakeFiles/Tools.dir/build make[2]: Entering directory '/tmp/B.MA95yN/BUILD/museek+-0.2/build' cd /tmp/B.MA95yN/BUILD/museek+-0.2/build && /usr/bin/cmake -E cmake_depends "Unix Makefiles" /tmp/B.MA95yN/BUILD/museek+-0.2 /tmp/B.MA95yN/BUILD/museek+-0.2/NewNet /tmp/B.MA95yN/BUILD/museek+-0.2/build /tmp/B.MA95yN/BUILD/museek+-0.2/build/NewNet /tmp/B.MA95yN/BUILD/museek+-0.2/build/NewNet/CMakeFiles/NewNet.dir/DependInfo.cmake --color= Scanning dependencies of target NewNet make[2]: Leaving directory '/tmp/B.MA95yN/BUILD/museek+-0.2/build' /usr/bin/make -f NewNet/CMakeFiles/NewNet.dir/build.make NewNet/CMakeFiles/NewNet.dir/build make[2]: Entering directory '/tmp/B.MA95yN/BUILD/museek+-0.2/build' [ 2%] Building CXX object Mucipher/CMakeFiles/Mucipher.dir/hexdigest.cpp.o cd /tmp/B.MA95yN/BUILD/museek+-0.2/build/Mucipher && /usr/bin/x86_64-pld-linux-g++ -DHAVE_CONFIG_H -DHAVE_SYSTEM_H -DNN_PTR_DEBUG -DNN_PTR_DEBUG_ASSERT -I/tmp/B.MA95yN/BUILD/museek+-0.2/. -I/tmp/B.MA95yN/BUILD/museek+-0.2/build -O2 -fwrapv -pipe -Wformat -Werror=format-security -gdwarf-4 -fno-debug-types-section -fvar-tracking-assignments -g2 -Wp,-D_FORTIFY_SOURCE=2 -fstack-protector-strong --param=ssp-buffer-size=4 -fPIC -march=x86-64 -gdwarf-4 -fno-debug-types-section -fvar-tracking-assignments -g2 -std=c++0x -o CMakeFiles/Mucipher.dir/hexdigest.cpp.o -c /tmp/B.MA95yN/BUILD/museek+-0.2/Mucipher/hexdigest.cpp make[2]: Leaving directory '/tmp/B.MA95yN/BUILD/museek+-0.2/build' make[2]: Entering directory '/tmp/B.MA95yN/BUILD/museek+-0.2/build' [ 2%] Building C object muscan/CMakeFiles/Tools.dir/mp3.c.o cd /tmp/B.MA95yN/BUILD/museek+-0.2/build/muscan && /usr/bin/x86_64-pld-linux-gcc -DHAVE_CONFIG_H -DHAVE_SYSTEM_H -DNN_PTR_DEBUG -DNN_PTR_DEBUG_ASSERT -I/tmp/B.MA95yN/BUILD/museek+-0.2/. -I/tmp/B.MA95yN/BUILD/museek+-0.2/build -O2 -fwrapv -pipe -Wformat -Werror=format-security -gdwarf-4 -fno-debug-types-section -fvar-tracking-assignments -g2 -Wp,-D_FORTIFY_SOURCE=2 -fstack-protector-strong --param=ssp-buffer-size=4 -fPIC -march=x86-64 -gdwarf-4 -fno-debug-types-section -fvar-tracking-assignments -g2 -DNDEBUG -DQT_NO_DEBUG -I/usr/include/libxml++-2.6 -I/usr/lib64/libxml++-2.6/include -I/usr/include/libxml2 -I/usr/include/glibmm-2.4 -I/usr/lib64/glibmm-2.4/include -I/usr/include/glib-2.0 -I/usr/lib64/glib-2.0/include -I/usr/include/sigc++-2.0 -I/usr/lib64/sigc++-2.0/include -o CMakeFiles/Tools.dir/mp3.c.o -c /tmp/B.MA95yN/BUILD/museek+-0.2/muscan/mp3.c make[2]: Leaving directory '/tmp/B.MA95yN/BUILD/museek+-0.2/build' make[2]: Entering directory '/tmp/B.MA95yN/BUILD/museek+-0.2/build' [ 3%] Building CXX object muscan/CMakeFiles/Tools.dir/scandir.cc.o cd /tmp/B.MA95yN/BUILD/museek+-0.2/build/muscan && /usr/bin/x86_64-pld-linux-g++ -DHAVE_CONFIG_H -DHAVE_SYSTEM_H -DNN_PTR_DEBUG -DNN_PTR_DEBUG_ASSERT -I/tmp/B.MA95yN/BUILD/museek+-0.2/. -I/tmp/B.MA95yN/BUILD/museek+-0.2/build -O2 -fwrapv -pipe -Wformat -Werror=format-security -gdwarf-4 -fno-debug-types-section -fvar-tracking-assignments -g2 -Wp,-D_FORTIFY_SOURCE=2 -fstack-protector-strong --param=ssp-buffer-size=4 -fPIC -march=x86-64 -gdwarf-4 -fno-debug-types-section -fvar-tracking-assignments -g2 -std=c++0x -I/usr/include/libxml++-2.6 -I/usr/lib64/libxml++-2.6/include -I/usr/include/libxml2 -I/usr/include/glibmm-2.4 -I/usr/lib64/glibmm-2.4/include -I/usr/include/glib-2.0 -I/usr/lib64/glib-2.0/include -I/usr/include/sigc++-2.0 -I/usr/lib64/sigc++-2.0/include -o CMakeFiles/Tools.dir/scandir.cc.o -c /tmp/B.MA95yN/BUILD/museek+-0.2/muscan/scandir.cc make[2]: Leaving directory '/tmp/B.MA95yN/BUILD/museek+-0.2/build' make[2]: Entering directory '/tmp/B.MA95yN/BUILD/museek+-0.2/build' [ 1%] Swig source cd /tmp/B.MA95yN/BUILD/museek+-0.2/build/Mucipher/PyMucipher && /usr/bin/cmake -E make_directory /tmp/B.MA95yN/BUILD/museek+-0.2/build/Mucipher/PyMucipher cd /tmp/B.MA95yN/BUILD/museek+-0.2/build/Mucipher/PyMucipher && /usr/bin/swig -python -includeall -outdir /tmp/B.MA95yN/BUILD/museek+-0.2/build/Mucipher/PyMucipher -c++ -I/tmp/B.MA95yN/BUILD/museek+-0.2/. -I/tmp/B.MA95yN/BUILD/museek+-0.2/build -I/usr/include/python2.7 -I/tmp/B.MA95yN/BUILD/museek+-0.2/Mucipher/PyMucipher -o /tmp/B.MA95yN/BUILD/museek+-0.2/build/Mucipher/PyMucipher/mucipherPYTHON_wrap.cxx /tmp/B.MA95yN/BUILD/museek+-0.2/Mucipher/PyMucipher/mucipher.i make[2]: Leaving directory '/tmp/B.MA95yN/BUILD/museek+-0.2/build' make[2]: Entering directory '/tmp/B.MA95yN/BUILD/museek+-0.2/build' [ 2%] Building CXX object NewNet/CMakeFiles/NewNet.dir/nnbuffer.cpp.o cd /tmp/B.MA95yN/BUILD/museek+-0.2/build/NewNet && /usr/bin/x86_64-pld-linux-g++ -DHAVE_CONFIG_H -DHAVE_SYSTEM_H -DNN_PTR_DEBUG -DNN_PTR_DEBUG_ASSERT -I/tmp/B.MA95yN/BUILD/museek+-0.2/. -I/tmp/B.MA95yN/BUILD/museek+-0.2/build -O2 -fwrapv -pipe -Wformat -Werror=format-security -gdwarf-4 -fno-debug-types-section -fvar-tracking-assignments -g2 -Wp,-D_FORTIFY_SOURCE=2 -fstack-protector-strong --param=ssp-buffer-size=4 -fPIC -march=x86-64 -gdwarf-4 -fno-debug-types-section -fvar-tracking-assignments -g2 -std=c++0x -o CMakeFiles/NewNet.dir/nnbuffer.cpp.o -c /tmp/B.MA95yN/BUILD/museek+-0.2/NewNet/nnbuffer.cpp make[2]: Leaving directory '/tmp/B.MA95yN/BUILD/museek+-0.2/build' make[2]: Entering directory '/tmp/B.MA95yN/BUILD/museek+-0.2/build' cd /tmp/B.MA95yN/BUILD/museek+-0.2/build && /usr/bin/cmake -E cmake_depends "Unix Makefiles" /tmp/B.MA95yN/BUILD/museek+-0.2 /tmp/B.MA95yN/BUILD/museek+-0.2/Mucipher/PyMucipher /tmp/B.MA95yN/BUILD/museek+-0.2/build /tmp/B.MA95yN/BUILD/museek+-0.2/build/Mucipher/PyMucipher /tmp/B.MA95yN/BUILD/museek+-0.2/build/Mucipher/PyMucipher/CMakeFiles/_mucipherc.dir/DependInfo.cmake --color= Scanning dependencies of target _mucipherc make[2]: Leaving directory '/tmp/B.MA95yN/BUILD/museek+-0.2/build' /usr/bin/make -f Mucipher/PyMucipher/CMakeFiles/_mucipherc.dir/build.make Mucipher/PyMucipher/CMakeFiles/_mucipherc.dir/build make[2]: Entering directory '/tmp/B.MA95yN/BUILD/museek+-0.2/build' [ 3%] Building CXX object Mucipher/CMakeFiles/Mucipher.dir/md5.cpp.o cd /tmp/B.MA95yN/BUILD/museek+-0.2/build/Mucipher && /usr/bin/x86_64-pld-linux-g++ -DHAVE_CONFIG_H -DHAVE_SYSTEM_H -DNN_PTR_DEBUG -DNN_PTR_DEBUG_ASSERT -I/tmp/B.MA95yN/BUILD/museek+-0.2/. -I/tmp/B.MA95yN/BUILD/museek+-0.2/build -O2 -fwrapv -pipe -Wformat -Werror=format-security -gdwarf-4 -fno-debug-types-section -fvar-tracking-assignments -g2 -Wp,-D_FORTIFY_SOURCE=2 -fstack-protector-strong --param=ssp-buffer-size=4 -fPIC -march=x86-64 -gdwarf-4 -fno-debug-types-section -fvar-tracking-assignments -g2 -std=c++0x -o CMakeFiles/Mucipher.dir/md5.cpp.o -c /tmp/B.MA95yN/BUILD/museek+-0.2/Mucipher/md5.cpp make[2]: Leaving directory '/tmp/B.MA95yN/BUILD/museek+-0.2/build' make[2]: Entering directory '/tmp/B.MA95yN/BUILD/museek+-0.2/build' [ 1%] Building CXX object Mucipher/CMakeFiles/Mucipher.dir/aes.cpp.o cd /tmp/B.MA95yN/BUILD/museek+-0.2/build/Mucipher && /usr/bin/x86_64-pld-linux-g++ -DHAVE_CONFIG_H -DHAVE_SYSTEM_H -DNN_PTR_DEBUG -DNN_PTR_DEBUG_ASSERT -I/tmp/B.MA95yN/BUILD/museek+-0.2/. -I/tmp/B.MA95yN/BUILD/museek+-0.2/build -O2 -fwrapv -pipe -Wformat -Werror=format-security -gdwarf-4 -fno-debug-types-section -fvar-tracking-assignments -g2 -Wp,-D_FORTIFY_SOURCE=2 -fstack-protector-strong --param=ssp-buffer-size=4 -fPIC -march=x86-64 -gdwarf-4 -fno-debug-types-section -fvar-tracking-assignments -g2 -std=c++0x -o CMakeFiles/Mucipher.dir/aes.cpp.o -c /tmp/B.MA95yN/BUILD/museek+-0.2/Mucipher/aes.cpp /tmp/B.MA95yN/BUILD/museek+-0.2/Mucipher/aes.cpp: In function 'int aes_set_key(void*, const u8*, unsigned int)': /tmp/B.MA95yN/BUILD/museek+-0.2/Mucipher/aes.cpp:280:23: warning: iteration 6 invokes undefined behavior [-Waggressive-loop-optimizations] E_KEY[8 * i + 12] = t; \ ^ /tmp/B.MA95yN/BUILD/museek+-0.2/Mucipher/aes.cpp:323:4: note: in expansion of macro 'loop8' loop8 (i); ^~~~~ /tmp/B.MA95yN/BUILD/museek+-0.2/Mucipher/aes.cpp:322:17: note: within this loop for (i = 0; i < 7; ++i) ~~^~~ make[2]: Leaving directory '/tmp/B.MA95yN/BUILD/museek+-0.2/build' make[2]: Entering directory '/tmp/B.MA95yN/BUILD/museek+-0.2/build' [ 5%] Building CXX object Mucipher/CMakeFiles/Mucipher.dir/sha.cpp.o cd /tmp/B.MA95yN/BUILD/museek+-0.2/build/Mucipher && /usr/bin/x86_64-pld-linux-g++ -DHAVE_CONFIG_H -DHAVE_SYSTEM_H -DNN_PTR_DEBUG -DNN_PTR_DEBUG_ASSERT -I/tmp/B.MA95yN/BUILD/museek+-0.2/. -I/tmp/B.MA95yN/BUILD/museek+-0.2/build -O2 -fwrapv -pipe -Wformat -Werror=format-security -gdwarf-4 -fno-debug-types-section -fvar-tracking-assignments -g2 -Wp,-D_FORTIFY_SOURCE=2 -fstack-protector-strong --param=ssp-buffer-size=4 -fPIC -march=x86-64 -gdwarf-4 -fno-debug-types-section -fvar-tracking-assignments -g2 -std=c++0x -o CMakeFiles/Mucipher.dir/sha.cpp.o -c /tmp/B.MA95yN/BUILD/museek+-0.2/Mucipher/sha.cpp make[2]: Leaving directory '/tmp/B.MA95yN/BUILD/museek+-0.2/build' make[2]: Entering directory '/tmp/B.MA95yN/BUILD/museek+-0.2/build' [ 5%] Building CXX object NewNet/CMakeFiles/NewNet.dir/nnclientsocket.cpp.o cd /tmp/B.MA95yN/BUILD/museek+-0.2/build/NewNet && /usr/bin/x86_64-pld-linux-g++ -DHAVE_CONFIG_H -DHAVE_SYSTEM_H -DNN_PTR_DEBUG -DNN_PTR_DEBUG_ASSERT -I/tmp/B.MA95yN/BUILD/museek+-0.2/. -I/tmp/B.MA95yN/BUILD/museek+-0.2/build -O2 -fwrapv -pipe -Wformat -Werror=format-security -gdwarf-4 -fno-debug-types-section -fvar-tracking-assignments -g2 -Wp,-D_FORTIFY_SOURCE=2 -fstack-protector-strong --param=ssp-buffer-size=4 -fPIC -march=x86-64 -gdwarf-4 -fno-debug-types-section -fvar-tracking-assignments -g2 -std=c++0x -o CMakeFiles/NewNet.dir/nnclientsocket.cpp.o -c /tmp/B.MA95yN/BUILD/museek+-0.2/NewNet/nnclientsocket.cpp In file included from /tmp/B.MA95yN/BUILD/museek+-0.2/NewNet/nnclientsocket.h:24:0, from /tmp/B.MA95yN/BUILD/museek+-0.2/NewNet/nnclientsocket.cpp:21: /tmp/B.MA95yN/BUILD/museek+-0.2/NewNet/nnsocket.h: In constructor 'NewNet::Socket::Socket()': /tmp/B.MA95yN/BUILD/museek+-0.2/NewNet/nnsocket.h:89:22: error: 'struct event' has no member named 'ev_flags'; did you mean 'ev_fd'? m_EventData->ev_flags = 0; // This event has not been initialized ^~~~~~~~ make[2]: *** [NewNet/CMakeFiles/NewNet.dir/build.make:90: NewNet/CMakeFiles/NewNet.dir/nnclientsocket.cpp.o] Error 1 make[2]: Leaving directory '/tmp/B.MA95yN/BUILD/museek+-0.2/build' make[1]: *** [CMakeFiles/Makefile2:89: NewNet/CMakeFiles/NewNet.dir/all] Error 2 make[1]: *** Waiting for unfinished jobs.... make[2]: Entering directory '/tmp/B.MA95yN/BUILD/museek+-0.2/build' [ 6%] Building CXX object Mucipher/CMakeFiles/Mucipher.dir/sha256.cpp.o cd /tmp/B.MA95yN/BUILD/museek+-0.2/build/Mucipher && /usr/bin/x86_64-pld-linux-g++ -DHAVE_CONFIG_H -DHAVE_SYSTEM_H -DNN_PTR_DEBUG -DNN_PTR_DEBUG_ASSERT -I/tmp/B.MA95yN/BUILD/museek+-0.2/. -I/tmp/B.MA95yN/BUILD/museek+-0.2/build -O2 -fwrapv -pipe -Wformat -Werror=format-security -gdwarf-4 -fno-debug-types-section -fvar-tracking-assignments -g2 -Wp,-D_FORTIFY_SOURCE=2 -fstack-protector-strong --param=ssp-buffer-size=4 -fPIC -march=x86-64 -gdwarf-4 -fno-debug-types-section -fvar-tracking-assignments -g2 -std=c++0x -o CMakeFiles/Mucipher.dir/sha256.cpp.o -c /tmp/B.MA95yN/BUILD/museek+-0.2/Mucipher/sha256.cpp make[2]: Leaving directory '/tmp/B.MA95yN/BUILD/museek+-0.2/build' make[2]: Entering directory '/tmp/B.MA95yN/BUILD/museek+-0.2/build' [ 7%] Building CXX object Mucipher/PyMucipher/CMakeFiles/_mucipherc.dir/__/hexdigest.cpp.o cd /tmp/B.MA95yN/BUILD/museek+-0.2/build/Mucipher/PyMucipher && /usr/bin/x86_64-pld-linux-g++ -DHAVE_CONFIG_H -DHAVE_SYSTEM_H -DNN_PTR_DEBUG -DNN_PTR_DEBUG_ASSERT -D_mucipherc_EXPORTS -I/tmp/B.MA95yN/BUILD/museek+-0.2/. -I/tmp/B.MA95yN/BUILD/museek+-0.2/build -I/usr/include/python2.7 -I/tmp/B.MA95yN/BUILD/museek+-0.2/Mucipher/PyMucipher -O2 -fwrapv -pipe -Wformat -Werror=format-security -gdwarf-4 -fno-debug-types-section -fvar-tracking-assignments -g2 -Wp,-D_FORTIFY_SOURCE=2 -fstack-protector-strong --param=ssp-buffer-size=4 -fPIC -march=x86-64 -gdwarf-4 -fno-debug-types-section -fvar-tracking-assignments -g2 -std=c++0x -fPIC -o CMakeFiles/_mucipherc.dir/__/hexdigest.cpp.o -c /tmp/B.MA95yN/BUILD/museek+-0.2/Mucipher/hexdigest.cpp make[2]: Leaving directory '/tmp/B.MA95yN/BUILD/museek+-0.2/build' make[2]: Entering directory '/tmp/B.MA95yN/BUILD/museek+-0.2/build' [ 7%] Linking CXX static library libMucipher.a cd /tmp/B.MA95yN/BUILD/museek+-0.2/build/Mucipher && /usr/bin/cmake -P CMakeFiles/Mucipher.dir/cmake_clean_target.cmake cd /tmp/B.MA95yN/BUILD/museek+-0.2/build/Mucipher && /usr/bin/cmake -E cmake_link_script CMakeFiles/Mucipher.dir/link.txt --verbose=1 /usr/bin/ar qc libMucipher.a CMakeFiles/Mucipher.dir/aes.cpp.o CMakeFiles/Mucipher.dir/hexdigest.cpp.o CMakeFiles/Mucipher.dir/md5.cpp.o CMakeFiles/Mucipher.dir/sha.cpp.o CMakeFiles/Mucipher.dir/sha256.cpp.o /usr/bin/ranlib libMucipher.a make[2]: Leaving directory '/tmp/B.MA95yN/BUILD/museek+-0.2/build' make[1]: Entering directory '/tmp/B.MA95yN/BUILD/museek+-0.2/build' [ 7%] Built target Mucipher make[1]: Leaving directory '/tmp/B.MA95yN/BUILD/museek+-0.2/build' make[2]: Entering directory '/tmp/B.MA95yN/BUILD/museek+-0.2/build' [ 5%] Building CXX object Mucipher/PyMucipher/CMakeFiles/_mucipherc.dir/__/aes.cpp.o cd /tmp/B.MA95yN/BUILD/museek+-0.2/build/Mucipher/PyMucipher && /usr/bin/x86_64-pld-linux-g++ -DHAVE_CONFIG_H -DHAVE_SYSTEM_H -DNN_PTR_DEBUG -DNN_PTR_DEBUG_ASSERT -D_mucipherc_EXPORTS -I/tmp/B.MA95yN/BUILD/museek+-0.2/. -I/tmp/B.MA95yN/BUILD/museek+-0.2/build -I/usr/include/python2.7 -I/tmp/B.MA95yN/BUILD/museek+-0.2/Mucipher/PyMucipher -O2 -fwrapv -pipe -Wformat -Werror=format-security -gdwarf-4 -fno-debug-types-section -fvar-tracking-assignments -g2 -Wp,-D_FORTIFY_SOURCE=2 -fstack-protector-strong --param=ssp-buffer-size=4 -fPIC -march=x86-64 -gdwarf-4 -fno-debug-types-section -fvar-tracking-assignments -g2 -std=c++0x -fPIC -o CMakeFiles/_mucipherc.dir/__/aes.cpp.o -c /tmp/B.MA95yN/BUILD/museek+-0.2/Mucipher/aes.cpp /tmp/B.MA95yN/BUILD/museek+-0.2/Mucipher/aes.cpp: In function 'int aes_set_key(void*, const u8*, unsigned int)': /tmp/B.MA95yN/BUILD/museek+-0.2/Mucipher/aes.cpp:280:23: warning: iteration 6 invokes undefined behavior [-Waggressive-loop-optimizations] E_KEY[8 * i + 12] = t; \ ^ /tmp/B.MA95yN/BUILD/museek+-0.2/Mucipher/aes.cpp:323:4: note: in expansion of macro 'loop8' loop8 (i); ^~~~~ /tmp/B.MA95yN/BUILD/museek+-0.2/Mucipher/aes.cpp:322:17: note: within this loop for (i = 0; i < 7; ++i) ~~^~~ make[2]: Leaving directory '/tmp/B.MA95yN/BUILD/museek+-0.2/build' make[2]: Entering directory '/tmp/B.MA95yN/BUILD/museek+-0.2/build' [ 5%] Building CXX object Mucipher/PyMucipher/CMakeFiles/_mucipherc.dir/mucipherPYTHON_wrap.cxx.o cd /tmp/B.MA95yN/BUILD/museek+-0.2/build/Mucipher/PyMucipher && /usr/bin/x86_64-pld-linux-g++ -DHAVE_CONFIG_H -DHAVE_SYSTEM_H -DNN_PTR_DEBUG -DNN_PTR_DEBUG_ASSERT -D_mucipherc_EXPORTS -I/tmp/B.MA95yN/BUILD/museek+-0.2/. -I/tmp/B.MA95yN/BUILD/museek+-0.2/build -I/usr/include/python2.7 -I/tmp/B.MA95yN/BUILD/museek+-0.2/Mucipher/PyMucipher -O2 -fwrapv -pipe -Wformat -Werror=format-security -gdwarf-4 -fno-debug-types-section -fvar-tracking-assignments -g2 -Wp,-D_FORTIFY_SOURCE=2 -fstack-protector-strong --param=ssp-buffer-size=4 -fPIC -march=x86-64 -gdwarf-4 -fno-debug-types-section -fvar-tracking-assignments -g2 -std=c++0x -fPIC -o CMakeFiles/_mucipherc.dir/mucipherPYTHON_wrap.cxx.o -c /tmp/B.MA95yN/BUILD/museek+-0.2/build/Mucipher/PyMucipher/mucipherPYTHON_wrap.cxx make[2]: Leaving directory '/tmp/B.MA95yN/BUILD/museek+-0.2/build' make[2]: Entering directory '/tmp/B.MA95yN/BUILD/museek+-0.2/build' [ 8%] Building CXX object Mucipher/PyMucipher/CMakeFiles/_mucipherc.dir/__/sha.cpp.o cd /tmp/B.MA95yN/BUILD/museek+-0.2/build/Mucipher/PyMucipher && /usr/bin/x86_64-pld-linux-g++ -DHAVE_CONFIG_H -DHAVE_SYSTEM_H -DNN_PTR_DEBUG -DNN_PTR_DEBUG_ASSERT -D_mucipherc_EXPORTS -I/tmp/B.MA95yN/BUILD/museek+-0.2/. -I/tmp/B.MA95yN/BUILD/museek+-0.2/build -I/usr/include/python2.7 -I/tmp/B.MA95yN/BUILD/museek+-0.2/Mucipher/PyMucipher -O2 -fwrapv -pipe -Wformat -Werror=format-security -gdwarf-4 -fno-debug-types-section -fvar-tracking-assignments -g2 -Wp,-D_FORTIFY_SOURCE=2 -fstack-protector-strong --param=ssp-buffer-size=4 -fPIC -march=x86-64 -gdwarf-4 -fno-debug-types-section -fvar-tracking-assignments -g2 -std=c++0x -fPIC -o CMakeFiles/_mucipherc.dir/__/sha.cpp.o -c /tmp/B.MA95yN/BUILD/museek+-0.2/Mucipher/sha.cpp make[2]: Leaving directory '/tmp/B.MA95yN/BUILD/museek+-0.2/build' make[2]: Entering directory '/tmp/B.MA95yN/BUILD/museek+-0.2/build' [ 9%] Building CXX object Mucipher/PyMucipher/CMakeFiles/_mucipherc.dir/__/wraphelp.cpp.o cd /tmp/B.MA95yN/BUILD/museek+-0.2/build/Mucipher/PyMucipher && /usr/bin/x86_64-pld-linux-g++ -DHAVE_CONFIG_H -DHAVE_SYSTEM_H -DNN_PTR_DEBUG -DNN_PTR_DEBUG_ASSERT -D_mucipherc_EXPORTS -I/tmp/B.MA95yN/BUILD/museek+-0.2/. -I/tmp/B.MA95yN/BUILD/museek+-0.2/build -I/usr/include/python2.7 -I/tmp/B.MA95yN/BUILD/museek+-0.2/Mucipher/PyMucipher -O2 -fwrapv -pipe -Wformat -Werror=format-security -gdwarf-4 -fno-debug-types-section -fvar-tracking-assignments -g2 -Wp,-D_FORTIFY_SOURCE=2 -fstack-protector-strong --param=ssp-buffer-size=4 -fPIC -march=x86-64 -gdwarf-4 -fno-debug-types-section -fvar-tracking-assignments -g2 -std=c++0x -fPIC -o CMakeFiles/_mucipherc.dir/__/wraphelp.cpp.o -c /tmp/B.MA95yN/BUILD/museek+-0.2/Mucipher/wraphelp.cpp make[2]: Leaving directory '/tmp/B.MA95yN/BUILD/museek+-0.2/build' make[2]: Entering directory '/tmp/B.MA95yN/BUILD/museek+-0.2/build' [ 7%] Building CXX object Mucipher/PyMucipher/CMakeFiles/_mucipherc.dir/__/md5.cpp.o cd /tmp/B.MA95yN/BUILD/museek+-0.2/build/Mucipher/PyMucipher && /usr/bin/x86_64-pld-linux-g++ -DHAVE_CONFIG_H -DHAVE_SYSTEM_H -DNN_PTR_DEBUG -DNN_PTR_DEBUG_ASSERT -D_mucipherc_EXPORTS -I/tmp/B.MA95yN/BUILD/museek+-0.2/. -I/tmp/B.MA95yN/BUILD/museek+-0.2/build -I/usr/include/python2.7 -I/tmp/B.MA95yN/BUILD/museek+-0.2/Mucipher/PyMucipher -O2 -fwrapv -pipe -Wformat -Werror=format-security -gdwarf-4 -fno-debug-types-section -fvar-tracking-assignments -g2 -Wp,-D_FORTIFY_SOURCE=2 -fstack-protector-strong --param=ssp-buffer-size=4 -fPIC -march=x86-64 -gdwarf-4 -fno-debug-types-section -fvar-tracking-assignments -g2 -std=c++0x -fPIC -o CMakeFiles/_mucipherc.dir/__/md5.cpp.o -c /tmp/B.MA95yN/BUILD/museek+-0.2/Mucipher/md5.cpp make[2]: Leaving directory '/tmp/B.MA95yN/BUILD/museek+-0.2/build' make[2]: Entering directory '/tmp/B.MA95yN/BUILD/museek+-0.2/build' [ 8%] Building CXX object Mucipher/PyMucipher/CMakeFiles/_mucipherc.dir/__/sha256.cpp.o cd /tmp/B.MA95yN/BUILD/museek+-0.2/build/Mucipher/PyMucipher && /usr/bin/x86_64-pld-linux-g++ -DHAVE_CONFIG_H -DHAVE_SYSTEM_H -DNN_PTR_DEBUG -DNN_PTR_DEBUG_ASSERT -D_mucipherc_EXPORTS -I/tmp/B.MA95yN/BUILD/museek+-0.2/. -I/tmp/B.MA95yN/BUILD/museek+-0.2/build -I/usr/include/python2.7 -I/tmp/B.MA95yN/BUILD/museek+-0.2/Mucipher/PyMucipher -O2 -fwrapv -pipe -Wformat -Werror=format-security -gdwarf-4 -fno-debug-types-section -fvar-tracking-assignments -g2 -Wp,-D_FORTIFY_SOURCE=2 -fstack-protector-strong --param=ssp-buffer-size=4 -fPIC -march=x86-64 -gdwarf-4 -fno-debug-types-section -fvar-tracking-assignments -g2 -std=c++0x -fPIC -o CMakeFiles/_mucipherc.dir/__/sha256.cpp.o -c /tmp/B.MA95yN/BUILD/museek+-0.2/Mucipher/sha256.cpp make[2]: Leaving directory '/tmp/B.MA95yN/BUILD/museek+-0.2/build' make[2]: Entering directory '/tmp/B.MA95yN/BUILD/museek+-0.2/build' [ 9%] Linking CXX shared module _mucipherc.so cd /tmp/B.MA95yN/BUILD/museek+-0.2/build/Mucipher/PyMucipher && /usr/bin/cmake -E cmake_link_script CMakeFiles/_mucipherc.dir/link.txt --verbose=1 /usr/bin/x86_64-pld-linux-g++ -fPIC -O2 -fwrapv -pipe -Wformat -Werror=format-security -gdwarf-4 -fno-debug-types-section -fvar-tracking-assignments -g2 -Wp,-D_FORTIFY_SOURCE=2 -fstack-protector-strong --param=ssp-buffer-size=4 -fPIC -march=x86-64 -gdwarf-4 -fno-debug-types-section -fvar-tracking-assignments -g2 -std=c++0x -Wl,--as-needed -Wl,--no-copy-dt-needed-entries -Wl,-z,relro -Wl,-z,combreloc -shared -o _mucipherc.so CMakeFiles/_mucipherc.dir/mucipherPYTHON_wrap.cxx.o CMakeFiles/_mucipherc.dir/__/aes.cpp.o CMakeFiles/_mucipherc.dir/__/hexdigest.cpp.o CMakeFiles/_mucipherc.dir/__/md5.cpp.o CMakeFiles/_mucipherc.dir/__/sha.cpp.o CMakeFiles/_mucipherc.dir/__/sha256.cpp.o CMakeFiles/_mucipherc.dir/__/wraphelp.cpp.o -lpython2.7 make[2]: Leaving directory '/tmp/B.MA95yN/BUILD/museek+-0.2/build' make[1]: Entering directory '/tmp/B.MA95yN/BUILD/museek+-0.2/build' [ 9%] Built target _mucipherc make[1]: Leaving directory '/tmp/B.MA95yN/BUILD/museek+-0.2/build' make[2]: Entering directory '/tmp/B.MA95yN/BUILD/museek+-0.2/build' [ 4%] Building CXX object muscan/CMakeFiles/Tools.dir/scanner.cc.o cd /tmp/B.MA95yN/BUILD/museek+-0.2/build/muscan && /usr/bin/x86_64-pld-linux-g++ -DHAVE_CONFIG_H -DHAVE_SYSTEM_H -DNN_PTR_DEBUG -DNN_PTR_DEBUG_ASSERT -I/tmp/B.MA95yN/BUILD/museek+-0.2/. -I/tmp/B.MA95yN/BUILD/museek+-0.2/build -O2 -fwrapv -pipe -Wformat -Werror=format-security -gdwarf-4 -fno-debug-types-section -fvar-tracking-assignments -g2 -Wp,-D_FORTIFY_SOURCE=2 -fstack-protector-strong --param=ssp-buffer-size=4 -fPIC -march=x86-64 -gdwarf-4 -fno-debug-types-section -fvar-tracking-assignments -g2 -std=c++0x -I/usr/include/libxml++-2.6 -I/usr/lib64/libxml++-2.6/include -I/usr/include/libxml2 -I/usr/include/glibmm-2.4 -I/usr/lib64/glibmm-2.4/include -I/usr/include/glib-2.0 -I/usr/lib64/glib-2.0/include -I/usr/include/sigc++-2.0 -I/usr/lib64/sigc++-2.0/include -o CMakeFiles/Tools.dir/scanner.cc.o -c /tmp/B.MA95yN/BUILD/museek+-0.2/muscan/scanner.cc make[2]: Leaving directory '/tmp/B.MA95yN/BUILD/museek+-0.2/build' make[2]: Entering directory '/tmp/B.MA95yN/BUILD/museek+-0.2/build' [ 9%] Linking CXX static library libTools.a cd /tmp/B.MA95yN/BUILD/museek+-0.2/build/muscan && /usr/bin/cmake -P CMakeFiles/Tools.dir/cmake_clean_target.cmake cd /tmp/B.MA95yN/BUILD/museek+-0.2/build/muscan && /usr/bin/cmake -E cmake_link_script CMakeFiles/Tools.dir/link.txt --verbose=1 /usr/bin/ar qc libTools.a CMakeFiles/Tools.dir/mp3.c.o CMakeFiles/Tools.dir/scandir.cc.o CMakeFiles/Tools.dir/scanner.cc.o /usr/bin/ranlib libTools.a make[2]: Leaving directory '/tmp/B.MA95yN/BUILD/museek+-0.2/build' make[1]: Entering directory '/tmp/B.MA95yN/BUILD/museek+-0.2/build' [ 9%] Built target Tools make[1]: Leaving directory '/tmp/B.MA95yN/BUILD/museek+-0.2/build' make: *** [Makefile:131: all] Error 2 error: Bad exit status from /tmp/B.MA95yN/BUILD/tmp/rpm-tmp.90745 (%build) RPM build errors: Bad exit status from /tmp/B.MA95yN/BUILD/tmp/rpm-tmp.90745 (%build) ended at: Thu Apr 13 20:34:22 2017, done in 0:00:12.092719 error: No files produced. mesg: ttyname failed: Inappropriate ioctl for device + chmod -R u+rwX /tmp/B.MA95yN/BUILD + rm -rf /tmp/B.MA95yN/tmp /tmp/B.MA95yN/BUILD mesg: ttyname failed: Inappropriate ioctl for device + rm -rf /tmp/B.MA95yN Begin-PLD-Builder-Info Build-Time: user:11.17s sys:1.93s real:15.47s (faults io:0 non-io:714175) End-PLD-Builder-Info
[Back to list of logs] [View rpm -qa of builder]