FailedOk

th/SRPMS[OK]
th/x32[OK]
th/i686[OK]
th/x86_64[OK]

ac/SRPMS[OK]
ac/i386[OK]
ac/i586[OK]
ac/i686[OK]
ac/alpha[OK]
ac/amd64[OK]
ac/athlon[OK]
ac/ppc[OK]
ac/sparc[OK]
ac/sparc64[OK]

Advanced Search
main()
Powered by PLD Linux
(c) 2002-2017 PLD Team
$Revision: 1.37 $
Powered by ITS.
Your IP: 54.80.132.10

museek+ 17ffdc03-77be-485a-808d-be36330d1ff4

Status:Failed
Source URL:ftp://buildlogs.pld-linux.org/th/x86_64/FAIL/museek+,17ffdc03-77be-485a-808d-be36330d1ff4.bz2
text/plain URL:View!
full text:View!
rpm -qa of builder:View!
Date:2017/04/13 20:34:22
Runtime:0:00:12.092719

Toc:

  • error 1
  • /tmp/B.MA95yN/BUILD/museek+-0.2/NewNet/nnsocket.h:89:22: error: 'struct event' has no member named 'ev_flags'; did you mean 'ev_fd'?
  • error 2
  • error: Bad exit status from /tmp/B.MA95yN/BUILD/tmp/rpm-tmp.90745 (%build)
  • error 3
  • RPM build errors:
  • error 4
  • error: No files produced.

Content:

    CMAKE_Fortran_FLAGS_PLD
    CMAKE_INSTALL_BINDIR
    CMAKE_INSTALL_DATADIR
    CMAKE_INSTALL_DATAROOTDIR
    CMAKE_INSTALL_DOCDIR
    CMAKE_INSTALL_INCLUDEDIR
    CMAKE_INSTALL_INFODIR
    CMAKE_INSTALL_LIBDIR
    CMAKE_INSTALL_LIBEXECDIR
    CMAKE_INSTALL_LOCALEDIR
    CMAKE_INSTALL_LOCALSTATEDIRPATH
    CMAKE_INSTALL_MANDIR
    CMAKE_INSTALL_OLDINCLUDEDIR
    CMAKE_INSTALL_SBINDIR
    CMAKE_INSTALL_SHAREDSTATEDIRPATH
    CMAKE_INSTALL_SYSCONFDIR
    CMAKE_SHARED_LINKER_FLAGS_PLD
    LIB_SUFFIX
    SYSCONF_INSTALL_DIR


-- Build files have been written to: /tmp/B.MA95yN/BUILD/museek+-0.2/build
+ /usr/bin/make -Otarget -j5
/usr/bin/cmake -H/tmp/B.MA95yN/BUILD/museek+-0.2 -B/tmp/B.MA95yN/BUILD/museek+-0.2/build --check-build-system CMakeFiles/Makefile.cmake 0
/usr/bin/cmake -E cmake_progress_start /tmp/B.MA95yN/BUILD/museek+-0.2/build/CMakeFiles /tmp/B.MA95yN/BUILD/museek+-0.2/build/CMakeFiles/progress.marks
/usr/bin/make -f CMakeFiles/Makefile2 all
/usr/bin/make -f NewNet/CMakeFiles/NewNet.dir/build.make NewNet/CMakeFiles/NewNet.dir/depend
/usr/bin/make -f Mucipher/CMakeFiles/Mucipher.dir/build.make Mucipher/CMakeFiles/Mucipher.dir/depend
/usr/bin/make -f Mucipher/PyMucipher/CMakeFiles/_mucipherc.dir/build.make Mucipher/PyMucipher/CMakeFiles/_mucipherc.dir/depend
/usr/bin/make -f muscan/CMakeFiles/Tools.dir/build.make muscan/CMakeFiles/Tools.dir/depend
make[2]: Entering directory '/tmp/B.MA95yN/BUILD/museek+-0.2/build'
cd /tmp/B.MA95yN/BUILD/museek+-0.2/build && /usr/bin/cmake -E cmake_depends "Unix Makefiles" /tmp/B.MA95yN/BUILD/museek+-0.2 /tmp/B.MA95yN/BUILD/museek+-0.2/Mucipher /tmp/B.MA95yN/BUILD/museek+-0.2/build /tmp/B.MA95yN/BUILD/museek+-0.2/build/Mucipher /tmp/B.MA95yN/BUILD/museek+-0.2/build/Mucipher/CMakeFiles/Mucipher.dir/DependInfo.cmake --color=
Scanning dependencies of target Mucipher
make[2]: Leaving directory '/tmp/B.MA95yN/BUILD/museek+-0.2/build'
/usr/bin/make -f Mucipher/CMakeFiles/Mucipher.dir/build.make Mucipher/CMakeFiles/Mucipher.dir/build
make[2]: Entering directory '/tmp/B.MA95yN/BUILD/museek+-0.2/build'
cd /tmp/B.MA95yN/BUILD/museek+-0.2/build && /usr/bin/cmake -E cmake_depends "Unix Makefiles" /tmp/B.MA95yN/BUILD/museek+-0.2 /tmp/B.MA95yN/BUILD/museek+-0.2/muscan /tmp/B.MA95yN/BUILD/museek+-0.2/build /tmp/B.MA95yN/BUILD/museek+-0.2/build/muscan /tmp/B.MA95yN/BUILD/museek+-0.2/build/muscan/CMakeFiles/Tools.dir/DependInfo.cmake --color=
Scanning dependencies of target Tools
make[2]: Leaving directory '/tmp/B.MA95yN/BUILD/museek+-0.2/build'
/usr/bin/make -f muscan/CMakeFiles/Tools.dir/build.make muscan/CMakeFiles/Tools.dir/build
make[2]: Entering directory '/tmp/B.MA95yN/BUILD/museek+-0.2/build'
cd /tmp/B.MA95yN/BUILD/museek+-0.2/build && /usr/bin/cmake -E cmake_depends "Unix Makefiles" /tmp/B.MA95yN/BUILD/museek+-0.2 /tmp/B.MA95yN/BUILD/museek+-0.2/NewNet /tmp/B.MA95yN/BUILD/museek+-0.2/build /tmp/B.MA95yN/BUILD/museek+-0.2/build/NewNet /tmp/B.MA95yN/BUILD/museek+-0.2/build/NewNet/CMakeFiles/NewNet.dir/DependInfo.cmake --color=
Scanning dependencies of target NewNet
make[2]: Leaving directory '/tmp/B.MA95yN/BUILD/museek+-0.2/build'
/usr/bin/make -f NewNet/CMakeFiles/NewNet.dir/build.make NewNet/CMakeFiles/NewNet.dir/build
make[2]: Entering directory '/tmp/B.MA95yN/BUILD/museek+-0.2/build'
[  2%] Building CXX object Mucipher/CMakeFiles/Mucipher.dir/hexdigest.cpp.o
cd /tmp/B.MA95yN/BUILD/museek+-0.2/build/Mucipher && /usr/bin/x86_64-pld-linux-g++   -DHAVE_CONFIG_H -DHAVE_SYSTEM_H -DNN_PTR_DEBUG -DNN_PTR_DEBUG_ASSERT -I/tmp/B.MA95yN/BUILD/museek+-0.2/. -I/tmp/B.MA95yN/BUILD/museek+-0.2/build  -O2 -fwrapv -pipe -Wformat -Werror=format-security -gdwarf-4 -fno-debug-types-section -fvar-tracking-assignments -g2 -Wp,-D_FORTIFY_SOURCE=2 -fstack-protector-strong --param=ssp-buffer-size=4 -fPIC -march=x86-64 -gdwarf-4 -fno-debug-types-section -fvar-tracking-assignments -g2  -std=c++0x   -o CMakeFiles/Mucipher.dir/hexdigest.cpp.o -c /tmp/B.MA95yN/BUILD/museek+-0.2/Mucipher/hexdigest.cpp
make[2]: Leaving directory '/tmp/B.MA95yN/BUILD/museek+-0.2/build'
make[2]: Entering directory '/tmp/B.MA95yN/BUILD/museek+-0.2/build'
[  2%] Building C object muscan/CMakeFiles/Tools.dir/mp3.c.o
cd /tmp/B.MA95yN/BUILD/museek+-0.2/build/muscan && /usr/bin/x86_64-pld-linux-gcc  -DHAVE_CONFIG_H -DHAVE_SYSTEM_H -DNN_PTR_DEBUG -DNN_PTR_DEBUG_ASSERT -I/tmp/B.MA95yN/BUILD/museek+-0.2/. -I/tmp/B.MA95yN/BUILD/museek+-0.2/build  -O2 -fwrapv -pipe -Wformat -Werror=format-security -gdwarf-4 -fno-debug-types-section -fvar-tracking-assignments -g2 -Wp,-D_FORTIFY_SOURCE=2 -fstack-protector-strong --param=ssp-buffer-size=4 -fPIC -march=x86-64 -gdwarf-4 -fno-debug-types-section -fvar-tracking-assignments -g2  -DNDEBUG -DQT_NO_DEBUG   -I/usr/include/libxml++-2.6 -I/usr/lib64/libxml++-2.6/include -I/usr/include/libxml2 -I/usr/include/glibmm-2.4 -I/usr/lib64/glibmm-2.4/include -I/usr/include/glib-2.0 -I/usr/lib64/glib-2.0/include -I/usr/include/sigc++-2.0 -I/usr/lib64/sigc++-2.0/include -o CMakeFiles/Tools.dir/mp3.c.o   -c /tmp/B.MA95yN/BUILD/museek+-0.2/muscan/mp3.c
make[2]: Leaving directory '/tmp/B.MA95yN/BUILD/museek+-0.2/build'
make[2]: Entering directory '/tmp/B.MA95yN/BUILD/museek+-0.2/build'
[  3%] Building CXX object muscan/CMakeFiles/Tools.dir/scandir.cc.o
cd /tmp/B.MA95yN/BUILD/museek+-0.2/build/muscan && /usr/bin/x86_64-pld-linux-g++   -DHAVE_CONFIG_H -DHAVE_SYSTEM_H -DNN_PTR_DEBUG -DNN_PTR_DEBUG_ASSERT -I/tmp/B.MA95yN/BUILD/museek+-0.2/. -I/tmp/B.MA95yN/BUILD/museek+-0.2/build  -O2 -fwrapv -pipe -Wformat -Werror=format-security -gdwarf-4 -fno-debug-types-section -fvar-tracking-assignments -g2 -Wp,-D_FORTIFY_SOURCE=2 -fstack-protector-strong --param=ssp-buffer-size=4 -fPIC -march=x86-64 -gdwarf-4 -fno-debug-types-section -fvar-tracking-assignments -g2  -std=c++0x   -I/usr/include/libxml++-2.6 -I/usr/lib64/libxml++-2.6/include -I/usr/include/libxml2 -I/usr/include/glibmm-2.4 -I/usr/lib64/glibmm-2.4/include -I/usr/include/glib-2.0 -I/usr/lib64/glib-2.0/include -I/usr/include/sigc++-2.0 -I/usr/lib64/sigc++-2.0/include -o CMakeFiles/Tools.dir/scandir.cc.o -c /tmp/B.MA95yN/BUILD/museek+-0.2/muscan/scandir.cc
make[2]: Leaving directory '/tmp/B.MA95yN/BUILD/museek+-0.2/build'
make[2]: Entering directory '/tmp/B.MA95yN/BUILD/museek+-0.2/build'
[  1%] Swig source
cd /tmp/B.MA95yN/BUILD/museek+-0.2/build/Mucipher/PyMucipher && /usr/bin/cmake -E make_directory /tmp/B.MA95yN/BUILD/museek+-0.2/build/Mucipher/PyMucipher
cd /tmp/B.MA95yN/BUILD/museek+-0.2/build/Mucipher/PyMucipher && /usr/bin/swig -python -includeall -outdir /tmp/B.MA95yN/BUILD/museek+-0.2/build/Mucipher/PyMucipher -c++ -I/tmp/B.MA95yN/BUILD/museek+-0.2/. -I/tmp/B.MA95yN/BUILD/museek+-0.2/build -I/usr/include/python2.7 -I/tmp/B.MA95yN/BUILD/museek+-0.2/Mucipher/PyMucipher -o /tmp/B.MA95yN/BUILD/museek+-0.2/build/Mucipher/PyMucipher/mucipherPYTHON_wrap.cxx /tmp/B.MA95yN/BUILD/museek+-0.2/Mucipher/PyMucipher/mucipher.i
make[2]: Leaving directory '/tmp/B.MA95yN/BUILD/museek+-0.2/build'
make[2]: Entering directory '/tmp/B.MA95yN/BUILD/museek+-0.2/build'
[  2%] Building CXX object NewNet/CMakeFiles/NewNet.dir/nnbuffer.cpp.o
cd /tmp/B.MA95yN/BUILD/museek+-0.2/build/NewNet && /usr/bin/x86_64-pld-linux-g++   -DHAVE_CONFIG_H -DHAVE_SYSTEM_H -DNN_PTR_DEBUG -DNN_PTR_DEBUG_ASSERT -I/tmp/B.MA95yN/BUILD/museek+-0.2/. -I/tmp/B.MA95yN/BUILD/museek+-0.2/build  -O2 -fwrapv -pipe -Wformat -Werror=format-security -gdwarf-4 -fno-debug-types-section -fvar-tracking-assignments -g2 -Wp,-D_FORTIFY_SOURCE=2 -fstack-protector-strong --param=ssp-buffer-size=4 -fPIC -march=x86-64 -gdwarf-4 -fno-debug-types-section -fvar-tracking-assignments -g2  -std=c++0x   -o CMakeFiles/NewNet.dir/nnbuffer.cpp.o -c /tmp/B.MA95yN/BUILD/museek+-0.2/NewNet/nnbuffer.cpp
make[2]: Leaving directory '/tmp/B.MA95yN/BUILD/museek+-0.2/build'
make[2]: Entering directory '/tmp/B.MA95yN/BUILD/museek+-0.2/build'
cd /tmp/B.MA95yN/BUILD/museek+-0.2/build && /usr/bin/cmake -E cmake_depends "Unix Makefiles" /tmp/B.MA95yN/BUILD/museek+-0.2 /tmp/B.MA95yN/BUILD/museek+-0.2/Mucipher/PyMucipher /tmp/B.MA95yN/BUILD/museek+-0.2/build /tmp/B.MA95yN/BUILD/museek+-0.2/build/Mucipher/PyMucipher /tmp/B.MA95yN/BUILD/museek+-0.2/build/Mucipher/PyMucipher/CMakeFiles/_mucipherc.dir/DependInfo.cmake --color=
Scanning dependencies of target _mucipherc
make[2]: Leaving directory '/tmp/B.MA95yN/BUILD/museek+-0.2/build'
/usr/bin/make -f Mucipher/PyMucipher/CMakeFiles/_mucipherc.dir/build.make Mucipher/PyMucipher/CMakeFiles/_mucipherc.dir/build
make[2]: Entering directory '/tmp/B.MA95yN/BUILD/museek+-0.2/build'
[  3%] Building CXX object Mucipher/CMakeFiles/Mucipher.dir/md5.cpp.o
cd /tmp/B.MA95yN/BUILD/museek+-0.2/build/Mucipher && /usr/bin/x86_64-pld-linux-g++   -DHAVE_CONFIG_H -DHAVE_SYSTEM_H -DNN_PTR_DEBUG -DNN_PTR_DEBUG_ASSERT -I/tmp/B.MA95yN/BUILD/museek+-0.2/. -I/tmp/B.MA95yN/BUILD/museek+-0.2/build  -O2 -fwrapv -pipe -Wformat -Werror=format-security -gdwarf-4 -fno-debug-types-section -fvar-tracking-assignments -g2 -Wp,-D_FORTIFY_SOURCE=2 -fstack-protector-strong --param=ssp-buffer-size=4 -fPIC -march=x86-64 -gdwarf-4 -fno-debug-types-section -fvar-tracking-assignments -g2  -std=c++0x   -o CMakeFiles/Mucipher.dir/md5.cpp.o -c /tmp/B.MA95yN/BUILD/museek+-0.2/Mucipher/md5.cpp
make[2]: Leaving directory '/tmp/B.MA95yN/BUILD/museek+-0.2/build'
make[2]: Entering directory '/tmp/B.MA95yN/BUILD/museek+-0.2/build'
[  1%] Building CXX object Mucipher/CMakeFiles/Mucipher.dir/aes.cpp.o
cd /tmp/B.MA95yN/BUILD/museek+-0.2/build/Mucipher && /usr/bin/x86_64-pld-linux-g++   -DHAVE_CONFIG_H -DHAVE_SYSTEM_H -DNN_PTR_DEBUG -DNN_PTR_DEBUG_ASSERT -I/tmp/B.MA95yN/BUILD/museek+-0.2/. -I/tmp/B.MA95yN/BUILD/museek+-0.2/build  -O2 -fwrapv -pipe -Wformat -Werror=format-security -gdwarf-4 -fno-debug-types-section -fvar-tracking-assignments -g2 -Wp,-D_FORTIFY_SOURCE=2 -fstack-protector-strong --param=ssp-buffer-size=4 -fPIC -march=x86-64 -gdwarf-4 -fno-debug-types-section -fvar-tracking-assignments -g2  -std=c++0x   -o CMakeFiles/Mucipher.dir/aes.cpp.o -c /tmp/B.MA95yN/BUILD/museek+-0.2/Mucipher/aes.cpp
/tmp/B.MA95yN/BUILD/museek+-0.2/Mucipher/aes.cpp: In function 'int aes_set_key(void*, const u8*, unsigned int)':
/tmp/B.MA95yN/BUILD/museek+-0.2/Mucipher/aes.cpp:280:23: warning: iteration 6 invokes undefined behavior [-Waggressive-loop-optimizations]
     E_KEY[8 * i + 12] = t;                \
                       ^
/tmp/B.MA95yN/BUILD/museek+-0.2/Mucipher/aes.cpp:323:4: note: in expansion of macro 'loop8'
    loop8 (i);
    ^~~~~
/tmp/B.MA95yN/BUILD/museek+-0.2/Mucipher/aes.cpp:322:17: note: within this loop
   for (i = 0; i < 7; ++i)
               ~~^~~
make[2]: Leaving directory '/tmp/B.MA95yN/BUILD/museek+-0.2/build'
make[2]: Entering directory '/tmp/B.MA95yN/BUILD/museek+-0.2/build'
[  5%] Building CXX object Mucipher/CMakeFiles/Mucipher.dir/sha.cpp.o
cd /tmp/B.MA95yN/BUILD/museek+-0.2/build/Mucipher && /usr/bin/x86_64-pld-linux-g++   -DHAVE_CONFIG_H -DHAVE_SYSTEM_H -DNN_PTR_DEBUG -DNN_PTR_DEBUG_ASSERT -I/tmp/B.MA95yN/BUILD/museek+-0.2/. -I/tmp/B.MA95yN/BUILD/museek+-0.2/build  -O2 -fwrapv -pipe -Wformat -Werror=format-security -gdwarf-4 -fno-debug-types-section -fvar-tracking-assignments -g2 -Wp,-D_FORTIFY_SOURCE=2 -fstack-protector-strong --param=ssp-buffer-size=4 -fPIC -march=x86-64 -gdwarf-4 -fno-debug-types-section -fvar-tracking-assignments -g2  -std=c++0x   -o CMakeFiles/Mucipher.dir/sha.cpp.o -c /tmp/B.MA95yN/BUILD/museek+-0.2/Mucipher/sha.cpp
make[2]: Leaving directory '/tmp/B.MA95yN/BUILD/museek+-0.2/build'
make[2]: Entering directory '/tmp/B.MA95yN/BUILD/museek+-0.2/build'
[  5%] Building CXX object NewNet/CMakeFiles/NewNet.dir/nnclientsocket.cpp.o
cd /tmp/B.MA95yN/BUILD/museek+-0.2/build/NewNet && /usr/bin/x86_64-pld-linux-g++   -DHAVE_CONFIG_H -DHAVE_SYSTEM_H -DNN_PTR_DEBUG -DNN_PTR_DEBUG_ASSERT -I/tmp/B.MA95yN/BUILD/museek+-0.2/. -I/tmp/B.MA95yN/BUILD/museek+-0.2/build  -O2 -fwrapv -pipe -Wformat -Werror=format-security -gdwarf-4 -fno-debug-types-section -fvar-tracking-assignments -g2 -Wp,-D_FORTIFY_SOURCE=2 -fstack-protector-strong --param=ssp-buffer-size=4 -fPIC -march=x86-64 -gdwarf-4 -fno-debug-types-section -fvar-tracking-assignments -g2  -std=c++0x   -o CMakeFiles/NewNet.dir/nnclientsocket.cpp.o -c /tmp/B.MA95yN/BUILD/museek+-0.2/NewNet/nnclientsocket.cpp
In file included from /tmp/B.MA95yN/BUILD/museek+-0.2/NewNet/nnclientsocket.h:24:0,
                 from /tmp/B.MA95yN/BUILD/museek+-0.2/NewNet/nnclientsocket.cpp:21:
/tmp/B.MA95yN/BUILD/museek+-0.2/NewNet/nnsocket.h: In constructor 'NewNet::Socket::Socket()':
/tmp/B.MA95yN/BUILD/museek+-0.2/NewNet/nnsocket.h:89:22: error: 'struct event' has no member named 'ev_flags'; did you mean 'ev_fd'?
         m_EventData->ev_flags = 0; // This event has not been initialized
                      ^~~~~~~~
make[2]: *** [NewNet/CMakeFiles/NewNet.dir/build.make:90: NewNet/CMakeFiles/NewNet.dir/nnclientsocket.cpp.o] Error 1
make[2]: Leaving directory '/tmp/B.MA95yN/BUILD/museek+-0.2/build'
make[1]: *** [CMakeFiles/Makefile2:89: NewNet/CMakeFiles/NewNet.dir/all] Error 2
make[1]: *** Waiting for unfinished jobs....
make[2]: Entering directory '/tmp/B.MA95yN/BUILD/museek+-0.2/build'
[  6%] Building CXX object Mucipher/CMakeFiles/Mucipher.dir/sha256.cpp.o
cd /tmp/B.MA95yN/BUILD/museek+-0.2/build/Mucipher && /usr/bin/x86_64-pld-linux-g++   -DHAVE_CONFIG_H -DHAVE_SYSTEM_H -DNN_PTR_DEBUG -DNN_PTR_DEBUG_ASSERT -I/tmp/B.MA95yN/BUILD/museek+-0.2/. -I/tmp/B.MA95yN/BUILD/museek+-0.2/build  -O2 -fwrapv -pipe -Wformat -Werror=format-security -gdwarf-4 -fno-debug-types-section -fvar-tracking-assignments -g2 -Wp,-D_FORTIFY_SOURCE=2 -fstack-protector-strong --param=ssp-buffer-size=4 -fPIC -march=x86-64 -gdwarf-4 -fno-debug-types-section -fvar-tracking-assignments -g2  -std=c++0x   -o CMakeFiles/Mucipher.dir/sha256.cpp.o -c /tmp/B.MA95yN/BUILD/museek+-0.2/Mucipher/sha256.cpp
make[2]: Leaving directory '/tmp/B.MA95yN/BUILD/museek+-0.2/build'
make[2]: Entering directory '/tmp/B.MA95yN/BUILD/museek+-0.2/build'
[  7%] Building CXX object Mucipher/PyMucipher/CMakeFiles/_mucipherc.dir/__/hexdigest.cpp.o
cd /tmp/B.MA95yN/BUILD/museek+-0.2/build/Mucipher/PyMucipher && /usr/bin/x86_64-pld-linux-g++   -DHAVE_CONFIG_H -DHAVE_SYSTEM_H -DNN_PTR_DEBUG -DNN_PTR_DEBUG_ASSERT -D_mucipherc_EXPORTS -I/tmp/B.MA95yN/BUILD/museek+-0.2/. -I/tmp/B.MA95yN/BUILD/museek+-0.2/build -I/usr/include/python2.7 -I/tmp/B.MA95yN/BUILD/museek+-0.2/Mucipher/PyMucipher  -O2 -fwrapv -pipe -Wformat -Werror=format-security -gdwarf-4 -fno-debug-types-section -fvar-tracking-assignments -g2 -Wp,-D_FORTIFY_SOURCE=2 -fstack-protector-strong --param=ssp-buffer-size=4 -fPIC -march=x86-64 -gdwarf-4 -fno-debug-types-section -fvar-tracking-assignments -g2  -std=c++0x -fPIC   -o CMakeFiles/_mucipherc.dir/__/hexdigest.cpp.o -c /tmp/B.MA95yN/BUILD/museek+-0.2/Mucipher/hexdigest.cpp
make[2]: Leaving directory '/tmp/B.MA95yN/BUILD/museek+-0.2/build'
make[2]: Entering directory '/tmp/B.MA95yN/BUILD/museek+-0.2/build'
[  7%] Linking CXX static library libMucipher.a
cd /tmp/B.MA95yN/BUILD/museek+-0.2/build/Mucipher && /usr/bin/cmake -P CMakeFiles/Mucipher.dir/cmake_clean_target.cmake
cd /tmp/B.MA95yN/BUILD/museek+-0.2/build/Mucipher && /usr/bin/cmake -E cmake_link_script CMakeFiles/Mucipher.dir/link.txt --verbose=1
/usr/bin/ar qc libMucipher.a  CMakeFiles/Mucipher.dir/aes.cpp.o CMakeFiles/Mucipher.dir/hexdigest.cpp.o CMakeFiles/Mucipher.dir/md5.cpp.o CMakeFiles/Mucipher.dir/sha.cpp.o CMakeFiles/Mucipher.dir/sha256.cpp.o
/usr/bin/ranlib libMucipher.a
make[2]: Leaving directory '/tmp/B.MA95yN/BUILD/museek+-0.2/build'
make[1]: Entering directory '/tmp/B.MA95yN/BUILD/museek+-0.2/build'
[  7%] Built target Mucipher
make[1]: Leaving directory '/tmp/B.MA95yN/BUILD/museek+-0.2/build'
make[2]: Entering directory '/tmp/B.MA95yN/BUILD/museek+-0.2/build'
[  5%] Building CXX object Mucipher/PyMucipher/CMakeFiles/_mucipherc.dir/__/aes.cpp.o
cd /tmp/B.MA95yN/BUILD/museek+-0.2/build/Mucipher/PyMucipher && /usr/bin/x86_64-pld-linux-g++   -DHAVE_CONFIG_H -DHAVE_SYSTEM_H -DNN_PTR_DEBUG -DNN_PTR_DEBUG_ASSERT -D_mucipherc_EXPORTS -I/tmp/B.MA95yN/BUILD/museek+-0.2/. -I/tmp/B.MA95yN/BUILD/museek+-0.2/build -I/usr/include/python2.7 -I/tmp/B.MA95yN/BUILD/museek+-0.2/Mucipher/PyMucipher  -O2 -fwrapv -pipe -Wformat -Werror=format-security -gdwarf-4 -fno-debug-types-section -fvar-tracking-assignments -g2 -Wp,-D_FORTIFY_SOURCE=2 -fstack-protector-strong --param=ssp-buffer-size=4 -fPIC -march=x86-64 -gdwarf-4 -fno-debug-types-section -fvar-tracking-assignments -g2  -std=c++0x -fPIC   -o CMakeFiles/_mucipherc.dir/__/aes.cpp.o -c /tmp/B.MA95yN/BUILD/museek+-0.2/Mucipher/aes.cpp
/tmp/B.MA95yN/BUILD/museek+-0.2/Mucipher/aes.cpp: In function 'int aes_set_key(void*, const u8*, unsigned int)':
/tmp/B.MA95yN/BUILD/museek+-0.2/Mucipher/aes.cpp:280:23: warning: iteration 6 invokes undefined behavior [-Waggressive-loop-optimizations]
     E_KEY[8 * i + 12] = t;                \
                       ^
/tmp/B.MA95yN/BUILD/museek+-0.2/Mucipher/aes.cpp:323:4: note: in expansion of macro 'loop8'
    loop8 (i);
    ^~~~~
/tmp/B.MA95yN/BUILD/museek+-0.2/Mucipher/aes.cpp:322:17: note: within this loop
   for (i = 0; i < 7; ++i)
               ~~^~~
make[2]: Leaving directory '/tmp/B.MA95yN/BUILD/museek+-0.2/build'
make[2]: Entering directory '/tmp/B.MA95yN/BUILD/museek+-0.2/build'
[  5%] Building CXX object Mucipher/PyMucipher/CMakeFiles/_mucipherc.dir/mucipherPYTHON_wrap.cxx.o
cd /tmp/B.MA95yN/BUILD/museek+-0.2/build/Mucipher/PyMucipher && /usr/bin/x86_64-pld-linux-g++   -DHAVE_CONFIG_H -DHAVE_SYSTEM_H -DNN_PTR_DEBUG -DNN_PTR_DEBUG_ASSERT -D_mucipherc_EXPORTS -I/tmp/B.MA95yN/BUILD/museek+-0.2/. -I/tmp/B.MA95yN/BUILD/museek+-0.2/build -I/usr/include/python2.7 -I/tmp/B.MA95yN/BUILD/museek+-0.2/Mucipher/PyMucipher  -O2 -fwrapv -pipe -Wformat -Werror=format-security -gdwarf-4 -fno-debug-types-section -fvar-tracking-assignments -g2 -Wp,-D_FORTIFY_SOURCE=2 -fstack-protector-strong --param=ssp-buffer-size=4 -fPIC -march=x86-64 -gdwarf-4 -fno-debug-types-section -fvar-tracking-assignments -g2  -std=c++0x -fPIC   -o CMakeFiles/_mucipherc.dir/mucipherPYTHON_wrap.cxx.o -c /tmp/B.MA95yN/BUILD/museek+-0.2/build/Mucipher/PyMucipher/mucipherPYTHON_wrap.cxx
make[2]: Leaving directory '/tmp/B.MA95yN/BUILD/museek+-0.2/build'
make[2]: Entering directory '/tmp/B.MA95yN/BUILD/museek+-0.2/build'
[  8%] Building CXX object Mucipher/PyMucipher/CMakeFiles/_mucipherc.dir/__/sha.cpp.o
cd /tmp/B.MA95yN/BUILD/museek+-0.2/build/Mucipher/PyMucipher && /usr/bin/x86_64-pld-linux-g++   -DHAVE_CONFIG_H -DHAVE_SYSTEM_H -DNN_PTR_DEBUG -DNN_PTR_DEBUG_ASSERT -D_mucipherc_EXPORTS -I/tmp/B.MA95yN/BUILD/museek+-0.2/. -I/tmp/B.MA95yN/BUILD/museek+-0.2/build -I/usr/include/python2.7 -I/tmp/B.MA95yN/BUILD/museek+-0.2/Mucipher/PyMucipher  -O2 -fwrapv -pipe -Wformat -Werror=format-security -gdwarf-4 -fno-debug-types-section -fvar-tracking-assignments -g2 -Wp,-D_FORTIFY_SOURCE=2 -fstack-protector-strong --param=ssp-buffer-size=4 -fPIC -march=x86-64 -gdwarf-4 -fno-debug-types-section -fvar-tracking-assignments -g2  -std=c++0x -fPIC   -o CMakeFiles/_mucipherc.dir/__/sha.cpp.o -c /tmp/B.MA95yN/BUILD/museek+-0.2/Mucipher/sha.cpp
make[2]: Leaving directory '/tmp/B.MA95yN/BUILD/museek+-0.2/build'
make[2]: Entering directory '/tmp/B.MA95yN/BUILD/museek+-0.2/build'
[  9%] Building CXX object Mucipher/PyMucipher/CMakeFiles/_mucipherc.dir/__/wraphelp.cpp.o
cd /tmp/B.MA95yN/BUILD/museek+-0.2/build/Mucipher/PyMucipher && /usr/bin/x86_64-pld-linux-g++   -DHAVE_CONFIG_H -DHAVE_SYSTEM_H -DNN_PTR_DEBUG -DNN_PTR_DEBUG_ASSERT -D_mucipherc_EXPORTS -I/tmp/B.MA95yN/BUILD/museek+-0.2/. -I/tmp/B.MA95yN/BUILD/museek+-0.2/build -I/usr/include/python2.7 -I/tmp/B.MA95yN/BUILD/museek+-0.2/Mucipher/PyMucipher  -O2 -fwrapv -pipe -Wformat -Werror=format-security -gdwarf-4 -fno-debug-types-section -fvar-tracking-assignments -g2 -Wp,-D_FORTIFY_SOURCE=2 -fstack-protector-strong --param=ssp-buffer-size=4 -fPIC -march=x86-64 -gdwarf-4 -fno-debug-types-section -fvar-tracking-assignments -g2  -std=c++0x -fPIC   -o CMakeFiles/_mucipherc.dir/__/wraphelp.cpp.o -c /tmp/B.MA95yN/BUILD/museek+-0.2/Mucipher/wraphelp.cpp
make[2]: Leaving directory '/tmp/B.MA95yN/BUILD/museek+-0.2/build'
make[2]: Entering directory '/tmp/B.MA95yN/BUILD/museek+-0.2/build'
[  7%] Building CXX object Mucipher/PyMucipher/CMakeFiles/_mucipherc.dir/__/md5.cpp.o
cd /tmp/B.MA95yN/BUILD/museek+-0.2/build/Mucipher/PyMucipher && /usr/bin/x86_64-pld-linux-g++   -DHAVE_CONFIG_H -DHAVE_SYSTEM_H -DNN_PTR_DEBUG -DNN_PTR_DEBUG_ASSERT -D_mucipherc_EXPORTS -I/tmp/B.MA95yN/BUILD/museek+-0.2/. -I/tmp/B.MA95yN/BUILD/museek+-0.2/build -I/usr/include/python2.7 -I/tmp/B.MA95yN/BUILD/museek+-0.2/Mucipher/PyMucipher  -O2 -fwrapv -pipe -Wformat -Werror=format-security -gdwarf-4 -fno-debug-types-section -fvar-tracking-assignments -g2 -Wp,-D_FORTIFY_SOURCE=2 -fstack-protector-strong --param=ssp-buffer-size=4 -fPIC -march=x86-64 -gdwarf-4 -fno-debug-types-section -fvar-tracking-assignments -g2  -std=c++0x -fPIC   -o CMakeFiles/_mucipherc.dir/__/md5.cpp.o -c /tmp/B.MA95yN/BUILD/museek+-0.2/Mucipher/md5.cpp
make[2]: Leaving directory '/tmp/B.MA95yN/BUILD/museek+-0.2/build'
make[2]: Entering directory '/tmp/B.MA95yN/BUILD/museek+-0.2/build'
[  8%] Building CXX object Mucipher/PyMucipher/CMakeFiles/_mucipherc.dir/__/sha256.cpp.o
cd /tmp/B.MA95yN/BUILD/museek+-0.2/build/Mucipher/PyMucipher && /usr/bin/x86_64-pld-linux-g++   -DHAVE_CONFIG_H -DHAVE_SYSTEM_H -DNN_PTR_DEBUG -DNN_PTR_DEBUG_ASSERT -D_mucipherc_EXPORTS -I/tmp/B.MA95yN/BUILD/museek+-0.2/. -I/tmp/B.MA95yN/BUILD/museek+-0.2/build -I/usr/include/python2.7 -I/tmp/B.MA95yN/BUILD/museek+-0.2/Mucipher/PyMucipher  -O2 -fwrapv -pipe -Wformat -Werror=format-security -gdwarf-4 -fno-debug-types-section -fvar-tracking-assignments -g2 -Wp,-D_FORTIFY_SOURCE=2 -fstack-protector-strong --param=ssp-buffer-size=4 -fPIC -march=x86-64 -gdwarf-4 -fno-debug-types-section -fvar-tracking-assignments -g2  -std=c++0x -fPIC   -o CMakeFiles/_mucipherc.dir/__/sha256.cpp.o -c /tmp/B.MA95yN/BUILD/museek+-0.2/Mucipher/sha256.cpp
make[2]: Leaving directory '/tmp/B.MA95yN/BUILD/museek+-0.2/build'
make[2]: Entering directory '/tmp/B.MA95yN/BUILD/museek+-0.2/build'
[  9%] Linking CXX shared module _mucipherc.so
cd /tmp/B.MA95yN/BUILD/museek+-0.2/build/Mucipher/PyMucipher && /usr/bin/cmake -E cmake_link_script CMakeFiles/_mucipherc.dir/link.txt --verbose=1
/usr/bin/x86_64-pld-linux-g++  -fPIC -O2 -fwrapv -pipe -Wformat -Werror=format-security -gdwarf-4 -fno-debug-types-section -fvar-tracking-assignments -g2 -Wp,-D_FORTIFY_SOURCE=2 -fstack-protector-strong --param=ssp-buffer-size=4 -fPIC -march=x86-64 -gdwarf-4 -fno-debug-types-section -fvar-tracking-assignments -g2  -std=c++0x -Wl,--as-needed -Wl,--no-copy-dt-needed-entries -Wl,-z,relro -Wl,-z,combreloc -shared  -o _mucipherc.so CMakeFiles/_mucipherc.dir/mucipherPYTHON_wrap.cxx.o CMakeFiles/_mucipherc.dir/__/aes.cpp.o CMakeFiles/_mucipherc.dir/__/hexdigest.cpp.o CMakeFiles/_mucipherc.dir/__/md5.cpp.o CMakeFiles/_mucipherc.dir/__/sha.cpp.o CMakeFiles/_mucipherc.dir/__/sha256.cpp.o CMakeFiles/_mucipherc.dir/__/wraphelp.cpp.o -lpython2.7 
make[2]: Leaving directory '/tmp/B.MA95yN/BUILD/museek+-0.2/build'
make[1]: Entering directory '/tmp/B.MA95yN/BUILD/museek+-0.2/build'
[  9%] Built target _mucipherc
make[1]: Leaving directory '/tmp/B.MA95yN/BUILD/museek+-0.2/build'
make[2]: Entering directory '/tmp/B.MA95yN/BUILD/museek+-0.2/build'
[  4%] Building CXX object muscan/CMakeFiles/Tools.dir/scanner.cc.o
cd /tmp/B.MA95yN/BUILD/museek+-0.2/build/muscan && /usr/bin/x86_64-pld-linux-g++   -DHAVE_CONFIG_H -DHAVE_SYSTEM_H -DNN_PTR_DEBUG -DNN_PTR_DEBUG_ASSERT -I/tmp/B.MA95yN/BUILD/museek+-0.2/. -I/tmp/B.MA95yN/BUILD/museek+-0.2/build  -O2 -fwrapv -pipe -Wformat -Werror=format-security -gdwarf-4 -fno-debug-types-section -fvar-tracking-assignments -g2 -Wp,-D_FORTIFY_SOURCE=2 -fstack-protector-strong --param=ssp-buffer-size=4 -fPIC -march=x86-64 -gdwarf-4 -fno-debug-types-section -fvar-tracking-assignments -g2  -std=c++0x   -I/usr/include/libxml++-2.6 -I/usr/lib64/libxml++-2.6/include -I/usr/include/libxml2 -I/usr/include/glibmm-2.4 -I/usr/lib64/glibmm-2.4/include -I/usr/include/glib-2.0 -I/usr/lib64/glib-2.0/include -I/usr/include/sigc++-2.0 -I/usr/lib64/sigc++-2.0/include -o CMakeFiles/Tools.dir/scanner.cc.o -c /tmp/B.MA95yN/BUILD/museek+-0.2/muscan/scanner.cc
make[2]: Leaving directory '/tmp/B.MA95yN/BUILD/museek+-0.2/build'
make[2]: Entering directory '/tmp/B.MA95yN/BUILD/museek+-0.2/build'
[  9%] Linking CXX static library libTools.a
cd /tmp/B.MA95yN/BUILD/museek+-0.2/build/muscan && /usr/bin/cmake -P CMakeFiles/Tools.dir/cmake_clean_target.cmake
cd /tmp/B.MA95yN/BUILD/museek+-0.2/build/muscan && /usr/bin/cmake -E cmake_link_script CMakeFiles/Tools.dir/link.txt --verbose=1
/usr/bin/ar qc libTools.a  CMakeFiles/Tools.dir/mp3.c.o CMakeFiles/Tools.dir/scandir.cc.o CMakeFiles/Tools.dir/scanner.cc.o
/usr/bin/ranlib libTools.a
make[2]: Leaving directory '/tmp/B.MA95yN/BUILD/museek+-0.2/build'
make[1]: Entering directory '/tmp/B.MA95yN/BUILD/museek+-0.2/build'
[  9%] Built target Tools
make[1]: Leaving directory '/tmp/B.MA95yN/BUILD/museek+-0.2/build'
make: *** [Makefile:131: all] Error 2
error: Bad exit status from /tmp/B.MA95yN/BUILD/tmp/rpm-tmp.90745 (%build)


RPM build errors:
    Bad exit status from /tmp/B.MA95yN/BUILD/tmp/rpm-tmp.90745 (%build)
ended at: Thu Apr 13 20:34:22 2017, done in 0:00:12.092719
error: No files produced.
mesg: ttyname failed: Inappropriate ioctl for device
+ chmod -R u+rwX /tmp/B.MA95yN/BUILD
+ rm -rf /tmp/B.MA95yN/tmp /tmp/B.MA95yN/BUILD
mesg: ttyname failed: Inappropriate ioctl for device
+ rm -rf /tmp/B.MA95yN
Begin-PLD-Builder-Info
Build-Time: user:11.17s sys:1.93s real:15.47s (faults io:0 non-io:714175)

End-PLD-Builder-Info
[Back to list of logs] [View rpm -qa of builder]