FailedOk

th/SRPMS[OK]
th/x32[OK]
th/i686[OK]
th/x86_64[OK]

ac/SRPMS[OK]
ac/i386[OK]
ac/i586[OK]
ac/i686[OK]
ac/alpha[OK]
ac/amd64[OK]
ac/athlon[OK]
ac/ppc[OK]
ac/sparc[OK]
ac/sparc64[OK]

Advanced Search
main()
Powered by PLD Linux
(c) 2002-2018 PLD Team
$Revision: 1.37 $
Powered by Multics.
Your IP: 52.91.245.237

mysqlcppapi febb450b-d957-4a4c-9a7b-282e59725c2b

Status:Failed
Source URL:ftp://buildlogs.pld-linux.org/th/x86_64/FAIL/mysqlcppapi,febb450b-d957-4a4c-9a7b-282e59725c2b.bz2
text/plain URL:View!
full text:View!
rpm -qa of builder:View!
Date:2018/03/07 11:12:44
Runtime:0:00:24.848232

Toc:

  • error 1
  • ../mysqlcppapi/const_subscript_container.h:119:14: error: 'operator=' was not declared in this scope, and no declarations were found by argument-dependent lookup at the point of instantiation [-fpermissive]
  • error 2
  • make[2]: *** [Makefile:434: complic1.o] Error 1
  • error 3
  • ../mysqlcppapi/const_subscript_container.h:119:14: error: 'operator=' was not declared in this scope, and no declarations were found by argument-dependent lookup at the point of instantiation [-fpermissive]
  • error 4
  • make[2]: *** [Makefile:434: simple1.o] Error 1
  • error 5
  • ../mysqlcppapi/const_subscript_container.h:119:14: error: 'operator=' was not declared in this scope, and no declarations were found by argument-dependent lookup at the point of instantiation [-fpermissive]
  • error 6
  • make[2]: *** [Makefile:434: sinisa_ex.o] Error 1
  • error 7
  • make[1]: *** [Makefile:469: all-recursive] Error 1
  • error 8
  • error: Bad exit status from /tmp/B.jZz373/BUILD/tmp/rpm-tmp.47057 (%build)
  • error 9
  • RPM build errors:
  • error 10
  • error: No files produced.

Content:

../../mysqlcppapi/Connection.h:127:35: warning: dynamic exception specifications are deprecated in C++11 [-Wdeprecated]
   void check_connection_is_open() throw(ex_base);
                                   ^~~~~
libtool: compile:  x86_64-pld-linux-g++ -DHAVE_CONFIG_H -I. -I../.. -I../.. -I/usr/include/mysql -O2 -fwrapv -pipe -Wformat -Werror=format-security -gdwarf-4 -fno-debug-types-section -fvar-tracking-assignments -g2 -Wp,-D_FORTIFY_SOURCE=2 -fstack-protector-strong --param=ssp-buffer-size=4 -fPIC -march=x86-64 -gdwarf-4 -fno-debug-types-section -fvar-tracking-assignments -g2 -MT Result_Use.lo -MD -MP -MF .deps/Result_Use.Tpo -c Result_Use.cc -o Result_Use.o >/dev/null 2>&1
mv -f .deps/Result_Use.Tpo .deps/Result_Use.Plo
make[3]: Leaving directory '/tmp/B.jZz373/BUILD/mysqlcppapi-2.0.0/mysqlcppapi/query_results'
make[3]: Entering directory '/tmp/B.jZz373/BUILD/mysqlcppapi-2.0.0/mysqlcppapi/query_results'
/bin/sh ../../libtool  --tag=CXX   --mode=link x86_64-pld-linux-g++ -I/usr/include/mysql  -O2 -fwrapv -pipe -Wformat -Werror=format-security -gdwarf-4 -fno-debug-types-section -fvar-tracking-assignments -g2 -Wp,-D_FORTIFY_SOURCE=2 -fstack-protector-strong --param=ssp-buffer-size=4 -fPIC -march=x86-64 -gdwarf-4 -fno-debug-types-section -fvar-tracking-assignments -g2   -Wl,--as-needed -Wl,--no-copy-dt-needed-entries -Wl,-z,relro -Wl,-z,combreloc  -o libquery_results.la   Allocator_Result.lo Result_Store.lo Result_NoData.lo Result_Use.lo  -lmysqlclient -lnsl 
libtool: link: ar cru .libs/libquery_results.a .libs/Allocator_Result.o .libs/Result_Store.o .libs/Result_NoData.o .libs/Result_Use.o 
libtool: link: ranlib .libs/libquery_results.a
libtool: link: ( cd ".libs" && rm -f "libquery_results.la" && ln -s "../libquery_results.la" "libquery_results.la" )
make[3]: Leaving directory '/tmp/B.jZz373/BUILD/mysqlcppapi-2.0.0/mysqlcppapi/query_results'
Making all in row
make[3]: Entering directory '/tmp/B.jZz373/BUILD/mysqlcppapi-2.0.0/mysqlcppapi/row'
/bin/sh ../../libtool  --tag=CXX   --mode=compile x86_64-pld-linux-g++ -DHAVE_CONFIG_H -I. -I../.. -I../..   -I/usr/include/mysql  -O2 -fwrapv -pipe -Wformat -Werror=format-security -gdwarf-4 -fno-debug-types-section -fvar-tracking-assignments -g2 -Wp,-D_FORTIFY_SOURCE=2 -fstack-protector-strong --param=ssp-buffer-size=4 -fPIC -march=x86-64 -gdwarf-4 -fno-debug-types-section -fvar-tracking-assignments -g2  -MT Row.lo -MD -MP -MF .deps/Row.Tpo -c -o Row.lo Row.cc
libtool: compile:  x86_64-pld-linux-g++ -DHAVE_CONFIG_H -I. -I../.. -I../.. -I/usr/include/mysql -O2 -fwrapv -pipe -Wformat -Werror=format-security -gdwarf-4 -fno-debug-types-section -fvar-tracking-assignments -g2 -Wp,-D_FORTIFY_SOURCE=2 -fstack-protector-strong --param=ssp-buffer-size=4 -fPIC -march=x86-64 -gdwarf-4 -fno-debug-types-section -fvar-tracking-assignments -g2 -MT Row.lo -MD -MP -MF .deps/Row.Tpo -c Row.cc  -fPIC -DPIC -o .libs/Row.o
libtool: compile:  x86_64-pld-linux-g++ -DHAVE_CONFIG_H -I. -I../.. -I../.. -I/usr/include/mysql -O2 -fwrapv -pipe -Wformat -Werror=format-security -gdwarf-4 -fno-debug-types-section -fvar-tracking-assignments -g2 -Wp,-D_FORTIFY_SOURCE=2 -fstack-protector-strong --param=ssp-buffer-size=4 -fPIC -march=x86-64 -gdwarf-4 -fno-debug-types-section -fvar-tracking-assignments -g2 -MT Row.lo -MD -MP -MF .deps/Row.Tpo -c Row.cc -o Row.o >/dev/null 2>&1
mv -f .deps/Row.Tpo .deps/Row.Plo
make[3]: Leaving directory '/tmp/B.jZz373/BUILD/mysqlcppapi-2.0.0/mysqlcppapi/row'
make[3]: Entering directory '/tmp/B.jZz373/BUILD/mysqlcppapi-2.0.0/mysqlcppapi/row'
/bin/sh ../../libtool  --tag=CXX   --mode=link x86_64-pld-linux-g++ -I/usr/include/mysql  -O2 -fwrapv -pipe -Wformat -Werror=format-security -gdwarf-4 -fno-debug-types-section -fvar-tracking-assignments -g2 -Wp,-D_FORTIFY_SOURCE=2 -fstack-protector-strong --param=ssp-buffer-size=4 -fPIC -march=x86-64 -gdwarf-4 -fno-debug-types-section -fvar-tracking-assignments -g2   -Wl,--as-needed -Wl,--no-copy-dt-needed-entries -Wl,-z,relro -Wl,-z,combreloc  -o librow.la   Row.lo  -lmysqlclient -lnsl 
libtool: link: ar cru .libs/librow.a .libs/Row.o 
libtool: link: ranlib .libs/librow.a
libtool: link: ( cd ".libs" && rm -f "librow.la" && ln -s "../librow.la" "librow.la" )
make[3]: Leaving directory '/tmp/B.jZz373/BUILD/mysqlcppapi-2.0.0/mysqlcppapi/row'
Making all in smartpointer
make[3]: Nothing to be done for 'all'.
make[3]: Entering directory '/tmp/B.jZz373/BUILD/mysqlcppapi-2.0.0/mysqlcppapi'
/bin/sh ../libtool  --tag=CXX   --mode=compile x86_64-pld-linux-g++ -DHAVE_CONFIG_H -I. -I.. -I..   -I/usr/include/mysql  -O2 -fwrapv -pipe -Wformat -Werror=format-security -gdwarf-4 -fno-debug-types-section -fvar-tracking-assignments -g2 -Wp,-D_FORTIFY_SOURCE=2 -fstack-protector-strong --param=ssp-buffer-size=4 -fPIC -march=x86-64 -gdwarf-4 -fno-debug-types-section -fvar-tracking-assignments -g2  -MT Allocator_Connection.lo -MD -MP -MF .deps/Allocator_Connection.Tpo -c -o Allocator_Connection.lo Allocator_Connection.cc
libtool: compile:  x86_64-pld-linux-g++ -DHAVE_CONFIG_H -I. -I.. -I.. -I/usr/include/mysql -O2 -fwrapv -pipe -Wformat -Werror=format-security -gdwarf-4 -fno-debug-types-section -fvar-tracking-assignments -g2 -Wp,-D_FORTIFY_SOURCE=2 -fstack-protector-strong --param=ssp-buffer-size=4 -fPIC -march=x86-64 -gdwarf-4 -fno-debug-types-section -fvar-tracking-assignments -g2 -MT Allocator_Connection.lo -MD -MP -MF .deps/Allocator_Connection.Tpo -c Allocator_Connection.cc  -fPIC -DPIC -o .libs/Allocator_Connection.o
libtool: compile:  x86_64-pld-linux-g++ -DHAVE_CONFIG_H -I. -I.. -I.. -I/usr/include/mysql -O2 -fwrapv -pipe -Wformat -Werror=format-security -gdwarf-4 -fno-debug-types-section -fvar-tracking-assignments -g2 -Wp,-D_FORTIFY_SOURCE=2 -fstack-protector-strong --param=ssp-buffer-size=4 -fPIC -march=x86-64 -gdwarf-4 -fno-debug-types-section -fvar-tracking-assignments -g2 -MT Allocator_Connection.lo -MD -MP -MF .deps/Allocator_Connection.Tpo -c Allocator_Connection.cc -o Allocator_Connection.o >/dev/null 2>&1
mv -f .deps/Allocator_Connection.Tpo .deps/Allocator_Connection.Plo
make[3]: Leaving directory '/tmp/B.jZz373/BUILD/mysqlcppapi-2.0.0/mysqlcppapi'
make[3]: Entering directory '/tmp/B.jZz373/BUILD/mysqlcppapi-2.0.0/mysqlcppapi'
/bin/sh ../libtool  --tag=CXX   --mode=compile x86_64-pld-linux-g++ -DHAVE_CONFIG_H -I. -I.. -I..   -I/usr/include/mysql  -O2 -fwrapv -pipe -Wformat -Werror=format-security -gdwarf-4 -fno-debug-types-section -fvar-tracking-assignments -g2 -Wp,-D_FORTIFY_SOURCE=2 -fstack-protector-strong --param=ssp-buffer-size=4 -fPIC -march=x86-64 -gdwarf-4 -fno-debug-types-section -fvar-tracking-assignments -g2  -MT string_util.lo -MD -MP -MF .deps/string_util.Tpo -c -o string_util.lo string_util.cc
libtool: compile:  x86_64-pld-linux-g++ -DHAVE_CONFIG_H -I. -I.. -I.. -I/usr/include/mysql -O2 -fwrapv -pipe -Wformat -Werror=format-security -gdwarf-4 -fno-debug-types-section -fvar-tracking-assignments -g2 -Wp,-D_FORTIFY_SOURCE=2 -fstack-protector-strong --param=ssp-buffer-size=4 -fPIC -march=x86-64 -gdwarf-4 -fno-debug-types-section -fvar-tracking-assignments -g2 -MT string_util.lo -MD -MP -MF .deps/string_util.Tpo -c string_util.cc  -fPIC -DPIC -o .libs/string_util.o
libtool: compile:  x86_64-pld-linux-g++ -DHAVE_CONFIG_H -I. -I.. -I.. -I/usr/include/mysql -O2 -fwrapv -pipe -Wformat -Werror=format-security -gdwarf-4 -fno-debug-types-section -fvar-tracking-assignments -g2 -Wp,-D_FORTIFY_SOURCE=2 -fstack-protector-strong --param=ssp-buffer-size=4 -fPIC -march=x86-64 -gdwarf-4 -fno-debug-types-section -fvar-tracking-assignments -g2 -MT string_util.lo -MD -MP -MF .deps/string_util.Tpo -c string_util.cc -o string_util.o >/dev/null 2>&1
mv -f .deps/string_util.Tpo .deps/string_util.Plo
make[3]: Leaving directory '/tmp/B.jZz373/BUILD/mysqlcppapi-2.0.0/mysqlcppapi'
make[3]: Entering directory '/tmp/B.jZz373/BUILD/mysqlcppapi-2.0.0/mysqlcppapi'
/bin/sh ../libtool  --tag=CXX   --mode=compile x86_64-pld-linux-g++ -DHAVE_CONFIG_H -I. -I.. -I..   -I/usr/include/mysql  -O2 -fwrapv -pipe -Wformat -Werror=format-security -gdwarf-4 -fno-debug-types-section -fvar-tracking-assignments -g2 -Wp,-D_FORTIFY_SOURCE=2 -fstack-protector-strong --param=ssp-buffer-size=4 -fPIC -march=x86-64 -gdwarf-4 -fno-debug-types-section -fvar-tracking-assignments -g2  -MT ColData.lo -MD -MP -MF .deps/ColData.Tpo -c -o ColData.lo ColData.cc
libtool: compile:  x86_64-pld-linux-g++ -DHAVE_CONFIG_H -I. -I.. -I.. -I/usr/include/mysql -O2 -fwrapv -pipe -Wformat -Werror=format-security -gdwarf-4 -fno-debug-types-section -fvar-tracking-assignments -g2 -Wp,-D_FORTIFY_SOURCE=2 -fstack-protector-strong --param=ssp-buffer-size=4 -fPIC -march=x86-64 -gdwarf-4 -fno-debug-types-section -fvar-tracking-assignments -g2 -MT ColData.lo -MD -MP -MF .deps/ColData.Tpo -c ColData.cc  -fPIC -DPIC -o .libs/ColData.o
libtool: compile:  x86_64-pld-linux-g++ -DHAVE_CONFIG_H -I. -I.. -I.. -I/usr/include/mysql -O2 -fwrapv -pipe -Wformat -Werror=format-security -gdwarf-4 -fno-debug-types-section -fvar-tracking-assignments -g2 -Wp,-D_FORTIFY_SOURCE=2 -fstack-protector-strong --param=ssp-buffer-size=4 -fPIC -march=x86-64 -gdwarf-4 -fno-debug-types-section -fvar-tracking-assignments -g2 -MT ColData.lo -MD -MP -MF .deps/ColData.Tpo -c ColData.cc -o ColData.o >/dev/null 2>&1
mv -f .deps/ColData.Tpo .deps/ColData.Plo
make[3]: Leaving directory '/tmp/B.jZz373/BUILD/mysqlcppapi-2.0.0/mysqlcppapi'
make[3]: Entering directory '/tmp/B.jZz373/BUILD/mysqlcppapi-2.0.0/mysqlcppapi'
/bin/sh ../libtool  --tag=CXX   --mode=compile x86_64-pld-linux-g++ -DHAVE_CONFIG_H -I. -I.. -I..   -I/usr/include/mysql  -O2 -fwrapv -pipe -Wformat -Werror=format-security -gdwarf-4 -fno-debug-types-section -fvar-tracking-assignments -g2 -Wp,-D_FORTIFY_SOURCE=2 -fstack-protector-strong --param=ssp-buffer-size=4 -fPIC -march=x86-64 -gdwarf-4 -fno-debug-types-section -fvar-tracking-assignments -g2  -MT Connection.lo -MD -MP -MF .deps/Connection.Tpo -c -o Connection.lo Connection.cc
libtool: compile:  x86_64-pld-linux-g++ -DHAVE_CONFIG_H -I. -I.. -I.. -I/usr/include/mysql -O2 -fwrapv -pipe -Wformat -Werror=format-security -gdwarf-4 -fno-debug-types-section -fvar-tracking-assignments -g2 -Wp,-D_FORTIFY_SOURCE=2 -fstack-protector-strong --param=ssp-buffer-size=4 -fPIC -march=x86-64 -gdwarf-4 -fno-debug-types-section -fvar-tracking-assignments -g2 -MT Connection.lo -MD -MP -MF .deps/Connection.Tpo -c Connection.cc  -fPIC -DPIC -o .libs/Connection.o
In file included from Connection.cc:2:0:
../mysqlcppapi/Connection.h:63:23: warning: dynamic exception specifications are deprecated in C++11 [-Wdeprecated]
   virtual void lock() throw(ex_Locked);
                       ^~~~~
../mysqlcppapi/Connection.h:127:35: warning: dynamic exception specifications are deprecated in C++11 [-Wdeprecated]
   void check_connection_is_open() throw(ex_base);
                                   ^~~~~
Connection.cc:110:25: warning: dynamic exception specifications are deprecated in C++11 [-Wdeprecated]
 void Connection::lock() throw(ex_Locked)
                         ^~~~~
Connection.cc:390:45: warning: dynamic exception specifications are deprecated in C++11 [-Wdeprecated]
 void Connection::check_connection_is_open() throw(ex_base)
                                             ^~~~~
libtool: compile:  x86_64-pld-linux-g++ -DHAVE_CONFIG_H -I. -I.. -I.. -I/usr/include/mysql -O2 -fwrapv -pipe -Wformat -Werror=format-security -gdwarf-4 -fno-debug-types-section -fvar-tracking-assignments -g2 -Wp,-D_FORTIFY_SOURCE=2 -fstack-protector-strong --param=ssp-buffer-size=4 -fPIC -march=x86-64 -gdwarf-4 -fno-debug-types-section -fvar-tracking-assignments -g2 -MT Connection.lo -MD -MP -MF .deps/Connection.Tpo -c Connection.cc -o Connection.o >/dev/null 2>&1
mv -f .deps/Connection.Tpo .deps/Connection.Plo
make[3]: Leaving directory '/tmp/B.jZz373/BUILD/mysqlcppapi-2.0.0/mysqlcppapi'
make[3]: Entering directory '/tmp/B.jZz373/BUILD/mysqlcppapi-2.0.0/mysqlcppapi'
/bin/sh ../libtool  --tag=CXX   --mode=link x86_64-pld-linux-g++ -I/usr/include/mysql  -O2 -fwrapv -pipe -Wformat -Werror=format-security -gdwarf-4 -fno-debug-types-section -fvar-tracking-assignments -g2 -Wp,-D_FORTIFY_SOURCE=2 -fstack-protector-strong --param=ssp-buffer-size=4 -fPIC -march=x86-64 -gdwarf-4 -fno-debug-types-section -fvar-tracking-assignments -g2  -version-info 5:0:0 -release 2.0 -Wl,--as-needed -Wl,--no-copy-dt-needed-entries -Wl,-z,relro -Wl,-z,combreloc  -o libmysqlcppapi-2.0.la -rpath /usr/lib64  ColData.lo Connection.lo Allocator_Connection.lo string_util.lo datetime/libdatetime.la exceptions/libexceptions.la fields/libfields.la query/libquery.la query_results/libquery_results.la row/librow.la -lmysqlclient -lnsl  -L/usr/lib64 -lmysqlclient -lpthread -lz -lm -lrt -latomic -lssl -lcrypto -ldl
libtool: link: x86_64-pld-linux-g++  -fPIC -DPIC -shared -nostdlib  -O2 -gdwarf-4 -g2 -fstack-protector-strong -march=x86-64 -gdwarf-4 -g2 -Wl,--as-needed -Wl,--no-copy-dt-needed-entries -Wl,-z -Wl,relro -Wl,-z -Wl,combreloc   -pthread /usr/lib64/gcc/x86_64-pld-linux/7.3.0/../../../../lib64/crti.o /usr/lib64/gcc/x86_64-pld-linux/7.3.0/crtbeginS.o  .libs/ColData.o .libs/Connection.o .libs/Allocator_Connection.o .libs/string_util.o  -Wl,--whole-archive datetime/.libs/libdatetime.a exceptions/.libs/libexceptions.a fields/.libs/libfields.a query/.libs/libquery.a query_results/.libs/libquery_results.a row/.libs/librow.a -Wl,--no-whole-archive  -lnsl -L/usr/lib64 -lmysqlclient -lpthread -lz -lrt /usr/lib64/libatomic.so -lssl -lcrypto -ldl -L/usr/lib64/gcc/x86_64-pld-linux/7.3.0 -L/usr/lib64/gcc/x86_64-pld-linux/7.3.0/../../../../lib64 -L/lib/../lib64 -L/usr/lib/../lib64 -L/usr/lib64/gcc/x86_64-pld-linux/7.3.0/../../.. /usr/lib64/libstdc++.so -lm -lc -lgcc_s /usr/lib64/gcc/x86_64-pld-linux/7.3.0/crtendS.o /usr/lib64/gcc/x86_64-pld-linux/7.3.0/../../../../lib64/crtn.o -Wl,-soname -Wl,libmysqlcppapi-2.0-2.0.so.5 -o .libs/libmysqlcppapi-2.0-2.0.so.5.0.0
libtool: link: (cd ".libs" && rm -f "libmysqlcppapi-2.0-2.0.so.5" && ln -s "libmysqlcppapi-2.0-2.0.so.5.0.0" "libmysqlcppapi-2.0-2.0.so.5")
libtool: link: (cd ".libs" && rm -f "libmysqlcppapi-2.0.so" && ln -s "libmysqlcppapi-2.0-2.0.so.5.0.0" "libmysqlcppapi-2.0.so")
libtool: link: (cd .libs/libmysqlcppapi-2.0.lax/libdatetime.a && ar x "/tmp/B.jZz373/BUILD/mysqlcppapi-2.0.0/mysqlcppapi/datetime/.libs/libdatetime.a")
libtool: link: (cd .libs/libmysqlcppapi-2.0.lax/libexceptions.a && ar x "/tmp/B.jZz373/BUILD/mysqlcppapi-2.0.0/mysqlcppapi/exceptions/.libs/libexceptions.a")
libtool: link: (cd .libs/libmysqlcppapi-2.0.lax/libfields.a && ar x "/tmp/B.jZz373/BUILD/mysqlcppapi-2.0.0/mysqlcppapi/fields/.libs/libfields.a")
libtool: link: (cd .libs/libmysqlcppapi-2.0.lax/libquery.a && ar x "/tmp/B.jZz373/BUILD/mysqlcppapi-2.0.0/mysqlcppapi/query/.libs/libquery.a")
libtool: link: (cd .libs/libmysqlcppapi-2.0.lax/libquery_results.a && ar x "/tmp/B.jZz373/BUILD/mysqlcppapi-2.0.0/mysqlcppapi/query_results/.libs/libquery_results.a")
libtool: link: (cd .libs/libmysqlcppapi-2.0.lax/librow.a && ar x "/tmp/B.jZz373/BUILD/mysqlcppapi-2.0.0/mysqlcppapi/row/.libs/librow.a")
libtool: link: ar cru .libs/libmysqlcppapi-2.0.a  ColData.o Connection.o Allocator_Connection.o string_util.o  .libs/libmysqlcppapi-2.0.lax/libdatetime.a/Date.o .libs/libmysqlcppapi-2.0.lax/libdatetime.a/DateTime.o .libs/libmysqlcppapi-2.0.lax/libdatetime.a/Time.o .libs/libmysqlcppapi-2.0.lax/libdatetime.a/date_base.o .libs/libmysqlcppapi-2.0.lax/libdatetime.a/datetime_base.o .libs/libmysqlcppapi-2.0.lax/libdatetime.a/time_base.o  .libs/libmysqlcppapi-2.0.lax/libexceptions.a/ex_BadConversion.o .libs/libmysqlcppapi-2.0.lax/libexceptions.a/ex_BadNullConversion.o .libs/libmysqlcppapi-2.0.lax/libexceptions.a/ex_BadQuery.o .libs/libmysqlcppapi-2.0.lax/libexceptions.a/ex_BadQuery_NotEnoughParameters.o .libs/libmysqlcppapi-2.0.lax/libexceptions.a/ex_Locked.o .libs/libmysqlcppapi-2.0.lax/libexceptions.a/ex_base.o  .libs/libmysqlcppapi-2.0.lax/libfields.a/FieldInfo.o .libs/libmysqlcppapi-2.0.lax/libfields.a/FieldType.o .libs/libmysqlcppapi-2.0.lax/libfields.a/Fields.o  .libs/libmysqlcppapi-2.0.lax/libquery.a/Query.o .libs/libmysqlcppapi-2.0.lax/libquery.a/sql_query.o  .libs/libmysqlcppapi-2.0.lax/libquery_results.a/Allocator_Result.o .libs/libmysqlcppapi-2.0.lax/libquery_results.a/Result_NoData.o .libs/libmysqlcppapi-2.0.lax/libquery_results.a/Result_Store.o .libs/libmysqlcppapi-2.0.lax/libquery_results.a/Result_Use.o  .libs/libmysqlcppapi-2.0.lax/librow.a/Row.o 
libtool: link: ranlib .libs/libmysqlcppapi-2.0.a
libtool: link: rm -fr .libs/libmysqlcppapi-2.0.lax
libtool: link: ( cd ".libs" && rm -f "libmysqlcppapi-2.0.la" && ln -s "../libmysqlcppapi-2.0.la" "libmysqlcppapi-2.0.la" )
make[3]: Leaving directory '/tmp/B.jZz373/BUILD/mysqlcppapi-2.0.0/mysqlcppapi'
Making all in examples
make[2]: Entering directory '/tmp/B.jZz373/BUILD/mysqlcppapi-2.0.0/examples'
x86_64-pld-linux-g++ -DHAVE_CONFIG_H -I. -I.. -I..    -O2 -fwrapv -pipe -Wformat -Werror=format-security -gdwarf-4 -fno-debug-types-section -fvar-tracking-assignments -g2 -Wp,-D_FORTIFY_SOURCE=2 -fstack-protector-strong --param=ssp-buffer-size=4 -fPIC -march=x86-64 -gdwarf-4 -fno-debug-types-section -fvar-tracking-assignments -g2  -MT complic1.o -MD -MP -MF .deps/complic1.Tpo -c -o complic1.o complic1.cc
In file included from ../mysqlcppapi/mysqlcppapi.h:9:0,
                 from complic1.cc:2:
../mysqlcppapi/Connection.h:63:23: warning: dynamic exception specifications are deprecated in C++11 [-Wdeprecated]
   virtual void lock() throw(ex_Locked);
                       ^~~~~
../mysqlcppapi/Connection.h:127:35: warning: dynamic exception specifications are deprecated in C++11 [-Wdeprecated]
   void check_connection_is_open() throw(ex_base);
                                   ^~~~~
In file included from ../mysqlcppapi/row/Row.h:6:0,
                 from ../mysqlcppapi/query_results/Result_Use.h:5,
                 from ../mysqlcppapi/Connection.h:10,
                 from ../mysqlcppapi/mysqlcppapi.h:9,
                 from complic1.cc:2:
../mysqlcppapi/const_subscript_container.h: In instantiation of 'mysqlcppapi::subscript_iterator<OnType, ReturnType>& mysqlcppapi::subscript_iterator<OnType, ReturnType>::operator++() [with OnType = const mysqlcppapi::const_subscript_container<mysqlcppapi::Result_Store, mysqlcppapi::Row, const mysqlcppapi::Row>; ReturnType = const mysqlcppapi::Row]':
../mysqlcppapi/const_subscript_container.h:128:15:   required from 'mysqlcppapi::subscript_iterator<OnType, ReturnType> mysqlcppapi::subscript_iterator<OnType, ReturnType>::operator++(mysqlcppapi::subscript_iterator<OnType, ReturnType>::difference_type) [with OnType = const mysqlcppapi::const_subscript_container<mysqlcppapi::Result_Store, mysqlcppapi::Row, const mysqlcppapi::Row>; ReturnType = const mysqlcppapi::Row; mysqlcppapi::subscript_iterator<OnType, ReturnType>::difference_type = int]'
complic1.cc:33:44:   required from here
../mysqlcppapi/const_subscript_container.h:119:14: error: 'operator=' was not declared in this scope, and no declarations were found by argument-dependent lookup at the point of instantiation [-fpermissive]
     operator=(iterChanged);
     ~~~~~~~~~^~~~~~~~~~~~~
../mysqlcppapi/const_subscript_container.h:119:14: note: declarations in dependent base 'mysqlcppapi::subscript_iterator<const mysqlcppapi::const_subscript_container<mysqlcppapi::Result_Store, mysqlcppapi::Row, const mysqlcppapi::Row>, const mysqlcppapi::Row>' are not found by unqualified lookup
../mysqlcppapi/const_subscript_container.h:119:14: note: use 'this->operator=' instead
make[2]: *** [Makefile:434: complic1.o] Error 1
make[2]: Leaving directory '/tmp/B.jZz373/BUILD/mysqlcppapi-2.0.0/examples'
make[2]: *** Waiting for unfinished jobs....
make[2]: Entering directory '/tmp/B.jZz373/BUILD/mysqlcppapi-2.0.0/examples'
x86_64-pld-linux-g++ -DHAVE_CONFIG_H -I. -I.. -I..    -O2 -fwrapv -pipe -Wformat -Werror=format-security -gdwarf-4 -fno-debug-types-section -fvar-tracking-assignments -g2 -Wp,-D_FORTIFY_SOURCE=2 -fstack-protector-strong --param=ssp-buffer-size=4 -fPIC -march=x86-64 -gdwarf-4 -fno-debug-types-section -fvar-tracking-assignments -g2  -MT fieldinf1.o -MD -MP -MF .deps/fieldinf1.Tpo -c -o fieldinf1.o fieldinf1.cc
In file included from ../mysqlcppapi/mysqlcppapi.h:9:0,
                 from fieldinf1.cc:4:
../mysqlcppapi/Connection.h:63:23: warning: dynamic exception specifications are deprecated in C++11 [-Wdeprecated]
   virtual void lock() throw(ex_Locked);
                       ^~~~~
../mysqlcppapi/Connection.h:127:35: warning: dynamic exception specifications are deprecated in C++11 [-Wdeprecated]
   void check_connection_is_open() throw(ex_base);
                                   ^~~~~
mv -f .deps/fieldinf1.Tpo .deps/fieldinf1.Po
make[2]: Leaving directory '/tmp/B.jZz373/BUILD/mysqlcppapi-2.0.0/examples'
make[2]: Entering directory '/tmp/B.jZz373/BUILD/mysqlcppapi-2.0.0/examples'
x86_64-pld-linux-g++ -DHAVE_CONFIG_H -I. -I.. -I..    -O2 -fwrapv -pipe -Wformat -Werror=format-security -gdwarf-4 -fno-debug-types-section -fvar-tracking-assignments -g2 -Wp,-D_FORTIFY_SOURCE=2 -fstack-protector-strong --param=ssp-buffer-size=4 -fPIC -march=x86-64 -gdwarf-4 -fno-debug-types-section -fvar-tracking-assignments -g2  -MT simple1.o -MD -MP -MF .deps/simple1.Tpo -c -o simple1.o simple1.cc
In file included from ../mysqlcppapi/mysqlcppapi.h:9:0,
                 from simple1.cc:1:
../mysqlcppapi/Connection.h:63:23: warning: dynamic exception specifications are deprecated in C++11 [-Wdeprecated]
   virtual void lock() throw(ex_Locked);
                       ^~~~~
../mysqlcppapi/Connection.h:127:35: warning: dynamic exception specifications are deprecated in C++11 [-Wdeprecated]
   void check_connection_is_open() throw(ex_base);
                                   ^~~~~
In file included from ../mysqlcppapi/row/Row.h:6:0,
                 from ../mysqlcppapi/query_results/Result_Use.h:5,
                 from ../mysqlcppapi/Connection.h:10,
                 from ../mysqlcppapi/mysqlcppapi.h:9,
                 from simple1.cc:1:
../mysqlcppapi/const_subscript_container.h: In instantiation of 'mysqlcppapi::subscript_iterator<OnType, ReturnType>& mysqlcppapi::subscript_iterator<OnType, ReturnType>::operator++() [with OnType = const mysqlcppapi::const_subscript_container<mysqlcppapi::Result_Store, mysqlcppapi::Row, const mysqlcppapi::Row>; ReturnType = const mysqlcppapi::Row]':
../mysqlcppapi/const_subscript_container.h:128:15:   required from 'mysqlcppapi::subscript_iterator<OnType, ReturnType> mysqlcppapi::subscript_iterator<OnType, ReturnType>::operator++(mysqlcppapi::subscript_iterator<OnType, ReturnType>::difference_type) [with OnType = const mysqlcppapi::const_subscript_container<mysqlcppapi::Result_Store, mysqlcppapi::Row, const mysqlcppapi::Row>; ReturnType = const mysqlcppapi::Row; mysqlcppapi::subscript_iterator<OnType, ReturnType>::difference_type = int]'
simple1.cc:42:80:   required from here
../mysqlcppapi/const_subscript_container.h:119:14: error: 'operator=' was not declared in this scope, and no declarations were found by argument-dependent lookup at the point of instantiation [-fpermissive]
     operator=(iterChanged);
     ~~~~~~~~~^~~~~~~~~~~~~
../mysqlcppapi/const_subscript_container.h:119:14: note: declarations in dependent base 'mysqlcppapi::subscript_iterator<const mysqlcppapi::const_subscript_container<mysqlcppapi::Result_Store, mysqlcppapi::Row, const mysqlcppapi::Row>, const mysqlcppapi::Row>' are not found by unqualified lookup
../mysqlcppapi/const_subscript_container.h:119:14: note: use 'this->operator=' instead
make[2]: *** [Makefile:434: simple1.o] Error 1
make[2]: Leaving directory '/tmp/B.jZz373/BUILD/mysqlcppapi-2.0.0/examples'
make[2]: Entering directory '/tmp/B.jZz373/BUILD/mysqlcppapi-2.0.0/examples'
x86_64-pld-linux-g++ -DHAVE_CONFIG_H -I. -I.. -I..    -O2 -fwrapv -pipe -Wformat -Werror=format-security -gdwarf-4 -fno-debug-types-section -fvar-tracking-assignments -g2 -Wp,-D_FORTIFY_SOURCE=2 -fstack-protector-strong --param=ssp-buffer-size=4 -fPIC -march=x86-64 -gdwarf-4 -fno-debug-types-section -fvar-tracking-assignments -g2  -MT sinisa_ex.o -MD -MP -MF .deps/sinisa_ex.Tpo -c -o sinisa_ex.o sinisa_ex.cc
In file included from ../mysqlcppapi/mysqlcppapi.h:9:0,
                 from sinisa_ex.cc:1:
../mysqlcppapi/Connection.h:63:23: warning: dynamic exception specifications are deprecated in C++11 [-Wdeprecated]
   virtual void lock() throw(ex_Locked);
                       ^~~~~
../mysqlcppapi/Connection.h:127:35: warning: dynamic exception specifications are deprecated in C++11 [-Wdeprecated]
   void check_connection_is_open() throw(ex_base);
                                   ^~~~~
In file included from ../mysqlcppapi/row/Row.h:6:0,
                 from ../mysqlcppapi/query_results/Result_Use.h:5,
                 from ../mysqlcppapi/Connection.h:10,
                 from ../mysqlcppapi/mysqlcppapi.h:9,
                 from sinisa_ex.cc:1:
../mysqlcppapi/const_subscript_container.h: In instantiation of 'mysqlcppapi::subscript_iterator<OnType, ReturnType>& mysqlcppapi::subscript_iterator<OnType, ReturnType>::operator++() [with OnType = const mysqlcppapi::const_subscript_container<mysqlcppapi::Result_Store, mysqlcppapi::Row, const mysqlcppapi::Row>; ReturnType = const mysqlcppapi::Row]':
../mysqlcppapi/const_subscript_container.h:128:15:   required from 'mysqlcppapi::subscript_iterator<OnType, ReturnType> mysqlcppapi::subscript_iterator<OnType, ReturnType>::operator++(mysqlcppapi::subscript_iterator<OnType, ReturnType>::difference_type) [with OnType = const mysqlcppapi::const_subscript_container<mysqlcppapi::Result_Store, mysqlcppapi::Row, const mysqlcppapi::Row>; ReturnType = const mysqlcppapi::Row; mysqlcppapi::subscript_iterator<OnType, ReturnType>::difference_type = int]'
sinisa_ex.cc:34:44:   required from here
../mysqlcppapi/const_subscript_container.h:119:14: error: 'operator=' was not declared in this scope, and no declarations were found by argument-dependent lookup at the point of instantiation [-fpermissive]
     operator=(iterChanged);
     ~~~~~~~~~^~~~~~~~~~~~~
../mysqlcppapi/const_subscript_container.h:119:14: note: declarations in dependent base 'mysqlcppapi::subscript_iterator<const mysqlcppapi::const_subscript_container<mysqlcppapi::Result_Store, mysqlcppapi::Row, const mysqlcppapi::Row>, const mysqlcppapi::Row>' are not found by unqualified lookup
../mysqlcppapi/const_subscript_container.h:119:14: note: use 'this->operator=' instead
make[2]: *** [Makefile:434: sinisa_ex.o] Error 1
make[2]: Leaving directory '/tmp/B.jZz373/BUILD/mysqlcppapi-2.0.0/examples'
make[2]: Entering directory '/tmp/B.jZz373/BUILD/mysqlcppapi-2.0.0/examples'
x86_64-pld-linux-g++ -DHAVE_CONFIG_H -I. -I.. -I..    -O2 -fwrapv -pipe -Wformat -Werror=format-security -gdwarf-4 -fno-debug-types-section -fvar-tracking-assignments -g2 -Wp,-D_FORTIFY_SOURCE=2 -fstack-protector-strong --param=ssp-buffer-size=4 -fPIC -march=x86-64 -gdwarf-4 -fno-debug-types-section -fvar-tracking-assignments -g2  -MT cgi_image.o -MD -MP -MF .deps/cgi_image.Tpo -c -o cgi_image.o cgi_image.cc
In file included from ../mysqlcppapi/mysqlcppapi.h:9:0,
                 from cgi_image.cc:1:
../mysqlcppapi/Connection.h:63:23: warning: dynamic exception specifications are deprecated in C++11 [-Wdeprecated]
   virtual void lock() throw(ex_Locked);
                       ^~~~~
../mysqlcppapi/Connection.h:127:35: warning: dynamic exception specifications are deprecated in C++11 [-Wdeprecated]
   void check_connection_is_open() throw(ex_base);
                                   ^~~~~
mv -f .deps/cgi_image.Tpo .deps/cgi_image.Po
make[2]: Leaving directory '/tmp/B.jZz373/BUILD/mysqlcppapi-2.0.0/examples'
make[1]: *** [Makefile:469: all-recursive] Error 1
make: *** [Makefile:378: all] Error 2
error: Bad exit status from /tmp/B.jZz373/BUILD/tmp/rpm-tmp.47057 (%build)


RPM build errors:
    Bad exit status from /tmp/B.jZz373/BUILD/tmp/rpm-tmp.47057 (%build)
ended at: Wed Mar  7 11:12:44 2018, done in 0:00:24.848232
error: No files produced.
mesg: ttyname failed: Inappropriate ioctl for device
+ chmod -R u+rwX /tmp/B.jZz373/BUILD
+ rm -rf /tmp/B.jZz373/tmp /tmp/B.jZz373/BUILD
mesg: ttyname failed: Inappropriate ioctl for device
+ rm -rf /tmp/B.jZz373
Begin-PLD-Builder-Info
Build-Time: user:36.53s sys:4.30s real:27.75s (faults io:0 non-io:2090430)

End-PLD-Builder-Info
[Back to list of logs] [View rpm -qa of builder]