FailedOk

th/SRPMS[OK]
th/x32[OK]
th/i686[OK]
th/x86_64[OK]

ac/SRPMS[OK]
ac/i386[OK]
ac/i586[OK]
ac/i686[OK]
ac/alpha[OK]
ac/amd64[OK]
ac/athlon[OK]
ac/ppc[OK]
ac/sparc[OK]
ac/sparc64[OK]

Advanced Search
main()
Powered by PLD Linux
(c) 2002-2020 PLD Team
$Revision: 1.37 $
Powered by /dev/drzewo.
Your IP: 18.234.255.5

netcdf-fortran bb119666-9986-4a8c-8bd1-7b20ea8713fb

Status:Failed
Source URL:https://buildlogs.pld-linux.org/pld/th/x86_64/FAIL/netcdf-fortran,bb119666-9986-4a8c-8bd1-7b20ea8713fb.bz2
text/plain URL:View!
full text:View!
rpm -qa of builder:View!
Date:2020/11/11 22:03:00
Runtime:0:01:26.149838

Toc:

  • error 1
  • Error: Type mismatch between actual argument at (1) and actual argument at (2) (INTEGER(2)/INTEGER(1)).
  • error 2
  • Error: Type mismatch between actual argument at (1) and actual argument at (2) (INTEGER(4)/INTEGER(1)).
  • error 3
  • Error: Type mismatch between actual argument at (1) and actual argument at (2) (REAL(4)/INTEGER(1)).
  • error 4
  • Error: Type mismatch between actual argument at (1) and actual argument at (2) (REAL(8)/INTEGER(1)).
  • error 5
  • Error: Type mismatch between actual argument at (1) and actual argument at (2) (INTEGER(2)/INTEGER(1)).
  • error 6
  • Error: Type mismatch between actual argument at (1) and actual argument at (2) (INTEGER(4)/INTEGER(1)).
  • error 7
  • Error: Type mismatch between actual argument at (1) and actual argument at (2) (REAL(4)/INTEGER(1)).
  • error 8
  • Error: Type mismatch between actual argument at (1) and actual argument at (2) (REAL(8)/INTEGER(1)).
  • error 9
  • Error: Type mismatch between actual argument at (1) and actual argument at (2) (INTEGER(2)/INTEGER(1)).
  • error 10
  • Error: Type mismatch between actual argument at (1) and actual argument at (2) (INTEGER(4)/INTEGER(1)).
  • error 11
  • Error: Type mismatch between actual argument at (1) and actual argument at (2) (REAL(4)/INTEGER(1)).
  • error 12
  • Error: Type mismatch between actual argument at (1) and actual argument at (2) (REAL(8)/INTEGER(1)).
  • error 13
  • Error: Type mismatch between actual argument at (1) and actual argument at (2) (INTEGER(2)/INTEGER(1)).
  • error 14
  • Error: Type mismatch between actual argument at (1) and actual argument at (2) (INTEGER(4)/INTEGER(1)).
  • error 15
  • Error: Type mismatch between actual argument at (1) and actual argument at (2) (REAL(4)/INTEGER(1)).
  • error 16
  • Error: Type mismatch between actual argument at (1) and actual argument at (2) (REAL(8)/INTEGER(1)).
  • error 17
  • Error: Type mismatch between actual argument at (1) and actual argument at (2) (INTEGER(2)/INTEGER(1)).
  • error 18
  • Error: Type mismatch between actual argument at (1) and actual argument at (2) (INTEGER(4)/INTEGER(1)).
  • error 19
  • Error: Type mismatch between actual argument at (1) and actual argument at (2) (REAL(4)/INTEGER(1)).
  • error 20
  • Error: Type mismatch between actual argument at (1) and actual argument at (2) (REAL(8)/INTEGER(1)).
  • error 21
  • Error: Type mismatch between actual argument at (1) and actual argument at (2) (INTEGER(2)/INTEGER(1)).
  • error 22
  • Error: Type mismatch between actual argument at (1) and actual argument at (2) (INTEGER(4)/INTEGER(1)).
  • error 23
  • Error: Type mismatch between actual argument at (1) and actual argument at (2) (REAL(4)/INTEGER(1)).
  • error 24
  • Error: Type mismatch between actual argument at (1) and actual argument at (2) (REAL(8)/INTEGER(1)).
  • error 25
  • Error: Type mismatch between actual argument at (1) and actual argument at (2) (INTEGER(2)/INTEGER(1)).
  • error 26
  • Error: Type mismatch between actual argument at (1) and actual argument at (2) (INTEGER(4)/INTEGER(1)).
  • error 27
  • Error: Type mismatch between actual argument at (1) and actual argument at (2) (REAL(4)/INTEGER(1)).
  • error 28
  • Error: Type mismatch between actual argument at (1) and actual argument at (2) (REAL(8)/INTEGER(1)).
  • error 29
  • Error: Type mismatch between actual argument at (1) and actual argument at (2) (INTEGER(2)/INTEGER(1)).
  • error 30
  • Error: Type mismatch between actual argument at (1) and actual argument at (2) (INTEGER(4)/INTEGER(1)).
  • error 31
  • Error: Type mismatch between actual argument at (1) and actual argument at (2) (REAL(4)/INTEGER(1)).
  • error 32
  • Error: Type mismatch between actual argument at (1) and actual argument at (2) (REAL(8)/INTEGER(1)).
  • error 33
  • Error: Type mismatch between actual argument at (1) and actual argument at (2) (INTEGER(2)/INTEGER(1)).
  • error 34
  • Error: Type mismatch between actual argument at (1) and actual argument at (2) (INTEGER(4)/INTEGER(1)).
  • error 35
  • Error: Type mismatch between actual argument at (1) and actual argument at (2) (REAL(4)/INTEGER(1)).
  • error 36
  • Error: Type mismatch between actual argument at (1) and actual argument at (2) (REAL(8)/INTEGER(1)).
  • error 37
  • Error: Type mismatch between actual argument at (1) and actual argument at (2) (INTEGER(2)/INTEGER(1)).
  • error 38
  • Error: Type mismatch between actual argument at (1) and actual argument at (2) (INTEGER(4)/INTEGER(1)).
  • error 39
  • Error: Type mismatch between actual argument at (1) and actual argument at (2) (REAL(4)/INTEGER(1)).
  • error 40
  • Error: Type mismatch between actual argument at (1) and actual argument at (2) (REAL(8)/INTEGER(1)).
  • error 41
  • make[3]: *** [Makefile:852: ftest.o] Error 1
  • error 42
  • make[2]: *** [Makefile:1206: check-am] Error 2
  • error 43
  • make[1]: *** [Makefile:1209: check] Error 2
  • error 44
  • error: Bad exit status from /tmp/B.cp1MVZ/BUILD/tmp/rpm-tmp.8757 (%build)
  • error 45
  • RPM build errors:
  • error 46
  • error: No files produced.

Content:

/usr/bin/make  all-am
make[2]: Entering directory '/tmp/B.cp1MVZ/BUILD/netcdf-fortran-4.5.3/nf_test'
/bin/sh ../libtool  --tag=FC   --mode=compile x86_64-pld-linux-gfortran -DPACKAGE_NAME=\"netCDF-Fortran\" -DPACKAGE_TARNAME=\"netcdf-fortran\" -DPACKAGE_VERSION=\"4.5.3\" -DPACKAGE_STRING=\"netCDF-Fortran\ 4.5.3\" -DPACKAGE_BUGREPORT=\"support-netcdf@unidata.ucar.edu\" -DPACKAGE_URL=\"\" -DPACKAGE=\"netcdf-fortran\" -DVERSION=\"4.5.3\" -DNF_RELAX_COORD_BOUND=1 -DENABLE_CDF5=1 -DHAVE_F2008=1 -DHAVE_TS29113_SUPPORT=1 -DTEMP_LARGE=\".\" -DSTDC_HEADERS=1 -DHAVE_SYS_TYPES_H=1 -DHAVE_SYS_STAT_H=1 -DHAVE_STDLIB_H=1 -DHAVE_STRING_H=1 -DHAVE_MEMORY_H=1 -DHAVE_STRINGS_H=1 -DHAVE_INTTYPES_H=1 -DHAVE_STDINT_H=1 -DHAVE_UNISTD_H=1 -DHAVE_DLFCN_H=1 -DLT_OBJDIR=\".libs/\" -DNF_INT1_T=byte -DNF_INT2_T=integer\*2 -DNF_INT8_T=integer\*8 -DNF_INT1_IS_C_SIGNED_CHAR=1 -DNF_INT2_IS_C_SHORT=1 -DNF_INT8_IS_C_LONG_LONG=1 -DNF_INT_IS_C_INT=1 -DNF_REAL_IS_C_FLOAT=1 -DNF_DOUBLEPRECISION_IS_C_DOUBLE=1 -DNCBYTE_T=byte -DNCSHORT_T=integer\*2 -DHAVE_LIBM=1 -DHAVE_NETCDF_H=1 -DHAVE_NC_DEF_OPAQUE=1 -DHAVE_NCCREATE=1 -DHAVE_NC_SET_LOG_LEVEL=1 -DHAVE_OC_OPEN=1 -DHAVE_NC_DEF_VAR_SZIP=1 -DHAVE_NC_GET_CHUNK_CACHE_INTS=1 -DUSE_NETCDF4=1 -DLOGGING=1 -DHAVE_SYS_PARAM_H=1 -DHAVE_LOCALE_H=1 -DHAVE_STDIO_H=1 -DHAVE_STDARG_H=1 -DHAVE_ERRNO_H=1 -DHAVE_CTYPE_H=1 -DHAVE_FCNTL_H=1 -DHAVE_MALLOC_H=1 -DHAVE_STDLIB_H=1 -DHAVE_STRING_H=1 -DHAVE_STRINGS_H=1 -DHAVE_UNISTD_H=1 -DHAVE_SYS_STAT_H=1 -DHAVE_GETOPT_H=1 -DHAVE_SYS_TIME_H=1 -DHAVE_SYS_RESOURCE_H=1 -DHAVE_DIRENT_H=1 -DSTDC_HEADERS=1 -DHAVE_SYS_WAIT_H=1 -DTIME_WITH_SYS_TIME=1 -DHAVE_VPRINTF=1 -DHAVE__BOOL=1 -DHAVE_STDBOOL_H=1 -DHAVE_ALLOCA_H=1 -DHAVE_ALLOCA=1 -DHAVE_SSIZE_T=1 -DHAVE_PTRDIFF_T=1 -DSIZEOF_SHORT=2 -DSIZEOF_INT=4 -DSIZEOF_LONG=8 -DSIZEOF_FLOAT=4 -DSIZEOF_DOUBLE=8 -DSIZEOF_OFF_T=8 -DSIZEOF_SIZE_T=8 -DSIZEOF_PTRDIFF_T=8 -I.   -DgFortran=1 -I../fortran -O2 -fwrapv -pipe -Wformat -Werror=format-security -gdwarf-4 -fno-debug-types-section -fvar-tracking-assignments -g2 -Wp,-D_FORTIFY_SOURCE=2 -fstack-protector-strong --param=ssp-buffer-size=4 -Werror=trampolines -fPIC -march=x86-64 -gdwarf-4 -fno-debug-types-section -fvar-tracking-assignments -g2  -fallow-argument-mismatch -c -o module_tests.lo module_tests.F90
libtool: compile:  x86_64-pld-linux-gfortran -DPACKAGE_NAME=\"netCDF-Fortran\" -DPACKAGE_TARNAME=\"netcdf-fortran\" -DPACKAGE_VERSION=\"4.5.3\" "-DPACKAGE_STRING=\"netCDF-Fortran 4.5.3\"" -DPACKAGE_BUGREPORT=\"support-netcdf@unidata.ucar.edu\" -DPACKAGE_URL=\"\" -DPACKAGE=\"netcdf-fortran\" -DVERSION=\"4.5.3\" -DNF_RELAX_COORD_BOUND=1 -DENABLE_CDF5=1 -DHAVE_F2008=1 -DHAVE_TS29113_SUPPORT=1 -DTEMP_LARGE=\".\" -DSTDC_HEADERS=1 -DHAVE_SYS_TYPES_H=1 -DHAVE_SYS_STAT_H=1 -DHAVE_STDLIB_H=1 -DHAVE_STRING_H=1 -DHAVE_MEMORY_H=1 -DHAVE_STRINGS_H=1 -DHAVE_INTTYPES_H=1 -DHAVE_STDINT_H=1 -DHAVE_UNISTD_H=1 -DHAVE_DLFCN_H=1 -DLT_OBJDIR=\".libs/\" -DNF_INT1_T=byte "-DNF_INT2_T=integer*2" "-DNF_INT8_T=integer*8" -DNF_INT1_IS_C_SIGNED_CHAR=1 -DNF_INT2_IS_C_SHORT=1 -DNF_INT8_IS_C_LONG_LONG=1 -DNF_INT_IS_C_INT=1 -DNF_REAL_IS_C_FLOAT=1 -DNF_DOUBLEPRECISION_IS_C_DOUBLE=1 -DNCBYTE_T=byte "-DNCSHORT_T=integer*2" -DHAVE_LIBM=1 -DHAVE_NETCDF_H=1 -DHAVE_NC_DEF_OPAQUE=1 -DHAVE_NCCREATE=1 -DHAVE_NC_SET_LOG_LEVEL=1 -DHAVE_OC_OPEN=1 -DHAVE_NC_DEF_VAR_SZIP=1 -DHAVE_NC_GET_CHUNK_CACHE_INTS=1 -DUSE_NETCDF4=1 -DLOGGING=1 -DHAVE_SYS_PARAM_H=1 -DHAVE_LOCALE_H=1 -DHAVE_STDIO_H=1 -DHAVE_STDARG_H=1 -DHAVE_ERRNO_H=1 -DHAVE_CTYPE_H=1 -DHAVE_FCNTL_H=1 -DHAVE_MALLOC_H=1 -DHAVE_STDLIB_H=1 -DHAVE_STRING_H=1 -DHAVE_STRINGS_H=1 -DHAVE_UNISTD_H=1 -DHAVE_SYS_STAT_H=1 -DHAVE_GETOPT_H=1 -DHAVE_SYS_TIME_H=1 -DHAVE_SYS_RESOURCE_H=1 -DHAVE_DIRENT_H=1 -DSTDC_HEADERS=1 -DHAVE_SYS_WAIT_H=1 -DTIME_WITH_SYS_TIME=1 -DHAVE_VPRINTF=1 -DHAVE__BOOL=1 -DHAVE_STDBOOL_H=1 -DHAVE_ALLOCA_H=1 -DHAVE_ALLOCA=1 -DHAVE_SSIZE_T=1 -DHAVE_PTRDIFF_T=1 -DSIZEOF_SHORT=2 -DSIZEOF_INT=4 -DSIZEOF_LONG=8 -DSIZEOF_FLOAT=4 -DSIZEOF_DOUBLE=8 -DSIZEOF_OFF_T=8 -DSIZEOF_SIZE_T=8 -DSIZEOF_PTRDIFF_T=8 -I. -DgFortran=1 -I../fortran -O2 -fwrapv -pipe -Wformat -Werror=format-security -gdwarf-4 -fno-debug-types-section -fvar-tracking-assignments -g2 -Wp,-D_FORTIFY_SOURCE=2 -fstack-protector-strong --param=ssp-buffer-size=4 -Werror=trampolines -fPIC -march=x86-64 -gdwarf-4 -fno-debug-types-section -fvar-tracking-assignments -g2 -fallow-argument-mismatch -c module_tests.F90  -fPIC -o .libs/module_tests.o
f951: Warning: command-line option '-Wformat=1' is valid for C/C++/ObjC/ObjC++ but not for Fortran
f951: Warning: '-Werror=' argument '-Werror=format-security' is not valid for Fortran
libtool: compile:  x86_64-pld-linux-gfortran -DPACKAGE_NAME=\"netCDF-Fortran\" -DPACKAGE_TARNAME=\"netcdf-fortran\" -DPACKAGE_VERSION=\"4.5.3\" "-DPACKAGE_STRING=\"netCDF-Fortran 4.5.3\"" -DPACKAGE_BUGREPORT=\"support-netcdf@unidata.ucar.edu\" -DPACKAGE_URL=\"\" -DPACKAGE=\"netcdf-fortran\" -DVERSION=\"4.5.3\" -DNF_RELAX_COORD_BOUND=1 -DENABLE_CDF5=1 -DHAVE_F2008=1 -DHAVE_TS29113_SUPPORT=1 -DTEMP_LARGE=\".\" -DSTDC_HEADERS=1 -DHAVE_SYS_TYPES_H=1 -DHAVE_SYS_STAT_H=1 -DHAVE_STDLIB_H=1 -DHAVE_STRING_H=1 -DHAVE_MEMORY_H=1 -DHAVE_STRINGS_H=1 -DHAVE_INTTYPES_H=1 -DHAVE_STDINT_H=1 -DHAVE_UNISTD_H=1 -DHAVE_DLFCN_H=1 -DLT_OBJDIR=\".libs/\" -DNF_INT1_T=byte "-DNF_INT2_T=integer*2" "-DNF_INT8_T=integer*8" -DNF_INT1_IS_C_SIGNED_CHAR=1 -DNF_INT2_IS_C_SHORT=1 -DNF_INT8_IS_C_LONG_LONG=1 -DNF_INT_IS_C_INT=1 -DNF_REAL_IS_C_FLOAT=1 -DNF_DOUBLEPRECISION_IS_C_DOUBLE=1 -DNCBYTE_T=byte "-DNCSHORT_T=integer*2" -DHAVE_LIBM=1 -DHAVE_NETCDF_H=1 -DHAVE_NC_DEF_OPAQUE=1 -DHAVE_NCCREATE=1 -DHAVE_NC_SET_LOG_LEVEL=1 -DHAVE_OC_OPEN=1 -DHAVE_NC_DEF_VAR_SZIP=1 -DHAVE_NC_GET_CHUNK_CACHE_INTS=1 -DUSE_NETCDF4=1 -DLOGGING=1 -DHAVE_SYS_PARAM_H=1 -DHAVE_LOCALE_H=1 -DHAVE_STDIO_H=1 -DHAVE_STDARG_H=1 -DHAVE_ERRNO_H=1 -DHAVE_CTYPE_H=1 -DHAVE_FCNTL_H=1 -DHAVE_MALLOC_H=1 -DHAVE_STDLIB_H=1 -DHAVE_STRING_H=1 -DHAVE_STRINGS_H=1 -DHAVE_UNISTD_H=1 -DHAVE_SYS_STAT_H=1 -DHAVE_GETOPT_H=1 -DHAVE_SYS_TIME_H=1 -DHAVE_SYS_RESOURCE_H=1 -DHAVE_DIRENT_H=1 -DSTDC_HEADERS=1 -DHAVE_SYS_WAIT_H=1 -DTIME_WITH_SYS_TIME=1 -DHAVE_VPRINTF=1 -DHAVE__BOOL=1 -DHAVE_STDBOOL_H=1 -DHAVE_ALLOCA_H=1 -DHAVE_ALLOCA=1 -DHAVE_SSIZE_T=1 -DHAVE_PTRDIFF_T=1 -DSIZEOF_SHORT=2 -DSIZEOF_INT=4 -DSIZEOF_LONG=8 -DSIZEOF_FLOAT=4 -DSIZEOF_DOUBLE=8 -DSIZEOF_OFF_T=8 -DSIZEOF_SIZE_T=8 -DSIZEOF_PTRDIFF_T=8 -I. -DgFortran=1 -I../fortran -O2 -fwrapv -pipe -Wformat -Werror=format-security -gdwarf-4 -fno-debug-types-section -fvar-tracking-assignments -g2 -Wp,-D_FORTIFY_SOURCE=2 -fstack-protector-strong --param=ssp-buffer-size=4 -Werror=trampolines -fPIC -march=x86-64 -gdwarf-4 -fno-debug-types-section -fvar-tracking-assignments -g2 -fallow-argument-mismatch -c module_tests.F90 -o module_tests.o >/dev/null 2>&1
make[2]: Leaving directory '/tmp/B.cp1MVZ/BUILD/netcdf-fortran-4.5.3/nf_test'
make[2]: Entering directory '/tmp/B.cp1MVZ/BUILD/netcdf-fortran-4.5.3/nf_test'
/bin/sh ../libtool  --tag=FC   --mode=link x86_64-pld-linux-gfortran -I../fortran -O2 -fwrapv -pipe -Wformat -Werror=format-security -gdwarf-4 -fno-debug-types-section -fvar-tracking-assignments -g2 -Wp,-D_FORTIFY_SOURCE=2 -fstack-protector-strong --param=ssp-buffer-size=4 -Werror=trampolines -fPIC -march=x86-64 -gdwarf-4 -fno-debug-types-section -fvar-tracking-assignments -g2  -fallow-argument-mismatch  -Wl,--as-needed -Wl,--no-copy-dt-needed-entries -Wl,-z,relro -Wl,-z,combreloc  -o libtests.la  module_tests.lo  -lnetcdf -ldl -lm 
libtool: link: ar cru .libs/libtests.a .libs/module_tests.o 
libtool: link: ranlib .libs/libtests.a
libtool: link: ( cd ".libs" && rm -f "libtests.la" && ln -s "../libtests.la" "libtests.la" )
make[2]: Leaving directory '/tmp/B.cp1MVZ/BUILD/netcdf-fortran-4.5.3/nf_test'
Making all in nf03_test
make[1]: Nothing to be done for 'all'.
Making all in nf_test4
/usr/bin/make  all-am
make[2]: Nothing to be done for 'all-am'.
Making all in nf03_test4
make[1]: Nothing to be done for 'all'.
Making all in docs
make[1]: Nothing to be done for 'all'.
Making all in examples
Making all in F77
make[2]: Nothing to be done for 'all'.
Making all in F90
/usr/bin/make  all-am
make[3]: Nothing to be done for 'all-am'.
make[2]: Nothing to be done for 'all-am'.
Making all in CMakeExtras
make[1]: Nothing to be done for 'all'.
make[1]: Nothing to be done for 'all-am'.
+ /usr/bin/make -Otarget -j9 -j1 check
Making check in libsrc
make[1]: Entering directory '/tmp/B.cp1MVZ/BUILD/netcdf-fortran-4.5.3/libsrc'
make[1]: Nothing to be done for 'check'.
make[1]: Leaving directory '/tmp/B.cp1MVZ/BUILD/netcdf-fortran-4.5.3/libsrc'
Making check in fortran
make[1]: Entering directory '/tmp/B.cp1MVZ/BUILD/netcdf-fortran-4.5.3/fortran'
/usr/bin/make  check-am
make[2]: Entering directory '/tmp/B.cp1MVZ/BUILD/netcdf-fortran-4.5.3/fortran'
make[2]: Leaving directory '/tmp/B.cp1MVZ/BUILD/netcdf-fortran-4.5.3/fortran'
make[1]: Leaving directory '/tmp/B.cp1MVZ/BUILD/netcdf-fortran-4.5.3/fortran'
Making check in nf_test
make[1]: Entering directory '/tmp/B.cp1MVZ/BUILD/netcdf-fortran-4.5.3/nf_test'
/usr/bin/make  check-am
make[2]: Entering directory '/tmp/B.cp1MVZ/BUILD/netcdf-fortran-4.5.3/nf_test'
/usr/bin/make  nf_test tst_int64 tst_f77_v2 ftest nf03_test f03test tst03_f77_v2
make[3]: Entering directory '/tmp/B.cp1MVZ/BUILD/netcdf-fortran-4.5.3/nf_test'
x86_64-pld-linux-gfortran -I../fortran -O2 -fwrapv -pipe -Wformat -Werror=format-security -gdwarf-4 -fno-debug-types-section -fvar-tracking-assignments -g2 -Wp,-D_FORTIFY_SOURCE=2 -fstack-protector-strong --param=ssp-buffer-size=4 -Werror=trampolines -fPIC -march=x86-64 -gdwarf-4 -fno-debug-types-section -fvar-tracking-assignments -g2  -fallow-argument-mismatch -c -o f03lib_f_interfaces.o  f03lib_f_interfaces.f90
f951: Warning: command-line option '-Wformat=1' is valid for C/C++/ObjC/ObjC++ but not for Fortran
f951: Warning: '-Werror=' argument '-Werror=format-security' is not valid for Fortran
x86_64-pld-linux-gfortran -DPACKAGE_NAME=\"netCDF-Fortran\" -DPACKAGE_TARNAME=\"netcdf-fortran\" -DPACKAGE_VERSION=\"4.5.3\" -DPACKAGE_STRING=\"netCDF-Fortran\ 4.5.3\" -DPACKAGE_BUGREPORT=\"support-netcdf@unidata.ucar.edu\" -DPACKAGE_URL=\"\" -DPACKAGE=\"netcdf-fortran\" -DVERSION=\"4.5.3\" -DNF_RELAX_COORD_BOUND=1 -DENABLE_CDF5=1 -DHAVE_F2008=1 -DHAVE_TS29113_SUPPORT=1 -DTEMP_LARGE=\".\" -DSTDC_HEADERS=1 -DHAVE_SYS_TYPES_H=1 -DHAVE_SYS_STAT_H=1 -DHAVE_STDLIB_H=1 -DHAVE_STRING_H=1 -DHAVE_MEMORY_H=1 -DHAVE_STRINGS_H=1 -DHAVE_INTTYPES_H=1 -DHAVE_STDINT_H=1 -DHAVE_UNISTD_H=1 -DHAVE_DLFCN_H=1 -DLT_OBJDIR=\".libs/\" -DNF_INT1_T=byte -DNF_INT2_T=integer\*2 -DNF_INT8_T=integer\*8 -DNF_INT1_IS_C_SIGNED_CHAR=1 -DNF_INT2_IS_C_SHORT=1 -DNF_INT8_IS_C_LONG_LONG=1 -DNF_INT_IS_C_INT=1 -DNF_REAL_IS_C_FLOAT=1 -DNF_DOUBLEPRECISION_IS_C_DOUBLE=1 -DNCBYTE_T=byte -DNCSHORT_T=integer\*2 -DHAVE_LIBM=1 -DHAVE_NETCDF_H=1 -DHAVE_NC_DEF_OPAQUE=1 -DHAVE_NCCREATE=1 -DHAVE_NC_SET_LOG_LEVEL=1 -DHAVE_OC_OPEN=1 -DHAVE_NC_DEF_VAR_SZIP=1 -DHAVE_NC_GET_CHUNK_CACHE_INTS=1 -DUSE_NETCDF4=1 -DLOGGING=1 -DHAVE_SYS_PARAM_H=1 -DHAVE_LOCALE_H=1 -DHAVE_STDIO_H=1 -DHAVE_STDARG_H=1 -DHAVE_ERRNO_H=1 -DHAVE_CTYPE_H=1 -DHAVE_FCNTL_H=1 -DHAVE_MALLOC_H=1 -DHAVE_STDLIB_H=1 -DHAVE_STRING_H=1 -DHAVE_STRINGS_H=1 -DHAVE_UNISTD_H=1 -DHAVE_SYS_STAT_H=1 -DHAVE_GETOPT_H=1 -DHAVE_SYS_TIME_H=1 -DHAVE_SYS_RESOURCE_H=1 -DHAVE_DIRENT_H=1 -DSTDC_HEADERS=1 -DHAVE_SYS_WAIT_H=1 -DTIME_WITH_SYS_TIME=1 -DHAVE_VPRINTF=1 -DHAVE__BOOL=1 -DHAVE_STDBOOL_H=1 -DHAVE_ALLOCA_H=1 -DHAVE_ALLOCA=1 -DHAVE_SSIZE_T=1 -DHAVE_PTRDIFF_T=1 -DSIZEOF_SHORT=2 -DSIZEOF_INT=4 -DSIZEOF_LONG=8 -DSIZEOF_FLOAT=4 -DSIZEOF_DOUBLE=8 -DSIZEOF_OFF_T=8 -DSIZEOF_SIZE_T=8 -DSIZEOF_PTRDIFF_T=8 -I.   -DgFortran=1 -I../fortran -O2 -fwrapv -pipe -Wformat -Werror=format-security -gdwarf-4 -fno-debug-types-section -fvar-tracking-assignments -g2 -Wp,-D_FORTIFY_SOURCE=2 -fstack-protector-strong --param=ssp-buffer-size=4 -Werror=trampolines -fPIC -march=x86-64 -gdwarf-4 -fno-debug-types-section -fvar-tracking-assignments -g2  -c -o test_get.o test_get.F
f951: Warning: command-line option '-Wformat=1' is valid for C/C++/ObjC/ObjC++ but not for Fortran
f951: Warning: '-Werror=' argument '-Werror=format-security' is not valid for Fortran
x86_64-pld-linux-gfortran -DPACKAGE_NAME=\"netCDF-Fortran\" -DPACKAGE_TARNAME=\"netcdf-fortran\" -DPACKAGE_VERSION=\"4.5.3\" -DPACKAGE_STRING=\"netCDF-Fortran\ 4.5.3\" -DPACKAGE_BUGREPORT=\"support-netcdf@unidata.ucar.edu\" -DPACKAGE_URL=\"\" -DPACKAGE=\"netcdf-fortran\" -DVERSION=\"4.5.3\" -DNF_RELAX_COORD_BOUND=1 -DENABLE_CDF5=1 -DHAVE_F2008=1 -DHAVE_TS29113_SUPPORT=1 -DTEMP_LARGE=\".\" -DSTDC_HEADERS=1 -DHAVE_SYS_TYPES_H=1 -DHAVE_SYS_STAT_H=1 -DHAVE_STDLIB_H=1 -DHAVE_STRING_H=1 -DHAVE_MEMORY_H=1 -DHAVE_STRINGS_H=1 -DHAVE_INTTYPES_H=1 -DHAVE_STDINT_H=1 -DHAVE_UNISTD_H=1 -DHAVE_DLFCN_H=1 -DLT_OBJDIR=\".libs/\" -DNF_INT1_T=byte -DNF_INT2_T=integer\*2 -DNF_INT8_T=integer\*8 -DNF_INT1_IS_C_SIGNED_CHAR=1 -DNF_INT2_IS_C_SHORT=1 -DNF_INT8_IS_C_LONG_LONG=1 -DNF_INT_IS_C_INT=1 -DNF_REAL_IS_C_FLOAT=1 -DNF_DOUBLEPRECISION_IS_C_DOUBLE=1 -DNCBYTE_T=byte -DNCSHORT_T=integer\*2 -DHAVE_LIBM=1 -DHAVE_NETCDF_H=1 -DHAVE_NC_DEF_OPAQUE=1 -DHAVE_NCCREATE=1 -DHAVE_NC_SET_LOG_LEVEL=1 -DHAVE_OC_OPEN=1 -DHAVE_NC_DEF_VAR_SZIP=1 -DHAVE_NC_GET_CHUNK_CACHE_INTS=1 -DUSE_NETCDF4=1 -DLOGGING=1 -DHAVE_SYS_PARAM_H=1 -DHAVE_LOCALE_H=1 -DHAVE_STDIO_H=1 -DHAVE_STDARG_H=1 -DHAVE_ERRNO_H=1 -DHAVE_CTYPE_H=1 -DHAVE_FCNTL_H=1 -DHAVE_MALLOC_H=1 -DHAVE_STDLIB_H=1 -DHAVE_STRING_H=1 -DHAVE_STRINGS_H=1 -DHAVE_UNISTD_H=1 -DHAVE_SYS_STAT_H=1 -DHAVE_GETOPT_H=1 -DHAVE_SYS_TIME_H=1 -DHAVE_SYS_RESOURCE_H=1 -DHAVE_DIRENT_H=1 -DSTDC_HEADERS=1 -DHAVE_SYS_WAIT_H=1 -DTIME_WITH_SYS_TIME=1 -DHAVE_VPRINTF=1 -DHAVE__BOOL=1 -DHAVE_STDBOOL_H=1 -DHAVE_ALLOCA_H=1 -DHAVE_ALLOCA=1 -DHAVE_SSIZE_T=1 -DHAVE_PTRDIFF_T=1 -DSIZEOF_SHORT=2 -DSIZEOF_INT=4 -DSIZEOF_LONG=8 -DSIZEOF_FLOAT=4 -DSIZEOF_DOUBLE=8 -DSIZEOF_OFF_T=8 -DSIZEOF_SIZE_T=8 -DSIZEOF_PTRDIFF_T=8 -I.   -DgFortran=1 -I../fortran -O2 -fwrapv -pipe -Wformat -Werror=format-security -gdwarf-4 -fno-debug-types-section -fvar-tracking-assignments -g2 -Wp,-D_FORTIFY_SOURCE=2 -fstack-protector-strong --param=ssp-buffer-size=4 -Werror=trampolines -fPIC -march=x86-64 -gdwarf-4 -fno-debug-types-section -fvar-tracking-assignments -g2  -c -o test_put.o test_put.F
f951: Warning: command-line option '-Wformat=1' is valid for C/C++/ObjC/ObjC++ but not for Fortran
f951: Warning: '-Werror=' argument '-Werror=format-security' is not valid for Fortran
x86_64-pld-linux-gfortran -DPACKAGE_NAME=\"netCDF-Fortran\" -DPACKAGE_TARNAME=\"netcdf-fortran\" -DPACKAGE_VERSION=\"4.5.3\" -DPACKAGE_STRING=\"netCDF-Fortran\ 4.5.3\" -DPACKAGE_BUGREPORT=\"support-netcdf@unidata.ucar.edu\" -DPACKAGE_URL=\"\" -DPACKAGE=\"netcdf-fortran\" -DVERSION=\"4.5.3\" -DNF_RELAX_COORD_BOUND=1 -DENABLE_CDF5=1 -DHAVE_F2008=1 -DHAVE_TS29113_SUPPORT=1 -DTEMP_LARGE=\".\" -DSTDC_HEADERS=1 -DHAVE_SYS_TYPES_H=1 -DHAVE_SYS_STAT_H=1 -DHAVE_STDLIB_H=1 -DHAVE_STRING_H=1 -DHAVE_MEMORY_H=1 -DHAVE_STRINGS_H=1 -DHAVE_INTTYPES_H=1 -DHAVE_STDINT_H=1 -DHAVE_UNISTD_H=1 -DHAVE_DLFCN_H=1 -DLT_OBJDIR=\".libs/\" -DNF_INT1_T=byte -DNF_INT2_T=integer\*2 -DNF_INT8_T=integer\*8 -DNF_INT1_IS_C_SIGNED_CHAR=1 -DNF_INT2_IS_C_SHORT=1 -DNF_INT8_IS_C_LONG_LONG=1 -DNF_INT_IS_C_INT=1 -DNF_REAL_IS_C_FLOAT=1 -DNF_DOUBLEPRECISION_IS_C_DOUBLE=1 -DNCBYTE_T=byte -DNCSHORT_T=integer\*2 -DHAVE_LIBM=1 -DHAVE_NETCDF_H=1 -DHAVE_NC_DEF_OPAQUE=1 -DHAVE_NCCREATE=1 -DHAVE_NC_SET_LOG_LEVEL=1 -DHAVE_OC_OPEN=1 -DHAVE_NC_DEF_VAR_SZIP=1 -DHAVE_NC_GET_CHUNK_CACHE_INTS=1 -DUSE_NETCDF4=1 -DLOGGING=1 -DHAVE_SYS_PARAM_H=1 -DHAVE_LOCALE_H=1 -DHAVE_STDIO_H=1 -DHAVE_STDARG_H=1 -DHAVE_ERRNO_H=1 -DHAVE_CTYPE_H=1 -DHAVE_FCNTL_H=1 -DHAVE_MALLOC_H=1 -DHAVE_STDLIB_H=1 -DHAVE_STRING_H=1 -DHAVE_STRINGS_H=1 -DHAVE_UNISTD_H=1 -DHAVE_SYS_STAT_H=1 -DHAVE_GETOPT_H=1 -DHAVE_SYS_TIME_H=1 -DHAVE_SYS_RESOURCE_H=1 -DHAVE_DIRENT_H=1 -DSTDC_HEADERS=1 -DHAVE_SYS_WAIT_H=1 -DTIME_WITH_SYS_TIME=1 -DHAVE_VPRINTF=1 -DHAVE__BOOL=1 -DHAVE_STDBOOL_H=1 -DHAVE_ALLOCA_H=1 -DHAVE_ALLOCA=1 -DHAVE_SSIZE_T=1 -DHAVE_PTRDIFF_T=1 -DSIZEOF_SHORT=2 -DSIZEOF_INT=4 -DSIZEOF_LONG=8 -DSIZEOF_FLOAT=4 -DSIZEOF_DOUBLE=8 -DSIZEOF_OFF_T=8 -DSIZEOF_SIZE_T=8 -DSIZEOF_PTRDIFF_T=8 -I.   -DgFortran=1 -I../fortran -O2 -fwrapv -pipe -Wformat -Werror=format-security -gdwarf-4 -fno-debug-types-section -fvar-tracking-assignments -g2 -Wp,-D_FORTIFY_SOURCE=2 -fstack-protector-strong --param=ssp-buffer-size=4 -Werror=trampolines -fPIC -march=x86-64 -gdwarf-4 -fno-debug-types-section -fvar-tracking-assignments -g2  -c -o nf_error.o nf_error.F
f951: Warning: command-line option '-Wformat=1' is valid for C/C++/ObjC/ObjC++ but not for Fortran
f951: Warning: '-Werror=' argument '-Werror=format-security' is not valid for Fortran
x86_64-pld-linux-gfortran -DPACKAGE_NAME=\"netCDF-Fortran\" -DPACKAGE_TARNAME=\"netcdf-fortran\" -DPACKAGE_VERSION=\"4.5.3\" -DPACKAGE_STRING=\"netCDF-Fortran\ 4.5.3\" -DPACKAGE_BUGREPORT=\"support-netcdf@unidata.ucar.edu\" -DPACKAGE_URL=\"\" -DPACKAGE=\"netcdf-fortran\" -DVERSION=\"4.5.3\" -DNF_RELAX_COORD_BOUND=1 -DENABLE_CDF5=1 -DHAVE_F2008=1 -DHAVE_TS29113_SUPPORT=1 -DTEMP_LARGE=\".\" -DSTDC_HEADERS=1 -DHAVE_SYS_TYPES_H=1 -DHAVE_SYS_STAT_H=1 -DHAVE_STDLIB_H=1 -DHAVE_STRING_H=1 -DHAVE_MEMORY_H=1 -DHAVE_STRINGS_H=1 -DHAVE_INTTYPES_H=1 -DHAVE_STDINT_H=1 -DHAVE_UNISTD_H=1 -DHAVE_DLFCN_H=1 -DLT_OBJDIR=\".libs/\" -DNF_INT1_T=byte -DNF_INT2_T=integer\*2 -DNF_INT8_T=integer\*8 -DNF_INT1_IS_C_SIGNED_CHAR=1 -DNF_INT2_IS_C_SHORT=1 -DNF_INT8_IS_C_LONG_LONG=1 -DNF_INT_IS_C_INT=1 -DNF_REAL_IS_C_FLOAT=1 -DNF_DOUBLEPRECISION_IS_C_DOUBLE=1 -DNCBYTE_T=byte -DNCSHORT_T=integer\*2 -DHAVE_LIBM=1 -DHAVE_NETCDF_H=1 -DHAVE_NC_DEF_OPAQUE=1 -DHAVE_NCCREATE=1 -DHAVE_NC_SET_LOG_LEVEL=1 -DHAVE_OC_OPEN=1 -DHAVE_NC_DEF_VAR_SZIP=1 -DHAVE_NC_GET_CHUNK_CACHE_INTS=1 -DUSE_NETCDF4=1 -DLOGGING=1 -DHAVE_SYS_PARAM_H=1 -DHAVE_LOCALE_H=1 -DHAVE_STDIO_H=1 -DHAVE_STDARG_H=1 -DHAVE_ERRNO_H=1 -DHAVE_CTYPE_H=1 -DHAVE_FCNTL_H=1 -DHAVE_MALLOC_H=1 -DHAVE_STDLIB_H=1 -DHAVE_STRING_H=1 -DHAVE_STRINGS_H=1 -DHAVE_UNISTD_H=1 -DHAVE_SYS_STAT_H=1 -DHAVE_GETOPT_H=1 -DHAVE_SYS_TIME_H=1 -DHAVE_SYS_RESOURCE_H=1 -DHAVE_DIRENT_H=1 -DSTDC_HEADERS=1 -DHAVE_SYS_WAIT_H=1 -DTIME_WITH_SYS_TIME=1 -DHAVE_VPRINTF=1 -DHAVE__BOOL=1 -DHAVE_STDBOOL_H=1 -DHAVE_ALLOCA_H=1 -DHAVE_ALLOCA=1 -DHAVE_SSIZE_T=1 -DHAVE_PTRDIFF_T=1 -DSIZEOF_SHORT=2 -DSIZEOF_INT=4 -DSIZEOF_LONG=8 -DSIZEOF_FLOAT=4 -DSIZEOF_DOUBLE=8 -DSIZEOF_OFF_T=8 -DSIZEOF_SIZE_T=8 -DSIZEOF_PTRDIFF_T=8 -I.   -DgFortran=1 -I../fortran -O2 -fwrapv -pipe -Wformat -Werror=format-security -gdwarf-4 -fno-debug-types-section -fvar-tracking-assignments -g2 -Wp,-D_FORTIFY_SOURCE=2 -fstack-protector-strong --param=ssp-buffer-size=4 -Werror=trampolines -fPIC -march=x86-64 -gdwarf-4 -fno-debug-types-section -fvar-tracking-assignments -g2  -c -o nf_test.o nf_test.F
f951: Warning: command-line option '-Wformat=1' is valid for C/C++/ObjC/ObjC++ but not for Fortran
f951: Warning: '-Werror=' argument '-Werror=format-security' is not valid for Fortran
x86_64-pld-linux-gfortran -DPACKAGE_NAME=\"netCDF-Fortran\" -DPACKAGE_TARNAME=\"netcdf-fortran\" -DPACKAGE_VERSION=\"4.5.3\" -DPACKAGE_STRING=\"netCDF-Fortran\ 4.5.3\" -DPACKAGE_BUGREPORT=\"support-netcdf@unidata.ucar.edu\" -DPACKAGE_URL=\"\" -DPACKAGE=\"netcdf-fortran\" -DVERSION=\"4.5.3\" -DNF_RELAX_COORD_BOUND=1 -DENABLE_CDF5=1 -DHAVE_F2008=1 -DHAVE_TS29113_SUPPORT=1 -DTEMP_LARGE=\".\" -DSTDC_HEADERS=1 -DHAVE_SYS_TYPES_H=1 -DHAVE_SYS_STAT_H=1 -DHAVE_STDLIB_H=1 -DHAVE_STRING_H=1 -DHAVE_MEMORY_H=1 -DHAVE_STRINGS_H=1 -DHAVE_INTTYPES_H=1 -DHAVE_STDINT_H=1 -DHAVE_UNISTD_H=1 -DHAVE_DLFCN_H=1 -DLT_OBJDIR=\".libs/\" -DNF_INT1_T=byte -DNF_INT2_T=integer\*2 -DNF_INT8_T=integer\*8 -DNF_INT1_IS_C_SIGNED_CHAR=1 -DNF_INT2_IS_C_SHORT=1 -DNF_INT8_IS_C_LONG_LONG=1 -DNF_INT_IS_C_INT=1 -DNF_REAL_IS_C_FLOAT=1 -DNF_DOUBLEPRECISION_IS_C_DOUBLE=1 -DNCBYTE_T=byte -DNCSHORT_T=integer\*2 -DHAVE_LIBM=1 -DHAVE_NETCDF_H=1 -DHAVE_NC_DEF_OPAQUE=1 -DHAVE_NCCREATE=1 -DHAVE_NC_SET_LOG_LEVEL=1 -DHAVE_OC_OPEN=1 -DHAVE_NC_DEF_VAR_SZIP=1 -DHAVE_NC_GET_CHUNK_CACHE_INTS=1 -DUSE_NETCDF4=1 -DLOGGING=1 -DHAVE_SYS_PARAM_H=1 -DHAVE_LOCALE_H=1 -DHAVE_STDIO_H=1 -DHAVE_STDARG_H=1 -DHAVE_ERRNO_H=1 -DHAVE_CTYPE_H=1 -DHAVE_FCNTL_H=1 -DHAVE_MALLOC_H=1 -DHAVE_STDLIB_H=1 -DHAVE_STRING_H=1 -DHAVE_STRINGS_H=1 -DHAVE_UNISTD_H=1 -DHAVE_SYS_STAT_H=1 -DHAVE_GETOPT_H=1 -DHAVE_SYS_TIME_H=1 -DHAVE_SYS_RESOURCE_H=1 -DHAVE_DIRENT_H=1 -DSTDC_HEADERS=1 -DHAVE_SYS_WAIT_H=1 -DTIME_WITH_SYS_TIME=1 -DHAVE_VPRINTF=1 -DHAVE__BOOL=1 -DHAVE_STDBOOL_H=1 -DHAVE_ALLOCA_H=1 -DHAVE_ALLOCA=1 -DHAVE_SSIZE_T=1 -DHAVE_PTRDIFF_T=1 -DSIZEOF_SHORT=2 -DSIZEOF_INT=4 -DSIZEOF_LONG=8 -DSIZEOF_FLOAT=4 -DSIZEOF_DOUBLE=8 -DSIZEOF_OFF_T=8 -DSIZEOF_SIZE_T=8 -DSIZEOF_PTRDIFF_T=8 -I.   -DgFortran=1 -I../fortran -O2 -fwrapv -pipe -Wformat -Werror=format-security -gdwarf-4 -fno-debug-types-section -fvar-tracking-assignments -g2 -Wp,-D_FORTIFY_SOURCE=2 -fstack-protector-strong --param=ssp-buffer-size=4 -Werror=trampolines -fPIC -march=x86-64 -gdwarf-4 -fno-debug-types-section -fvar-tracking-assignments -g2  -c -o test_read.o test_read.F
f951: Warning: command-line option '-Wformat=1' is valid for C/C++/ObjC/ObjC++ but not for Fortran
f951: Warning: '-Werror=' argument '-Werror=format-security' is not valid for Fortran
x86_64-pld-linux-gfortran -DPACKAGE_NAME=\"netCDF-Fortran\" -DPACKAGE_TARNAME=\"netcdf-fortran\" -DPACKAGE_VERSION=\"4.5.3\" -DPACKAGE_STRING=\"netCDF-Fortran\ 4.5.3\" -DPACKAGE_BUGREPORT=\"support-netcdf@unidata.ucar.edu\" -DPACKAGE_URL=\"\" -DPACKAGE=\"netcdf-fortran\" -DVERSION=\"4.5.3\" -DNF_RELAX_COORD_BOUND=1 -DENABLE_CDF5=1 -DHAVE_F2008=1 -DHAVE_TS29113_SUPPORT=1 -DTEMP_LARGE=\".\" -DSTDC_HEADERS=1 -DHAVE_SYS_TYPES_H=1 -DHAVE_SYS_STAT_H=1 -DHAVE_STDLIB_H=1 -DHAVE_STRING_H=1 -DHAVE_MEMORY_H=1 -DHAVE_STRINGS_H=1 -DHAVE_INTTYPES_H=1 -DHAVE_STDINT_H=1 -DHAVE_UNISTD_H=1 -DHAVE_DLFCN_H=1 -DLT_OBJDIR=\".libs/\" -DNF_INT1_T=byte -DNF_INT2_T=integer\*2 -DNF_INT8_T=integer\*8 -DNF_INT1_IS_C_SIGNED_CHAR=1 -DNF_INT2_IS_C_SHORT=1 -DNF_INT8_IS_C_LONG_LONG=1 -DNF_INT_IS_C_INT=1 -DNF_REAL_IS_C_FLOAT=1 -DNF_DOUBLEPRECISION_IS_C_DOUBLE=1 -DNCBYTE_T=byte -DNCSHORT_T=integer\*2 -DHAVE_LIBM=1 -DHAVE_NETCDF_H=1 -DHAVE_NC_DEF_OPAQUE=1 -DHAVE_NCCREATE=1 -DHAVE_NC_SET_LOG_LEVEL=1 -DHAVE_OC_OPEN=1 -DHAVE_NC_DEF_VAR_SZIP=1 -DHAVE_NC_GET_CHUNK_CACHE_INTS=1 -DUSE_NETCDF4=1 -DLOGGING=1 -DHAVE_SYS_PARAM_H=1 -DHAVE_LOCALE_H=1 -DHAVE_STDIO_H=1 -DHAVE_STDARG_H=1 -DHAVE_ERRNO_H=1 -DHAVE_CTYPE_H=1 -DHAVE_FCNTL_H=1 -DHAVE_MALLOC_H=1 -DHAVE_STDLIB_H=1 -DHAVE_STRING_H=1 -DHAVE_STRINGS_H=1 -DHAVE_UNISTD_H=1 -DHAVE_SYS_STAT_H=1 -DHAVE_GETOPT_H=1 -DHAVE_SYS_TIME_H=1 -DHAVE_SYS_RESOURCE_H=1 -DHAVE_DIRENT_H=1 -DSTDC_HEADERS=1 -DHAVE_SYS_WAIT_H=1 -DTIME_WITH_SYS_TIME=1 -DHAVE_VPRINTF=1 -DHAVE__BOOL=1 -DHAVE_STDBOOL_H=1 -DHAVE_ALLOCA_H=1 -DHAVE_ALLOCA=1 -DHAVE_SSIZE_T=1 -DHAVE_PTRDIFF_T=1 -DSIZEOF_SHORT=2 -DSIZEOF_INT=4 -DSIZEOF_LONG=8 -DSIZEOF_FLOAT=4 -DSIZEOF_DOUBLE=8 -DSIZEOF_OFF_T=8 -DSIZEOF_SIZE_T=8 -DSIZEOF_PTRDIFF_T=8 -I.   -DgFortran=1 -I../fortran -O2 -fwrapv -pipe -Wformat -Werror=format-security -gdwarf-4 -fno-debug-types-section -fvar-tracking-assignments -g2 -Wp,-D_FORTIFY_SOURCE=2 -fstack-protector-strong --param=ssp-buffer-size=4 -Werror=trampolines -fPIC -march=x86-64 -gdwarf-4 -fno-debug-types-section -fvar-tracking-assignments -g2  -c -o test_write.o test_write.F
f951: Warning: command-line option '-Wformat=1' is valid for C/C++/ObjC/ObjC++ but not for Fortran
f951: Warning: '-Werror=' argument '-Werror=format-security' is not valid for Fortran
x86_64-pld-linux-gfortran -DPACKAGE_NAME=\"netCDF-Fortran\" -DPACKAGE_TARNAME=\"netcdf-fortran\" -DPACKAGE_VERSION=\"4.5.3\" -DPACKAGE_STRING=\"netCDF-Fortran\ 4.5.3\" -DPACKAGE_BUGREPORT=\"support-netcdf@unidata.ucar.edu\" -DPACKAGE_URL=\"\" -DPACKAGE=\"netcdf-fortran\" -DVERSION=\"4.5.3\" -DNF_RELAX_COORD_BOUND=1 -DENABLE_CDF5=1 -DHAVE_F2008=1 -DHAVE_TS29113_SUPPORT=1 -DTEMP_LARGE=\".\" -DSTDC_HEADERS=1 -DHAVE_SYS_TYPES_H=1 -DHAVE_SYS_STAT_H=1 -DHAVE_STDLIB_H=1 -DHAVE_STRING_H=1 -DHAVE_MEMORY_H=1 -DHAVE_STRINGS_H=1 -DHAVE_INTTYPES_H=1 -DHAVE_STDINT_H=1 -DHAVE_UNISTD_H=1 -DHAVE_DLFCN_H=1 -DLT_OBJDIR=\".libs/\" -DNF_INT1_T=byte -DNF_INT2_T=integer\*2 -DNF_INT8_T=integer\*8 -DNF_INT1_IS_C_SIGNED_CHAR=1 -DNF_INT2_IS_C_SHORT=1 -DNF_INT8_IS_C_LONG_LONG=1 -DNF_INT_IS_C_INT=1 -DNF_REAL_IS_C_FLOAT=1 -DNF_DOUBLEPRECISION_IS_C_DOUBLE=1 -DNCBYTE_T=byte -DNCSHORT_T=integer\*2 -DHAVE_LIBM=1 -DHAVE_NETCDF_H=1 -DHAVE_NC_DEF_OPAQUE=1 -DHAVE_NCCREATE=1 -DHAVE_NC_SET_LOG_LEVEL=1 -DHAVE_OC_OPEN=1 -DHAVE_NC_DEF_VAR_SZIP=1 -DHAVE_NC_GET_CHUNK_CACHE_INTS=1 -DUSE_NETCDF4=1 -DLOGGING=1 -DHAVE_SYS_PARAM_H=1 -DHAVE_LOCALE_H=1 -DHAVE_STDIO_H=1 -DHAVE_STDARG_H=1 -DHAVE_ERRNO_H=1 -DHAVE_CTYPE_H=1 -DHAVE_FCNTL_H=1 -DHAVE_MALLOC_H=1 -DHAVE_STDLIB_H=1 -DHAVE_STRING_H=1 -DHAVE_STRINGS_H=1 -DHAVE_UNISTD_H=1 -DHAVE_SYS_STAT_H=1 -DHAVE_GETOPT_H=1 -DHAVE_SYS_TIME_H=1 -DHAVE_SYS_RESOURCE_H=1 -DHAVE_DIRENT_H=1 -DSTDC_HEADERS=1 -DHAVE_SYS_WAIT_H=1 -DTIME_WITH_SYS_TIME=1 -DHAVE_VPRINTF=1 -DHAVE__BOOL=1 -DHAVE_STDBOOL_H=1 -DHAVE_ALLOCA_H=1 -DHAVE_ALLOCA=1 -DHAVE_SSIZE_T=1 -DHAVE_PTRDIFF_T=1 -DSIZEOF_SHORT=2 -DSIZEOF_INT=4 -DSIZEOF_LONG=8 -DSIZEOF_FLOAT=4 -DSIZEOF_DOUBLE=8 -DSIZEOF_OFF_T=8 -DSIZEOF_SIZE_T=8 -DSIZEOF_PTRDIFF_T=8 -I.   -DgFortran=1 -I../fortran -O2 -fwrapv -pipe -Wformat -Werror=format-security -gdwarf-4 -fno-debug-types-section -fvar-tracking-assignments -g2 -Wp,-D_FORTIFY_SOURCE=2 -fstack-protector-strong --param=ssp-buffer-size=4 -Werror=trampolines -fPIC -march=x86-64 -gdwarf-4 -fno-debug-types-section -fvar-tracking-assignments -g2  -c -o util.o util.F
f951: Warning: command-line option '-Wformat=1' is valid for C/C++/ObjC/ObjC++ but not for Fortran
f951: Warning: '-Werror=' argument '-Werror=format-security' is not valid for Fortran
depbase=`echo f03lib.o | sed 's|[^/]*$|.deps/&|;s|\.o$||'`;\
x86_64-pld-linux-gcc -DPACKAGE_NAME=\"netCDF-Fortran\" -DPACKAGE_TARNAME=\"netcdf-fortran\" -DPACKAGE_VERSION=\"4.5.3\" -DPACKAGE_STRING=\"netCDF-Fortran\ 4.5.3\" -DPACKAGE_BUGREPORT=\"support-netcdf@unidata.ucar.edu\" -DPACKAGE_URL=\"\" -DPACKAGE=\"netcdf-fortran\" -DVERSION=\"4.5.3\" -DNF_RELAX_COORD_BOUND=1 -DENABLE_CDF5=1 -DHAVE_F2008=1 -DHAVE_TS29113_SUPPORT=1 -DTEMP_LARGE=\".\" -DSTDC_HEADERS=1 -DHAVE_SYS_TYPES_H=1 -DHAVE_SYS_STAT_H=1 -DHAVE_STDLIB_H=1 -DHAVE_STRING_H=1 -DHAVE_MEMORY_H=1 -DHAVE_STRINGS_H=1 -DHAVE_INTTYPES_H=1 -DHAVE_STDINT_H=1 -DHAVE_UNISTD_H=1 -DHAVE_DLFCN_H=1 -DLT_OBJDIR=\".libs/\" -DNF_INT1_T=byte -DNF_INT2_T=integer\*2 -DNF_INT8_T=integer\*8 -DNF_INT1_IS_C_SIGNED_CHAR=1 -DNF_INT2_IS_C_SHORT=1 -DNF_INT8_IS_C_LONG_LONG=1 -DNF_INT_IS_C_INT=1 -DNF_REAL_IS_C_FLOAT=1 -DNF_DOUBLEPRECISION_IS_C_DOUBLE=1 -DNCBYTE_T=byte -DNCSHORT_T=integer\*2 -DHAVE_LIBM=1 -DHAVE_NETCDF_H=1 -DHAVE_NC_DEF_OPAQUE=1 -DHAVE_NCCREATE=1 -DHAVE_NC_SET_LOG_LEVEL=1 -DHAVE_OC_OPEN=1 -DHAVE_NC_DEF_VAR_SZIP=1 -DHAVE_NC_GET_CHUNK_CACHE_INTS=1 -DUSE_NETCDF4=1 -DLOGGING=1 -DHAVE_SYS_PARAM_H=1 -DHAVE_LOCALE_H=1 -DHAVE_STDIO_H=1 -DHAVE_STDARG_H=1 -DHAVE_ERRNO_H=1 -DHAVE_CTYPE_H=1 -DHAVE_FCNTL_H=1 -DHAVE_MALLOC_H=1 -DHAVE_STDLIB_H=1 -DHAVE_STRING_H=1 -DHAVE_STRINGS_H=1 -DHAVE_UNISTD_H=1 -DHAVE_SYS_STAT_H=1 -DHAVE_GETOPT_H=1 -DHAVE_SYS_TIME_H=1 -DHAVE_SYS_RESOURCE_H=1 -DHAVE_DIRENT_H=1 -DSTDC_HEADERS=1 -DHAVE_SYS_WAIT_H=1 -DTIME_WITH_SYS_TIME=1 -DHAVE_VPRINTF=1 -DHAVE__BOOL=1 -DHAVE_STDBOOL_H=1 -DHAVE_ALLOCA_H=1 -DHAVE_ALLOCA=1 -DHAVE_SSIZE_T=1 -DHAVE_PTRDIFF_T=1 -DSIZEOF_SHORT=2 -DSIZEOF_INT=4 -DSIZEOF_LONG=8 -DSIZEOF_FLOAT=4 -DSIZEOF_DOUBLE=8 -DSIZEOF_OFF_T=8 -DSIZEOF_SIZE_T=8 -DSIZEOF_PTRDIFF_T=8 -I.   -DgFortran=1  -O2 -fwrapv -pipe -Wformat -Werror=format-security -gdwarf-4 -fno-debug-types-section -fvar-tracking-assignments -g2 -Wp,-D_FORTIFY_SOURCE=2 -fstack-protector-strong --param=ssp-buffer-size=4 -Werror=trampolines -fPIC -march=x86-64 -gdwarf-4 -fno-debug-types-section -fvar-tracking-assignments -g2  -DLONGLONG_IS_LONG -MT f03lib.o -MD -MP -MF $depbase.Tpo -c -o f03lib.o f03lib.c &&\
mv -f $depbase.Tpo $depbase.Po
/bin/sh ../libtool  --tag=F77   --mode=link x86_64-pld-linux-gfortran -I../fortran -O2 -fwrapv -pipe -Wformat -Werror=format-security -gdwarf-4 -fno-debug-types-section -fvar-tracking-assignments -g2 -Wp,-D_FORTIFY_SOURCE=2 -fstack-protector-strong --param=ssp-buffer-size=4 -Werror=trampolines -fPIC -march=x86-64 -gdwarf-4 -fno-debug-types-section -fvar-tracking-assignments -g2   -Wl,--as-needed -Wl,--no-copy-dt-needed-entries -Wl,-z,relro -Wl,-z,combreloc  -o nf_test f03lib_f_interfaces.o test_get.o test_put.o nf_error.o nf_test.o test_read.o test_write.o util.o f03lib.o ../fortran/libnetcdff.la -lnetcdf -ldl -lm 
libtool: link: x86_64-pld-linux-gfortran -I../fortran -O2 -fwrapv -pipe -Wformat -Werror=format-security -gdwarf-4 -fno-debug-types-section -fvar-tracking-assignments -g2 -Wp,-D_FORTIFY_SOURCE=2 -fstack-protector-strong --param=ssp-buffer-size=4 -Werror=trampolines -fPIC -march=x86-64 -gdwarf-4 -fno-debug-types-section -fvar-tracking-assignments -g2 -Wl,--as-needed -Wl,--no-copy-dt-needed-entries -Wl,-z -Wl,relro -Wl,-z -Wl,combreloc -o .libs/nf_test f03lib_f_interfaces.o test_get.o test_put.o nf_error.o nf_test.o test_read.o test_write.o util.o f03lib.o  ../fortran/.libs/libnetcdff.so -lnetcdf -ldl -lm
x86_64-pld-linux-gfortran -DPACKAGE_NAME=\"netCDF-Fortran\" -DPACKAGE_TARNAME=\"netcdf-fortran\" -DPACKAGE_VERSION=\"4.5.3\" -DPACKAGE_STRING=\"netCDF-Fortran\ 4.5.3\" -DPACKAGE_BUGREPORT=\"support-netcdf@unidata.ucar.edu\" -DPACKAGE_URL=\"\" -DPACKAGE=\"netcdf-fortran\" -DVERSION=\"4.5.3\" -DNF_RELAX_COORD_BOUND=1 -DENABLE_CDF5=1 -DHAVE_F2008=1 -DHAVE_TS29113_SUPPORT=1 -DTEMP_LARGE=\".\" -DSTDC_HEADERS=1 -DHAVE_SYS_TYPES_H=1 -DHAVE_SYS_STAT_H=1 -DHAVE_STDLIB_H=1 -DHAVE_STRING_H=1 -DHAVE_MEMORY_H=1 -DHAVE_STRINGS_H=1 -DHAVE_INTTYPES_H=1 -DHAVE_STDINT_H=1 -DHAVE_UNISTD_H=1 -DHAVE_DLFCN_H=1 -DLT_OBJDIR=\".libs/\" -DNF_INT1_T=byte -DNF_INT2_T=integer\*2 -DNF_INT8_T=integer\*8 -DNF_INT1_IS_C_SIGNED_CHAR=1 -DNF_INT2_IS_C_SHORT=1 -DNF_INT8_IS_C_LONG_LONG=1 -DNF_INT_IS_C_INT=1 -DNF_REAL_IS_C_FLOAT=1 -DNF_DOUBLEPRECISION_IS_C_DOUBLE=1 -DNCBYTE_T=byte -DNCSHORT_T=integer\*2 -DHAVE_LIBM=1 -DHAVE_NETCDF_H=1 -DHAVE_NC_DEF_OPAQUE=1 -DHAVE_NCCREATE=1 -DHAVE_NC_SET_LOG_LEVEL=1 -DHAVE_OC_OPEN=1 -DHAVE_NC_DEF_VAR_SZIP=1 -DHAVE_NC_GET_CHUNK_CACHE_INTS=1 -DUSE_NETCDF4=1 -DLOGGING=1 -DHAVE_SYS_PARAM_H=1 -DHAVE_LOCALE_H=1 -DHAVE_STDIO_H=1 -DHAVE_STDARG_H=1 -DHAVE_ERRNO_H=1 -DHAVE_CTYPE_H=1 -DHAVE_FCNTL_H=1 -DHAVE_MALLOC_H=1 -DHAVE_STDLIB_H=1 -DHAVE_STRING_H=1 -DHAVE_STRINGS_H=1 -DHAVE_UNISTD_H=1 -DHAVE_SYS_STAT_H=1 -DHAVE_GETOPT_H=1 -DHAVE_SYS_TIME_H=1 -DHAVE_SYS_RESOURCE_H=1 -DHAVE_DIRENT_H=1 -DSTDC_HEADERS=1 -DHAVE_SYS_WAIT_H=1 -DTIME_WITH_SYS_TIME=1 -DHAVE_VPRINTF=1 -DHAVE__BOOL=1 -DHAVE_STDBOOL_H=1 -DHAVE_ALLOCA_H=1 -DHAVE_ALLOCA=1 -DHAVE_SSIZE_T=1 -DHAVE_PTRDIFF_T=1 -DSIZEOF_SHORT=2 -DSIZEOF_INT=4 -DSIZEOF_LONG=8 -DSIZEOF_FLOAT=4 -DSIZEOF_DOUBLE=8 -DSIZEOF_OFF_T=8 -DSIZEOF_SIZE_T=8 -DSIZEOF_PTRDIFF_T=8 -I.   -DgFortran=1 -I../fortran -O2 -fwrapv -pipe -Wformat -Werror=format-security -gdwarf-4 -fno-debug-types-section -fvar-tracking-assignments -g2 -Wp,-D_FORTIFY_SOURCE=2 -fstack-protector-strong --param=ssp-buffer-size=4 -Werror=trampolines -fPIC -march=x86-64 -gdwarf-4 -fno-debug-types-section -fvar-tracking-assignments -g2  -c -o tst_int64.o tst_int64.F
f951: Warning: command-line option '-Wformat=1' is valid for C/C++/ObjC/ObjC++ but not for Fortran
f951: Warning: '-Werror=' argument '-Werror=format-security' is not valid for Fortran
/bin/sh ../libtool  --tag=F77   --mode=link x86_64-pld-linux-gfortran -I../fortran -O2 -fwrapv -pipe -Wformat -Werror=format-security -gdwarf-4 -fno-debug-types-section -fvar-tracking-assignments -g2 -Wp,-D_FORTIFY_SOURCE=2 -fstack-protector-strong --param=ssp-buffer-size=4 -Werror=trampolines -fPIC -march=x86-64 -gdwarf-4 -fno-debug-types-section -fvar-tracking-assignments -g2   -Wl,--as-needed -Wl,--no-copy-dt-needed-entries -Wl,-z,relro -Wl,-z,combreloc  -o tst_int64 tst_int64.o ../fortran/libnetcdff.la -lnetcdf -ldl -lm 
libtool: link: x86_64-pld-linux-gfortran -I../fortran -O2 -fwrapv -pipe -Wformat -Werror=format-security -gdwarf-4 -fno-debug-types-section -fvar-tracking-assignments -g2 -Wp,-D_FORTIFY_SOURCE=2 -fstack-protector-strong --param=ssp-buffer-size=4 -Werror=trampolines -fPIC -march=x86-64 -gdwarf-4 -fno-debug-types-section -fvar-tracking-assignments -g2 -Wl,--as-needed -Wl,--no-copy-dt-needed-entries -Wl,-z -Wl,relro -Wl,-z -Wl,combreloc -o .libs/tst_int64 tst_int64.o  ../fortran/.libs/libnetcdff.so -lnetcdf -ldl -lm
x86_64-pld-linux-gfortran -DPACKAGE_NAME=\"netCDF-Fortran\" -DPACKAGE_TARNAME=\"netcdf-fortran\" -DPACKAGE_VERSION=\"4.5.3\" -DPACKAGE_STRING=\"netCDF-Fortran\ 4.5.3\" -DPACKAGE_BUGREPORT=\"support-netcdf@unidata.ucar.edu\" -DPACKAGE_URL=\"\" -DPACKAGE=\"netcdf-fortran\" -DVERSION=\"4.5.3\" -DNF_RELAX_COORD_BOUND=1 -DENABLE_CDF5=1 -DHAVE_F2008=1 -DHAVE_TS29113_SUPPORT=1 -DTEMP_LARGE=\".\" -DSTDC_HEADERS=1 -DHAVE_SYS_TYPES_H=1 -DHAVE_SYS_STAT_H=1 -DHAVE_STDLIB_H=1 -DHAVE_STRING_H=1 -DHAVE_MEMORY_H=1 -DHAVE_STRINGS_H=1 -DHAVE_INTTYPES_H=1 -DHAVE_STDINT_H=1 -DHAVE_UNISTD_H=1 -DHAVE_DLFCN_H=1 -DLT_OBJDIR=\".libs/\" -DNF_INT1_T=byte -DNF_INT2_T=integer\*2 -DNF_INT8_T=integer\*8 -DNF_INT1_IS_C_SIGNED_CHAR=1 -DNF_INT2_IS_C_SHORT=1 -DNF_INT8_IS_C_LONG_LONG=1 -DNF_INT_IS_C_INT=1 -DNF_REAL_IS_C_FLOAT=1 -DNF_DOUBLEPRECISION_IS_C_DOUBLE=1 -DNCBYTE_T=byte -DNCSHORT_T=integer\*2 -DHAVE_LIBM=1 -DHAVE_NETCDF_H=1 -DHAVE_NC_DEF_OPAQUE=1 -DHAVE_NCCREATE=1 -DHAVE_NC_SET_LOG_LEVEL=1 -DHAVE_OC_OPEN=1 -DHAVE_NC_DEF_VAR_SZIP=1 -DHAVE_NC_GET_CHUNK_CACHE_INTS=1 -DUSE_NETCDF4=1 -DLOGGING=1 -DHAVE_SYS_PARAM_H=1 -DHAVE_LOCALE_H=1 -DHAVE_STDIO_H=1 -DHAVE_STDARG_H=1 -DHAVE_ERRNO_H=1 -DHAVE_CTYPE_H=1 -DHAVE_FCNTL_H=1 -DHAVE_MALLOC_H=1 -DHAVE_STDLIB_H=1 -DHAVE_STRING_H=1 -DHAVE_STRINGS_H=1 -DHAVE_UNISTD_H=1 -DHAVE_SYS_STAT_H=1 -DHAVE_GETOPT_H=1 -DHAVE_SYS_TIME_H=1 -DHAVE_SYS_RESOURCE_H=1 -DHAVE_DIRENT_H=1 -DSTDC_HEADERS=1 -DHAVE_SYS_WAIT_H=1 -DTIME_WITH_SYS_TIME=1 -DHAVE_VPRINTF=1 -DHAVE__BOOL=1 -DHAVE_STDBOOL_H=1 -DHAVE_ALLOCA_H=1 -DHAVE_ALLOCA=1 -DHAVE_SSIZE_T=1 -DHAVE_PTRDIFF_T=1 -DSIZEOF_SHORT=2 -DSIZEOF_INT=4 -DSIZEOF_LONG=8 -DSIZEOF_FLOAT=4 -DSIZEOF_DOUBLE=8 -DSIZEOF_OFF_T=8 -DSIZEOF_SIZE_T=8 -DSIZEOF_PTRDIFF_T=8 -I.   -DgFortran=1 -I../fortran -O2 -fwrapv -pipe -Wformat -Werror=format-security -gdwarf-4 -fno-debug-types-section -fvar-tracking-assignments -g2 -Wp,-D_FORTIFY_SOURCE=2 -fstack-protector-strong --param=ssp-buffer-size=4 -Werror=trampolines -fPIC -march=x86-64 -gdwarf-4 -fno-debug-types-section -fvar-tracking-assignments -g2  -c -o tst_f77_v2.o tst_f77_v2.F
f951: Warning: command-line option '-Wformat=1' is valid for C/C++/ObjC/ObjC++ but not for Fortran
f951: Warning: '-Werror=' argument '-Werror=format-security' is not valid for Fortran
/bin/sh ../libtool  --tag=F77   --mode=link x86_64-pld-linux-gfortran -I../fortran -O2 -fwrapv -pipe -Wformat -Werror=format-security -gdwarf-4 -fno-debug-types-section -fvar-tracking-assignments -g2 -Wp,-D_FORTIFY_SOURCE=2 -fstack-protector-strong --param=ssp-buffer-size=4 -Werror=trampolines -fPIC -march=x86-64 -gdwarf-4 -fno-debug-types-section -fvar-tracking-assignments -g2   -Wl,--as-needed -Wl,--no-copy-dt-needed-entries -Wl,-z,relro -Wl,-z,combreloc  -o tst_f77_v2 tst_f77_v2.o ../fortran/libnetcdff.la -lnetcdf -ldl -lm 
libtool: link: x86_64-pld-linux-gfortran -I../fortran -O2 -fwrapv -pipe -Wformat -Werror=format-security -gdwarf-4 -fno-debug-types-section -fvar-tracking-assignments -g2 -Wp,-D_FORTIFY_SOURCE=2 -fstack-protector-strong --param=ssp-buffer-size=4 -Werror=trampolines -fPIC -march=x86-64 -gdwarf-4 -fno-debug-types-section -fvar-tracking-assignments -g2 -Wl,--as-needed -Wl,--no-copy-dt-needed-entries -Wl,-z -Wl,relro -Wl,-z -Wl,combreloc -o .libs/tst_f77_v2 tst_f77_v2.o  ../fortran/.libs/libnetcdff.so -lnetcdf -ldl -lm
x86_64-pld-linux-gfortran -DPACKAGE_NAME=\"netCDF-Fortran\" -DPACKAGE_TARNAME=\"netcdf-fortran\" -DPACKAGE_VERSION=\"4.5.3\" -DPACKAGE_STRING=\"netCDF-Fortran\ 4.5.3\" -DPACKAGE_BUGREPORT=\"support-netcdf@unidata.ucar.edu\" -DPACKAGE_URL=\"\" -DPACKAGE=\"netcdf-fortran\" -DVERSION=\"4.5.3\" -DNF_RELAX_COORD_BOUND=1 -DENABLE_CDF5=1 -DHAVE_F2008=1 -DHAVE_TS29113_SUPPORT=1 -DTEMP_LARGE=\".\" -DSTDC_HEADERS=1 -DHAVE_SYS_TYPES_H=1 -DHAVE_SYS_STAT_H=1 -DHAVE_STDLIB_H=1 -DHAVE_STRING_H=1 -DHAVE_MEMORY_H=1 -DHAVE_STRINGS_H=1 -DHAVE_INTTYPES_H=1 -DHAVE_STDINT_H=1 -DHAVE_UNISTD_H=1 -DHAVE_DLFCN_H=1 -DLT_OBJDIR=\".libs/\" -DNF_INT1_T=byte -DNF_INT2_T=integer\*2 -DNF_INT8_T=integer\*8 -DNF_INT1_IS_C_SIGNED_CHAR=1 -DNF_INT2_IS_C_SHORT=1 -DNF_INT8_IS_C_LONG_LONG=1 -DNF_INT_IS_C_INT=1 -DNF_REAL_IS_C_FLOAT=1 -DNF_DOUBLEPRECISION_IS_C_DOUBLE=1 -DNCBYTE_T=byte -DNCSHORT_T=integer\*2 -DHAVE_LIBM=1 -DHAVE_NETCDF_H=1 -DHAVE_NC_DEF_OPAQUE=1 -DHAVE_NCCREATE=1 -DHAVE_NC_SET_LOG_LEVEL=1 -DHAVE_OC_OPEN=1 -DHAVE_NC_DEF_VAR_SZIP=1 -DHAVE_NC_GET_CHUNK_CACHE_INTS=1 -DUSE_NETCDF4=1 -DLOGGING=1 -DHAVE_SYS_PARAM_H=1 -DHAVE_LOCALE_H=1 -DHAVE_STDIO_H=1 -DHAVE_STDARG_H=1 -DHAVE_ERRNO_H=1 -DHAVE_CTYPE_H=1 -DHAVE_FCNTL_H=1 -DHAVE_MALLOC_H=1 -DHAVE_STDLIB_H=1 -DHAVE_STRING_H=1 -DHAVE_STRINGS_H=1 -DHAVE_UNISTD_H=1 -DHAVE_SYS_STAT_H=1 -DHAVE_GETOPT_H=1 -DHAVE_SYS_TIME_H=1 -DHAVE_SYS_RESOURCE_H=1 -DHAVE_DIRENT_H=1 -DSTDC_HEADERS=1 -DHAVE_SYS_WAIT_H=1 -DTIME_WITH_SYS_TIME=1 -DHAVE_VPRINTF=1 -DHAVE__BOOL=1 -DHAVE_STDBOOL_H=1 -DHAVE_ALLOCA_H=1 -DHAVE_ALLOCA=1 -DHAVE_SSIZE_T=1 -DHAVE_PTRDIFF_T=1 -DSIZEOF_SHORT=2 -DSIZEOF_INT=4 -DSIZEOF_LONG=8 -DSIZEOF_FLOAT=4 -DSIZEOF_DOUBLE=8 -DSIZEOF_OFF_T=8 -DSIZEOF_SIZE_T=8 -DSIZEOF_PTRDIFF_T=8 -I.   -DgFortran=1 -I../fortran -O2 -fwrapv -pipe -Wformat -Werror=format-security -gdwarf-4 -fno-debug-types-section -fvar-tracking-assignments -g2 -Wp,-D_FORTIFY_SOURCE=2 -fstack-protector-strong --param=ssp-buffer-size=4 -Werror=trampolines -fPIC -march=x86-64 -gdwarf-4 -fno-debug-types-section -fvar-tracking-assignments -g2  -c -o ftest.o ftest.F
f951: Warning: command-line option '-Wformat=1' is valid for C/C++/ObjC/ObjC++ but not for Fortran
f951: Warning: '-Werror=' argument '-Werror=format-security' is not valid for Fortran
ftest.F:1436:33:

 1433 |       call ncvgt1(ncid, bid, ix, b, iret)
      |                                 2
......
 1436 |       call ncvgt1(ncid, sid, ix, s, iret)
      |                                 1
Error: Type mismatch between actual argument at (1) and actual argument at (2) (INTEGER(2)/INTEGER(1)).
ftest.F:1439:33:

 1433 |       call ncvgt1(ncid, bid, ix, b, iret)
      |                                 2
......
 1439 |       call ncvgt1(ncid, lid, ix, l, iret)
      |                                 1
Error: Type mismatch between actual argument at (1) and actual argument at (2) (INTEGER(4)/INTEGER(1)).
ftest.F:1442:33:

 1433 |       call ncvgt1(ncid, bid, ix, b, iret)
      |                                 2
......
 1442 |       call ncvgt1(ncid, fid, ix, f, iret)
      |                                 1
Error: Type mismatch between actual argument at (1) and actual argument at (2) (REAL(4)/INTEGER(1)).
ftest.F:1445:33:

 1433 |       call ncvgt1(ncid, bid, ix, b, iret)
      |                                 2
......
 1445 |       call ncvgt1(ncid, did, ix, d, iret)
      |                                 1
Error: Type mismatch between actual argument at (1) and actual argument at (2) (REAL(8)/INTEGER(1)).
ftest.F:224:50:

  213 |             call ncagt (outcdf, NCBYTE, attnam, bytval, iret)
      |                                                2  
......
  224 |             call ncagt (outcdf, NCGLOBAL, attnam, shval, iret)
      |                                                  1
Error: Type mismatch between actual argument at (1) and actual argument at (2) (INTEGER(2)/INTEGER(1)).
ftest.F:227:50:

  213 |             call ncagt (outcdf, NCBYTE, attnam, bytval, iret)
      |                                                2  
......
  227 |             call ncagt (outcdf, NCGLOBAL, attnam, lngval, iret)
      |                                                  1
Error: Type mismatch between actual argument at (1) and actual argument at (2) (INTEGER(4)/INTEGER(1)).
ftest.F:230:50:

  213 |             call ncagt (outcdf, NCBYTE, attnam, bytval, iret)
      |                                                2  
......
  230 |             call ncagt (outcdf, NCGLOBAL, attnam, flval, iret)
      |                                                  1
Error: Type mismatch between actual argument at (1) and actual argument at (2) (REAL(4)/INTEGER(1)).
ftest.F:233:50:

  213 |             call ncagt (outcdf, NCBYTE, attnam, bytval, iret)
      |                                                2  
......
  233 |             call ncagt (outcdf, NCGLOBAL, attnam, doubval,iret)
      |                                                  1
Error: Type mismatch between actual argument at (1) and actual argument at (2) (REAL(8)/INTEGER(1)).
ftest.F:272:49:

  213 |             call ncagt (outcdf, NCBYTE, attnam, bytval, iret)
      |                                                2 
......
  272 |                   call ncagt (outcdf, i, attnam, shval,
      |                                                 1
Error: Type mismatch between actual argument at (1) and actual argument at (2) (INTEGER(2)/INTEGER(1)).
ftest.F:281:49:

  213 |             call ncagt (outcdf, NCBYTE, attnam, bytval, iret)
      |                                                2 
......
  281 |                   call ncagt (outcdf, i, attnam, lngval,
      |                                                 1
Error: Type mismatch between actual argument at (1) and actual argument at (2) (INTEGER(4)/INTEGER(1)).
ftest.F:289:49:

  213 |             call ncagt (outcdf, NCBYTE, attnam, bytval, iret)
      |                                                2 
......
  289 |                   call ncagt (outcdf, i, attnam, flval,
      |                                                 1
Error: Type mismatch between actual argument at (1) and actual argument at (2) (REAL(4)/INTEGER(1)).
ftest.F:297:49:

  213 |             call ncagt (outcdf, NCBYTE, attnam, bytval, iret)
      |                                                2 
......
  297 |                   call ncagt (outcdf, i, attnam, doubval,
      |                                                 1
Error: Type mismatch between actual argument at (1) and actual argument at (2) (REAL(8)/INTEGER(1)).
ftest.F:444:48:

  213 |             call ncagt (outcdf, NCBYTE, attnam, bytval, iret)
      |                                                2
......
  444 |             call ncagt (ncid, NCGLOBAL, attnam, shval, iret)
      |                                                1
Error: Type mismatch between actual argument at (1) and actual argument at (2) (INTEGER(2)/INTEGER(1)).
ftest.F:447:48:

  213 |             call ncagt (outcdf, NCBYTE, attnam, bytval, iret)
      |                                                2
......
  447 |             call ncagt (ncid, NCGLOBAL, attnam, lngval, iret)
      |                                                1
Error: Type mismatch between actual argument at (1) and actual argument at (2) (INTEGER(4)/INTEGER(1)).
ftest.F:450:48:

  213 |             call ncagt (outcdf, NCBYTE, attnam, bytval, iret)
      |                                                2
......
  450 |             call ncagt (ncid, NCGLOBAL, attnam, flval, iret)
      |                                                1
Error: Type mismatch between actual argument at (1) and actual argument at (2) (REAL(4)/INTEGER(1)).
ftest.F:453:48:

  213 |             call ncagt (outcdf, NCBYTE, attnam, bytval, iret)
      |                                                2
......
  453 |             call ncagt (ncid, NCGLOBAL, attnam, doubval,iret)
      |                                                1
Error: Type mismatch between actual argument at (1) and actual argument at (2) (REAL(8)/INTEGER(1)).
ftest.F:493:47:

  213 |             call ncagt (outcdf, NCBYTE, attnam, bytval, iret)
      |                                                2
......
  493 |                   call ncagt (ncid, i, attnam, shval,
      |                                               1
Error: Type mismatch between actual argument at (1) and actual argument at (2) (INTEGER(2)/INTEGER(1)).
ftest.F:502:47:

  213 |             call ncagt (outcdf, NCBYTE, attnam, bytval, iret)
      |                                                2
......
  502 |                   call ncagt (ncid, i, attnam, lngval,
      |                                               1
Error: Type mismatch between actual argument at (1) and actual argument at (2) (INTEGER(4)/INTEGER(1)).
ftest.F:510:47:

  213 |             call ncagt (outcdf, NCBYTE, attnam, bytval, iret)
      |                                                2
......
  510 |                   call ncagt (ncid, i, attnam, flval,
      |                                               1
Error: Type mismatch between actual argument at (1) and actual argument at (2) (REAL(4)/INTEGER(1)).
ftest.F:518:47:

  213 |             call ncagt (outcdf, NCBYTE, attnam, bytval, iret)
      |                                                2
......
  518 |                   call ncagt (ncid, i, attnam, doubval,
      |                                               1
Error: Type mismatch between actual argument at (1) and actual argument at (2) (REAL(8)/INTEGER(1)).
ftest.F:1039:47:

 1026 |             call ncvgt (ncid, m, start, count, barray, iret)
      |                                               2
......
 1039 |             call ncvgt (ncid, m, start, count, sarray, iret)
      |                                               1
Error: Type mismatch between actual argument at (1) and actual argument at (2) (INTEGER(2)/INTEGER(1)).
ftest.F:1052:47:

 1026 |             call ncvgt (ncid, m, start, count, barray, iret)
      |                                               2
......
 1052 |             call ncvgt (ncid, m, start, count, larray, iret)
      |                                               1
Error: Type mismatch between actual argument at (1) and actual argument at (2) (INTEGER(4)/INTEGER(1)).
ftest.F:1064:47:

 1026 |             call ncvgt (ncid, m, start, count, barray, iret)
      |                                               2
......
 1064 |             call ncvgt (ncid, m, start, count, farray, iret)
      |                                               1
Error: Type mismatch between actual argument at (1) and actual argument at (2) (REAL(4)/INTEGER(1)).
ftest.F:1085:47:

 1026 |             call ncvgt (ncid, m, start, count, barray, iret)
      |                                               2
......
 1085 |             call ncvgt (ncid, m, start, count, darray, iret)
      |                                               1
Error: Type mismatch between actual argument at (1) and actual argument at (2) (REAL(8)/INTEGER(1)).
ftest.F:1260:43:

 1254 |       call ncvpt (ncid, bid, start, count, barray, iret)
      |                                           2
......
 1260 |       call ncvpt (ncid, sid, start, count, sarray, iret)
      |                                           1
Error: Type mismatch between actual argument at (1) and actual argument at (2) (INTEGER(2)/INTEGER(1)).
ftest.F:1269:43:

 1254 |       call ncvpt (ncid, bid, start, count, barray, iret)
      |                                           2
......
 1269 |       call ncvpt (ncid, lid, start, count, larray, iret)
      |                                           1
Error: Type mismatch between actual argument at (1) and actual argument at (2) (INTEGER(4)/INTEGER(1)).
ftest.F:1287:43:

 1254 |       call ncvpt (ncid, bid, start, count, barray, iret)
      |                                           2
......
 1287 |       call ncvpt (ncid, fid, start, count, farray, iret)
      |                                           1
Error: Type mismatch between actual argument at (1) and actual argument at (2) (REAL(4)/INTEGER(1)).
ftest.F:1305:43:

 1254 |       call ncvpt (ncid, bid, start, count, barray, iret)
      |                                           2
......
 1305 |       call ncvpt (ncid, did, start, count, darray, iret)
      |                                           1
Error: Type mismatch between actual argument at (1) and actual argument at (2) (REAL(8)/INTEGER(1)).
ftest.F:1164:37:

 1164 |       call ncvgt1 (ncid, sid, sindx, svalue, iret)
      |                                     1
......
 1433 |       call ncvgt1(ncid, bid, ix, b, iret)
      |                                 2    
Error: Type mismatch between actual argument at (1) and actual argument at (2) (INTEGER(2)/INTEGER(1)).
ftest.F:1171:37:

 1171 |       call ncvgt1 (ncid, lid, lindx, lvalue, iret)
      |                                     1
......
 1433 |       call ncvgt1(ncid, bid, ix, b, iret)
      |                                 2    
Error: Type mismatch between actual argument at (1) and actual argument at (2) (INTEGER(4)/INTEGER(1)).
ftest.F:1178:37:

 1178 |       call ncvgt1 (ncid, fid, findx, fvalue, iret)
      |                                     1
......
 1433 |       call ncvgt1(ncid, bid, ix, b, iret)
      |                                 2    
Error: Type mismatch between actual argument at (1) and actual argument at (2) (REAL(4)/INTEGER(1)).
ftest.F:1186:37:

 1186 |       call ncvgt1 (ncid, did, dindx, dvalue, iret)
      |                                     1
......
 1433 |       call ncvgt1(ncid, bid, ix, b, iret)
      |                                 2    
Error: Type mismatch between actual argument at (1) and actual argument at (2) (REAL(8)/INTEGER(1)).
ftest.F:1366:37:

 1360 |       call ncvpt1 (ncid, bid, bindx, bvalue, iret)
      |                                     2
......
 1366 |       call ncvpt1 (ncid, sid, sindx, svalue, iret)
      |                                     1
Error: Type mismatch between actual argument at (1) and actual argument at (2) (INTEGER(2)/INTEGER(1)).
ftest.F:1372:37:

 1360 |       call ncvpt1 (ncid, bid, bindx, bvalue, iret)
      |                                     2
......
 1372 |       call ncvpt1 (ncid, lid, lindx, lvalue, iret)
      |                                     1
Error: Type mismatch between actual argument at (1) and actual argument at (2) (INTEGER(4)/INTEGER(1)).
ftest.F:1378:37:

 1360 |       call ncvpt1 (ncid, bid, bindx, bvalue, iret)
      |                                     2
......
 1378 |       call ncvpt1 (ncid, fid, findx, 3.14159, iret)
      |                                     1
Error: Type mismatch between actual argument at (1) and actual argument at (2) (REAL(4)/INTEGER(1)).
ftest.F:1384:37:

 1360 |       call ncvpt1 (ncid, bid, bindx, bvalue, iret)
      |                                     2
......
 1384 |       call ncvpt1 (ncid, did, dindx, onethird, iret)
      |                                     1
Error: Type mismatch between actual argument at (1) and actual argument at (2) (REAL(8)/INTEGER(1)).
ftest.F:569:72:

  559 |       call ncapt (ncid, bid, 'validrange', NCBYTE, 2,
      |                                                                        2
......
  569 |       call ncapt (ncid, sid, 'validrange', NCSHORT, 2,
      |                                                                        1
Error: Type mismatch between actual argument at (1) and actual argument at (2) (INTEGER(2)/INTEGER(1)).
ftest.F:579:72:

  559 |       call ncapt (ncid, bid, 'validrange', NCBYTE, 2,
      |                                                                        2
......
  579 |       call ncapt (ncid, lid, 'validrange', NCLONG, 2,
      |                                                                        1
Error: Type mismatch between actual argument at (1) and actual argument at (2) (INTEGER(4)/INTEGER(1)).
ftest.F:589:72:

  559 |       call ncapt (ncid, bid, 'validrange', NCBYTE, 2,
      |                                                                        2
......
  589 |       call ncapt (ncid, fid, 'validrange', NCFLOAT, 2,
      |                                                                        1
Error: Type mismatch between actual argument at (1) and actual argument at (2) (REAL(4)/INTEGER(1)).
ftest.F:599:72:

  559 |       call ncapt (ncid, bid, 'validrange', NCBYTE, 2,
      |                                                                        2
......
  599 |       call ncapt (ncid, did, 'validrange', NCDOUBLE, 2,
      |                                                                        1
Error: Type mismatch between actual argument at (1) and actual argument at (2) (REAL(8)/INTEGER(1)).
make[3]: *** [Makefile:852: ftest.o] Error 1
make[3]: Leaving directory '/tmp/B.cp1MVZ/BUILD/netcdf-fortran-4.5.3/nf_test'
make[2]: *** [Makefile:1206: check-am] Error 2
make[2]: Leaving directory '/tmp/B.cp1MVZ/BUILD/netcdf-fortran-4.5.3/nf_test'
make[1]: *** [Makefile:1209: check] Error 2
make[1]: Leaving directory '/tmp/B.cp1MVZ/BUILD/netcdf-fortran-4.5.3/nf_test'
make: *** [Makefile:581: check-recursive] Error 1
error: Bad exit status from /tmp/B.cp1MVZ/BUILD/tmp/rpm-tmp.8757 (%build)


RPM build errors:
    Bad exit status from /tmp/B.cp1MVZ/BUILD/tmp/rpm-tmp.8757 (%build)
ended at: Wed Nov 11 22:02:59 2020, done in 0:01:26.149838
error: No files produced.
+ chmod -R u+rwX /tmp/B.cp1MVZ/BUILD
+ rm -rf /tmp/B.cp1MVZ/tmp /tmp/B.cp1MVZ/BUILD
+ rm -rf /tmp/B.cp1MVZ
Begin-PLD-Builder-Info
Build-Time: user:104.49s sys:13.41s real:88.91s (faults io:78 non-io:3462345)

End-PLD-Builder-Info
[Back to list of logs] [View rpm -qa of builder]