FailedOk

th/SRPMS[OK]
th/x32[OK]
th/i686[OK]
th/x86_64[OK]

ac/SRPMS[OK]
ac/i386[OK]
ac/i586[OK]
ac/i686[OK]
ac/alpha[OK]
ac/amd64[OK]
ac/athlon[OK]
ac/ppc[OK]
ac/sparc[OK]
ac/sparc64[OK]

Advanced Search
main()
Powered by PLD Linux
(c) 2002-2019 PLD Team
$Revision: 1.37 $
Powered by Microsoft Windows 2003.
Your IP: 18.206.13.39

nomacs 82fd3e17-2a33-4089-9ca1-a44fc6b4e3d3

Status:Failed
Source URL:ftp://buildlogs.pld-linux.org/th/x86_64/FAIL/nomacs,82fd3e17-2a33-4089-9ca1-a44fc6b4e3d3.bz2
text/plain URL:View!
full text:View!
rpm -qa of builder:View!
Date:2019/02/10 12:01:30
Runtime:0:00:23.554731

Toc:

  • error 1
  • /tmp/B.qjM4WT/BUILD/nomacs-3.4.1/ImageLounge/src/DkLoader/DkMetaData.cpp:1267:55: error: no matching function for call to 'Exiv2::BasicError<char>::BasicError(int, const char [29])'
  • error 2
  • make[2]: *** [CMakeFiles/nomacsLoader.dir/build.make:284: CMakeFiles/nomacsLoader.dir/src/DkLoader/DkMetaData.cpp.o] Error 1
  • error 3
  • make[1]: *** [CMakeFiles/Makefile2:186: CMakeFiles/nomacsLoader.dir/all] Error 2
  • error 4
  • error: Bad exit status from /tmp/B.qjM4WT/BUILD/tmp/rpm-tmp.73986 (%build)
  • error 5
  • RPM build errors:
  • error 6
  • error: No files produced.

Content:

make[2]: Leaving directory '/tmp/B.qjM4WT/BUILD/nomacs-3.4.1/build'
make[1]: Entering directory '/tmp/B.qjM4WT/BUILD/nomacs-3.4.1/build'
[  1%] Built target nomacsCore_autogen
make[1]: Leaving directory '/tmp/B.qjM4WT/BUILD/nomacs-3.4.1/build'
/usr/bin/make -f CMakeFiles/nomacsCore.dir/build.make CMakeFiles/nomacsCore.dir/depend
make[2]: Entering directory '/tmp/B.qjM4WT/BUILD/nomacs-3.4.1/build'
[  2%] Generating qrc_nomacs.cpp
/usr/lib64/qt5/bin/rcc --name nomacs --output /tmp/B.qjM4WT/BUILD/nomacs-3.4.1/build/qrc_nomacs.cpp /tmp/B.qjM4WT/BUILD/nomacs-3.4.1/ImageLounge/src/nomacs.qrc
make[2]: Leaving directory '/tmp/B.qjM4WT/BUILD/nomacs-3.4.1/build'
make[2]: Entering directory '/tmp/B.qjM4WT/BUILD/nomacs-3.4.1/build'
cd /tmp/B.qjM4WT/BUILD/nomacs-3.4.1/build && /usr/bin/cmake -E cmake_depends "Unix Makefiles" /tmp/B.qjM4WT/BUILD/nomacs-3.4.1/ImageLounge /tmp/B.qjM4WT/BUILD/nomacs-3.4.1/ImageLounge /tmp/B.qjM4WT/BUILD/nomacs-3.4.1/build /tmp/B.qjM4WT/BUILD/nomacs-3.4.1/build /tmp/B.qjM4WT/BUILD/nomacs-3.4.1/build/CMakeFiles/nomacsCore.dir/DependInfo.cmake --color=
Scanning dependencies of target nomacsCore
make[2]: Leaving directory '/tmp/B.qjM4WT/BUILD/nomacs-3.4.1/build'
/usr/bin/make -f CMakeFiles/nomacsCore.dir/build.make CMakeFiles/nomacsCore.dir/build
make[2]: Entering directory '/tmp/B.qjM4WT/BUILD/nomacs-3.4.1/build'
[  9%] Building CXX object CMakeFiles/nomacsCore.dir/qrc_nomacs.cpp.o
/usr/bin/x86_64-pld-linux-g++  -DHAVE_EXIV2_HPP -DNOMACS_VERSION=\"3.4\" -DQT5 -DQT_CONCURRENT_LIB -DQT_CORE_LIB -DQT_GUI_LIB -DQT_NETWORK_LIB -DQT_NO_DEBUG -DQT_NO_DEBUG_OUTPUT -DQT_PRINTSUPPORT_LIB -DQT_SVG_LIB -DQT_WIDGETS_LIB -DWITH_LIBRAW -DWITH_LIBTIFF -DWITH_OPENCV -DWITH_PLUGINS -DWITH_QUAZIP -DnomacsCore_EXPORTS -I/tmp/B.qjM4WT/BUILD/nomacs-3.4.1/build -I/tmp/B.qjM4WT/BUILD/nomacs-3.4.1/ImageLounge -I/tmp/B.qjM4WT/BUILD/nomacs-3.4.1/build/nomacsCore_autogen/include -I/usr/include/libraw -I/tmp/B.qjM4WT/BUILD/nomacs-3.4.1/ImageLounge/src -I/tmp/B.qjM4WT/BUILD/nomacs-3.4.1/ImageLounge/src/DkCore -I/tmp/B.qjM4WT/BUILD/nomacs-3.4.1/ImageLounge/src/DkLoader -I/tmp/B.qjM4WT/BUILD/nomacs-3.4.1/ImageLounge/src/DkGui -isystem /usr/include/qt5 -isystem /usr/include/qt5/QtWidgets -isystem /usr/include/qt5/QtGui -isystem /usr/include/qt5/QtCore -isystem /usr/lib64/qt5/./mkspecs/linux-g++ -isystem /usr/include/qt5/QtNetwork -isystem /usr/include/qt5/QtPrintSupport -isystem /usr/include/qt5/QtConcurrent -isystem /usr/include/qt5/QtSvg -isystem /usr/include/opencv  -std=c++11 -Wno-unknown-pragmas -O2 -fwrapv -pipe -Wformat -Werror=format-security -gdwarf-4 -fno-debug-types-section -fvar-tracking-assignments -g2 -Wp,-D_FORTIFY_SOURCE=2 -fstack-protector-strong --param=ssp-buffer-size=4 -fPIC -march=x86-64 -gdwarf-4 -fno-debug-types-section -fvar-tracking-assignments -g2  -DNDEBUG -DQT_NO_DEBUG -fPIC   -DDK_CORE_DLL_EXPORT -DNOMINMAX -fPIC -std=gnu++11 -o CMakeFiles/nomacsCore.dir/qrc_nomacs.cpp.o -c /tmp/B.qjM4WT/BUILD/nomacs-3.4.1/build/qrc_nomacs.cpp
make[2]: Leaving directory '/tmp/B.qjM4WT/BUILD/nomacs-3.4.1/build'
make[2]: Entering directory '/tmp/B.qjM4WT/BUILD/nomacs-3.4.1/build'
[ 10%] Building CXX object CMakeFiles/nomacsCore.dir/nomacsCore_autogen/mocs_compilation.cpp.o
/usr/bin/x86_64-pld-linux-g++  -DHAVE_EXIV2_HPP -DNOMACS_VERSION=\"3.4\" -DQT5 -DQT_CONCURRENT_LIB -DQT_CORE_LIB -DQT_GUI_LIB -DQT_NETWORK_LIB -DQT_NO_DEBUG -DQT_NO_DEBUG_OUTPUT -DQT_PRINTSUPPORT_LIB -DQT_SVG_LIB -DQT_WIDGETS_LIB -DWITH_LIBRAW -DWITH_LIBTIFF -DWITH_OPENCV -DWITH_PLUGINS -DWITH_QUAZIP -DnomacsCore_EXPORTS -I/tmp/B.qjM4WT/BUILD/nomacs-3.4.1/build -I/tmp/B.qjM4WT/BUILD/nomacs-3.4.1/ImageLounge -I/tmp/B.qjM4WT/BUILD/nomacs-3.4.1/build/nomacsCore_autogen/include -I/usr/include/libraw -I/tmp/B.qjM4WT/BUILD/nomacs-3.4.1/ImageLounge/src -I/tmp/B.qjM4WT/BUILD/nomacs-3.4.1/ImageLounge/src/DkCore -I/tmp/B.qjM4WT/BUILD/nomacs-3.4.1/ImageLounge/src/DkLoader -I/tmp/B.qjM4WT/BUILD/nomacs-3.4.1/ImageLounge/src/DkGui -isystem /usr/include/qt5 -isystem /usr/include/qt5/QtWidgets -isystem /usr/include/qt5/QtGui -isystem /usr/include/qt5/QtCore -isystem /usr/lib64/qt5/./mkspecs/linux-g++ -isystem /usr/include/qt5/QtNetwork -isystem /usr/include/qt5/QtPrintSupport -isystem /usr/include/qt5/QtConcurrent -isystem /usr/include/qt5/QtSvg -isystem /usr/include/opencv  -std=c++11 -Wno-unknown-pragmas -O2 -fwrapv -pipe -Wformat -Werror=format-security -gdwarf-4 -fno-debug-types-section -fvar-tracking-assignments -g2 -Wp,-D_FORTIFY_SOURCE=2 -fstack-protector-strong --param=ssp-buffer-size=4 -fPIC -march=x86-64 -gdwarf-4 -fno-debug-types-section -fvar-tracking-assignments -g2  -DNDEBUG -DQT_NO_DEBUG -fPIC   -DDK_CORE_DLL_EXPORT -DNOMINMAX -fPIC -std=gnu++11 -o CMakeFiles/nomacsCore.dir/nomacsCore_autogen/mocs_compilation.cpp.o -c /tmp/B.qjM4WT/BUILD/nomacs-3.4.1/build/nomacsCore_autogen/mocs_compilation.cpp
make[2]: Leaving directory '/tmp/B.qjM4WT/BUILD/nomacs-3.4.1/build'
make[2]: Entering directory '/tmp/B.qjM4WT/BUILD/nomacs-3.4.1/build'
[  4%] Building CXX object CMakeFiles/nomacsCore.dir/src/DkCore/DkTimer.cpp.o
/usr/bin/x86_64-pld-linux-g++  -DHAVE_EXIV2_HPP -DNOMACS_VERSION=\"3.4\" -DQT5 -DQT_CONCURRENT_LIB -DQT_CORE_LIB -DQT_GUI_LIB -DQT_NETWORK_LIB -DQT_NO_DEBUG -DQT_NO_DEBUG_OUTPUT -DQT_PRINTSUPPORT_LIB -DQT_SVG_LIB -DQT_WIDGETS_LIB -DWITH_LIBRAW -DWITH_LIBTIFF -DWITH_OPENCV -DWITH_PLUGINS -DWITH_QUAZIP -DnomacsCore_EXPORTS -I/tmp/B.qjM4WT/BUILD/nomacs-3.4.1/build -I/tmp/B.qjM4WT/BUILD/nomacs-3.4.1/ImageLounge -I/tmp/B.qjM4WT/BUILD/nomacs-3.4.1/build/nomacsCore_autogen/include -I/usr/include/libraw -I/tmp/B.qjM4WT/BUILD/nomacs-3.4.1/ImageLounge/src -I/tmp/B.qjM4WT/BUILD/nomacs-3.4.1/ImageLounge/src/DkCore -I/tmp/B.qjM4WT/BUILD/nomacs-3.4.1/ImageLounge/src/DkLoader -I/tmp/B.qjM4WT/BUILD/nomacs-3.4.1/ImageLounge/src/DkGui -isystem /usr/include/qt5 -isystem /usr/include/qt5/QtWidgets -isystem /usr/include/qt5/QtGui -isystem /usr/include/qt5/QtCore -isystem /usr/lib64/qt5/./mkspecs/linux-g++ -isystem /usr/include/qt5/QtNetwork -isystem /usr/include/qt5/QtPrintSupport -isystem /usr/include/qt5/QtConcurrent -isystem /usr/include/qt5/QtSvg -isystem /usr/include/opencv  -std=c++11 -Wno-unknown-pragmas -O2 -fwrapv -pipe -Wformat -Werror=format-security -gdwarf-4 -fno-debug-types-section -fvar-tracking-assignments -g2 -Wp,-D_FORTIFY_SOURCE=2 -fstack-protector-strong --param=ssp-buffer-size=4 -fPIC -march=x86-64 -gdwarf-4 -fno-debug-types-section -fvar-tracking-assignments -g2  -DNDEBUG -DQT_NO_DEBUG -fPIC   -DDK_CORE_DLL_EXPORT -DNOMINMAX -fPIC -std=gnu++11 -o CMakeFiles/nomacsCore.dir/src/DkCore/DkTimer.cpp.o -c /tmp/B.qjM4WT/BUILD/nomacs-3.4.1/ImageLounge/src/DkCore/DkTimer.cpp
make[2]: Leaving directory '/tmp/B.qjM4WT/BUILD/nomacs-3.4.1/build'
make[2]: Entering directory '/tmp/B.qjM4WT/BUILD/nomacs-3.4.1/build'
[  3%] Building CXX object CMakeFiles/nomacsCore.dir/src/DkCore/DkMath.cpp.o
/usr/bin/x86_64-pld-linux-g++  -DHAVE_EXIV2_HPP -DNOMACS_VERSION=\"3.4\" -DQT5 -DQT_CONCURRENT_LIB -DQT_CORE_LIB -DQT_GUI_LIB -DQT_NETWORK_LIB -DQT_NO_DEBUG -DQT_NO_DEBUG_OUTPUT -DQT_PRINTSUPPORT_LIB -DQT_SVG_LIB -DQT_WIDGETS_LIB -DWITH_LIBRAW -DWITH_LIBTIFF -DWITH_OPENCV -DWITH_PLUGINS -DWITH_QUAZIP -DnomacsCore_EXPORTS -I/tmp/B.qjM4WT/BUILD/nomacs-3.4.1/build -I/tmp/B.qjM4WT/BUILD/nomacs-3.4.1/ImageLounge -I/tmp/B.qjM4WT/BUILD/nomacs-3.4.1/build/nomacsCore_autogen/include -I/usr/include/libraw -I/tmp/B.qjM4WT/BUILD/nomacs-3.4.1/ImageLounge/src -I/tmp/B.qjM4WT/BUILD/nomacs-3.4.1/ImageLounge/src/DkCore -I/tmp/B.qjM4WT/BUILD/nomacs-3.4.1/ImageLounge/src/DkLoader -I/tmp/B.qjM4WT/BUILD/nomacs-3.4.1/ImageLounge/src/DkGui -isystem /usr/include/qt5 -isystem /usr/include/qt5/QtWidgets -isystem /usr/include/qt5/QtGui -isystem /usr/include/qt5/QtCore -isystem /usr/lib64/qt5/./mkspecs/linux-g++ -isystem /usr/include/qt5/QtNetwork -isystem /usr/include/qt5/QtPrintSupport -isystem /usr/include/qt5/QtConcurrent -isystem /usr/include/qt5/QtSvg -isystem /usr/include/opencv  -std=c++11 -Wno-unknown-pragmas -O2 -fwrapv -pipe -Wformat -Werror=format-security -gdwarf-4 -fno-debug-types-section -fvar-tracking-assignments -g2 -Wp,-D_FORTIFY_SOURCE=2 -fstack-protector-strong --param=ssp-buffer-size=4 -fPIC -march=x86-64 -gdwarf-4 -fno-debug-types-section -fvar-tracking-assignments -g2  -DNDEBUG -DQT_NO_DEBUG -fPIC   -DDK_CORE_DLL_EXPORT -DNOMINMAX -fPIC -std=gnu++11 -o CMakeFiles/nomacsCore.dir/src/DkCore/DkMath.cpp.o -c /tmp/B.qjM4WT/BUILD/nomacs-3.4.1/ImageLounge/src/DkCore/DkMath.cpp
make[2]: Leaving directory '/tmp/B.qjM4WT/BUILD/nomacs-3.4.1/build'
make[2]: Entering directory '/tmp/B.qjM4WT/BUILD/nomacs-3.4.1/build'
[  8%] Building CXX object CMakeFiles/nomacsCore.dir/src/DkCore/DkUpdater.cpp.o
/usr/bin/x86_64-pld-linux-g++  -DHAVE_EXIV2_HPP -DNOMACS_VERSION=\"3.4\" -DQT5 -DQT_CONCURRENT_LIB -DQT_CORE_LIB -DQT_GUI_LIB -DQT_NETWORK_LIB -DQT_NO_DEBUG -DQT_NO_DEBUG_OUTPUT -DQT_PRINTSUPPORT_LIB -DQT_SVG_LIB -DQT_WIDGETS_LIB -DWITH_LIBRAW -DWITH_LIBTIFF -DWITH_OPENCV -DWITH_PLUGINS -DWITH_QUAZIP -DnomacsCore_EXPORTS -I/tmp/B.qjM4WT/BUILD/nomacs-3.4.1/build -I/tmp/B.qjM4WT/BUILD/nomacs-3.4.1/ImageLounge -I/tmp/B.qjM4WT/BUILD/nomacs-3.4.1/build/nomacsCore_autogen/include -I/usr/include/libraw -I/tmp/B.qjM4WT/BUILD/nomacs-3.4.1/ImageLounge/src -I/tmp/B.qjM4WT/BUILD/nomacs-3.4.1/ImageLounge/src/DkCore -I/tmp/B.qjM4WT/BUILD/nomacs-3.4.1/ImageLounge/src/DkLoader -I/tmp/B.qjM4WT/BUILD/nomacs-3.4.1/ImageLounge/src/DkGui -isystem /usr/include/qt5 -isystem /usr/include/qt5/QtWidgets -isystem /usr/include/qt5/QtGui -isystem /usr/include/qt5/QtCore -isystem /usr/lib64/qt5/./mkspecs/linux-g++ -isystem /usr/include/qt5/QtNetwork -isystem /usr/include/qt5/QtPrintSupport -isystem /usr/include/qt5/QtConcurrent -isystem /usr/include/qt5/QtSvg -isystem /usr/include/opencv  -std=c++11 -Wno-unknown-pragmas -O2 -fwrapv -pipe -Wformat -Werror=format-security -gdwarf-4 -fno-debug-types-section -fvar-tracking-assignments -g2 -Wp,-D_FORTIFY_SOURCE=2 -fstack-protector-strong --param=ssp-buffer-size=4 -fPIC -march=x86-64 -gdwarf-4 -fno-debug-types-section -fvar-tracking-assignments -g2  -DNDEBUG -DQT_NO_DEBUG -fPIC   -DDK_CORE_DLL_EXPORT -DNOMINMAX -fPIC -std=gnu++11 -o CMakeFiles/nomacsCore.dir/src/DkCore/DkUpdater.cpp.o -c /tmp/B.qjM4WT/BUILD/nomacs-3.4.1/ImageLounge/src/DkCore/DkUpdater.cpp
make[2]: Leaving directory '/tmp/B.qjM4WT/BUILD/nomacs-3.4.1/build'
make[2]: Entering directory '/tmp/B.qjM4WT/BUILD/nomacs-3.4.1/build'
[  8%] Building CXX object CMakeFiles/nomacsCore.dir/src/DkCore/DkUtils.cpp.o
/usr/bin/x86_64-pld-linux-g++  -DHAVE_EXIV2_HPP -DNOMACS_VERSION=\"3.4\" -DQT5 -DQT_CONCURRENT_LIB -DQT_CORE_LIB -DQT_GUI_LIB -DQT_NETWORK_LIB -DQT_NO_DEBUG -DQT_NO_DEBUG_OUTPUT -DQT_PRINTSUPPORT_LIB -DQT_SVG_LIB -DQT_WIDGETS_LIB -DWITH_LIBRAW -DWITH_LIBTIFF -DWITH_OPENCV -DWITH_PLUGINS -DWITH_QUAZIP -DnomacsCore_EXPORTS -I/tmp/B.qjM4WT/BUILD/nomacs-3.4.1/build -I/tmp/B.qjM4WT/BUILD/nomacs-3.4.1/ImageLounge -I/tmp/B.qjM4WT/BUILD/nomacs-3.4.1/build/nomacsCore_autogen/include -I/usr/include/libraw -I/tmp/B.qjM4WT/BUILD/nomacs-3.4.1/ImageLounge/src -I/tmp/B.qjM4WT/BUILD/nomacs-3.4.1/ImageLounge/src/DkCore -I/tmp/B.qjM4WT/BUILD/nomacs-3.4.1/ImageLounge/src/DkLoader -I/tmp/B.qjM4WT/BUILD/nomacs-3.4.1/ImageLounge/src/DkGui -isystem /usr/include/qt5 -isystem /usr/include/qt5/QtWidgets -isystem /usr/include/qt5/QtGui -isystem /usr/include/qt5/QtCore -isystem /usr/lib64/qt5/./mkspecs/linux-g++ -isystem /usr/include/qt5/QtNetwork -isystem /usr/include/qt5/QtPrintSupport -isystem /usr/include/qt5/QtConcurrent -isystem /usr/include/qt5/QtSvg -isystem /usr/include/opencv  -std=c++11 -Wno-unknown-pragmas -O2 -fwrapv -pipe -Wformat -Werror=format-security -gdwarf-4 -fno-debug-types-section -fvar-tracking-assignments -g2 -Wp,-D_FORTIFY_SOURCE=2 -fstack-protector-strong --param=ssp-buffer-size=4 -fPIC -march=x86-64 -gdwarf-4 -fno-debug-types-section -fvar-tracking-assignments -g2  -DNDEBUG -DQT_NO_DEBUG -fPIC   -DDK_CORE_DLL_EXPORT -DNOMINMAX -fPIC -std=gnu++11 -o CMakeFiles/nomacsCore.dir/src/DkCore/DkUtils.cpp.o -c /tmp/B.qjM4WT/BUILD/nomacs-3.4.1/ImageLounge/src/DkCore/DkUtils.cpp
make[2]: Leaving directory '/tmp/B.qjM4WT/BUILD/nomacs-3.4.1/build'
make[2]: Entering directory '/tmp/B.qjM4WT/BUILD/nomacs-3.4.1/build'
[  5%] Building CXX object CMakeFiles/nomacsCore.dir/src/DkCore/DkSettings.cpp.o
/usr/bin/x86_64-pld-linux-g++  -DHAVE_EXIV2_HPP -DNOMACS_VERSION=\"3.4\" -DQT5 -DQT_CONCURRENT_LIB -DQT_CORE_LIB -DQT_GUI_LIB -DQT_NETWORK_LIB -DQT_NO_DEBUG -DQT_NO_DEBUG_OUTPUT -DQT_PRINTSUPPORT_LIB -DQT_SVG_LIB -DQT_WIDGETS_LIB -DWITH_LIBRAW -DWITH_LIBTIFF -DWITH_OPENCV -DWITH_PLUGINS -DWITH_QUAZIP -DnomacsCore_EXPORTS -I/tmp/B.qjM4WT/BUILD/nomacs-3.4.1/build -I/tmp/B.qjM4WT/BUILD/nomacs-3.4.1/ImageLounge -I/tmp/B.qjM4WT/BUILD/nomacs-3.4.1/build/nomacsCore_autogen/include -I/usr/include/libraw -I/tmp/B.qjM4WT/BUILD/nomacs-3.4.1/ImageLounge/src -I/tmp/B.qjM4WT/BUILD/nomacs-3.4.1/ImageLounge/src/DkCore -I/tmp/B.qjM4WT/BUILD/nomacs-3.4.1/ImageLounge/src/DkLoader -I/tmp/B.qjM4WT/BUILD/nomacs-3.4.1/ImageLounge/src/DkGui -isystem /usr/include/qt5 -isystem /usr/include/qt5/QtWidgets -isystem /usr/include/qt5/QtGui -isystem /usr/include/qt5/QtCore -isystem /usr/lib64/qt5/./mkspecs/linux-g++ -isystem /usr/include/qt5/QtNetwork -isystem /usr/include/qt5/QtPrintSupport -isystem /usr/include/qt5/QtConcurrent -isystem /usr/include/qt5/QtSvg -isystem /usr/include/opencv  -std=c++11 -Wno-unknown-pragmas -O2 -fwrapv -pipe -Wformat -Werror=format-security -gdwarf-4 -fno-debug-types-section -fvar-tracking-assignments -g2 -Wp,-D_FORTIFY_SOURCE=2 -fstack-protector-strong --param=ssp-buffer-size=4 -fPIC -march=x86-64 -gdwarf-4 -fno-debug-types-section -fvar-tracking-assignments -g2  -DNDEBUG -DQT_NO_DEBUG -fPIC   -DDK_CORE_DLL_EXPORT -DNOMINMAX -fPIC -std=gnu++11 -o CMakeFiles/nomacsCore.dir/src/DkCore/DkSettings.cpp.o -c /tmp/B.qjM4WT/BUILD/nomacs-3.4.1/ImageLounge/src/DkCore/DkSettings.cpp
make[2]: Leaving directory '/tmp/B.qjM4WT/BUILD/nomacs-3.4.1/build'
make[2]: Entering directory '/tmp/B.qjM4WT/BUILD/nomacs-3.4.1/build'
[ 11%] Linking CXX shared library libnomacsCore.so
/usr/bin/cmake -E cmake_link_script CMakeFiles/nomacsCore.dir/link.txt --verbose=1
/usr/bin/x86_64-pld-linux-g++ -fPIC  -std=c++11 -Wno-unknown-pragmas -O2 -fwrapv -pipe -Wformat -Werror=format-security -gdwarf-4 -fno-debug-types-section -fvar-tracking-assignments -g2 -Wp,-D_FORTIFY_SOURCE=2 -fstack-protector-strong --param=ssp-buffer-size=4 -fPIC -march=x86-64 -gdwarf-4 -fno-debug-types-section -fvar-tracking-assignments -g2  -DNDEBUG -DQT_NO_DEBUG -Wl,--as-needed -Wl,--no-copy-dt-needed-entries -Wl,-z,relro -Wl,-z,combreloc -shared -Wl,-soname,libnomacsCore.so.3 -o libnomacsCore.so.3.4.0 CMakeFiles/nomacsCore.dir/src/DkCore/DkMath.cpp.o CMakeFiles/nomacsCore.dir/src/DkCore/DkSettings.cpp.o CMakeFiles/nomacsCore.dir/src/DkCore/DkTimer.cpp.o CMakeFiles/nomacsCore.dir/src/DkCore/DkUpdater.cpp.o CMakeFiles/nomacsCore.dir/src/DkCore/DkUtils.cpp.o CMakeFiles/nomacsCore.dir/qrc_nomacs.cpp.o CMakeFiles/nomacsCore.dir/nomacsCore_autogen/mocs_compilation.cpp.o  -L/tmp/B.qjM4WT/BUILD/nomacs-3.4.1/build -Wl,-rpath,/tmp/B.qjM4WT/BUILD/nomacs-3.4.1/build: /usr/lib64/libopencv_imgproc.so.3.4.1 /usr/lib64/libQt5Network.so.5.11.1 /usr/lib64/libQt5PrintSupport.so.5.11.1 /usr/lib64/libQt5Concurrent.so.5.11.1 /usr/lib64/libQt5Svg.so.5.11.1 /usr/lib64/libopencv_core.so.3.4.1 /usr/lib64/libQt5Widgets.so.5.11.1 /usr/lib64/libQt5Gui.so.5.11.1 /usr/lib64/libQt5Core.so.5.11.1 
/usr/bin/cmake -E cmake_symlink_library libnomacsCore.so.3.4.0 libnomacsCore.so.3 libnomacsCore.so
make[2]: Leaving directory '/tmp/B.qjM4WT/BUILD/nomacs-3.4.1/build'
make[1]: Entering directory '/tmp/B.qjM4WT/BUILD/nomacs-3.4.1/build'
[ 11%] Built target nomacsCore
make[1]: Leaving directory '/tmp/B.qjM4WT/BUILD/nomacs-3.4.1/build'
/usr/bin/make -f CMakeFiles/nomacsLoader_autogen.dir/build.make CMakeFiles/nomacsLoader_autogen.dir/depend
make[2]: Entering directory '/tmp/B.qjM4WT/BUILD/nomacs-3.4.1/build'
cd /tmp/B.qjM4WT/BUILD/nomacs-3.4.1/build && /usr/bin/cmake -E cmake_depends "Unix Makefiles" /tmp/B.qjM4WT/BUILD/nomacs-3.4.1/ImageLounge /tmp/B.qjM4WT/BUILD/nomacs-3.4.1/ImageLounge /tmp/B.qjM4WT/BUILD/nomacs-3.4.1/build /tmp/B.qjM4WT/BUILD/nomacs-3.4.1/build /tmp/B.qjM4WT/BUILD/nomacs-3.4.1/build/CMakeFiles/nomacsLoader_autogen.dir/DependInfo.cmake --color=
Scanning dependencies of target nomacsLoader_autogen
make[2]: Leaving directory '/tmp/B.qjM4WT/BUILD/nomacs-3.4.1/build'
/usr/bin/make -f CMakeFiles/nomacsLoader_autogen.dir/build.make CMakeFiles/nomacsLoader_autogen.dir/build
make[2]: Entering directory '/tmp/B.qjM4WT/BUILD/nomacs-3.4.1/build'
[ 13%] Automatic MOC for target nomacsLoader
/usr/bin/cmake -E cmake_autogen /tmp/B.qjM4WT/BUILD/nomacs-3.4.1/build/CMakeFiles/nomacsLoader_autogen.dir/AutogenInfo.cmake PLD
AutoMoc: /tmp/B.qjM4WT/BUILD/nomacs-3.4.1/ImageLounge/src/DkLoader/DkUpnp.h:0: Note: No relevant classes found. No output generated.
make[2]: Leaving directory '/tmp/B.qjM4WT/BUILD/nomacs-3.4.1/build'
make[1]: Entering directory '/tmp/B.qjM4WT/BUILD/nomacs-3.4.1/build'
[ 13%] Built target nomacsLoader_autogen
make[1]: Leaving directory '/tmp/B.qjM4WT/BUILD/nomacs-3.4.1/build'
/usr/bin/make -f CMakeFiles/nomacsLoader.dir/build.make CMakeFiles/nomacsLoader.dir/depend
make[2]: Entering directory '/tmp/B.qjM4WT/BUILD/nomacs-3.4.1/build'
cd /tmp/B.qjM4WT/BUILD/nomacs-3.4.1/build && /usr/bin/cmake -E cmake_depends "Unix Makefiles" /tmp/B.qjM4WT/BUILD/nomacs-3.4.1/ImageLounge /tmp/B.qjM4WT/BUILD/nomacs-3.4.1/ImageLounge /tmp/B.qjM4WT/BUILD/nomacs-3.4.1/build /tmp/B.qjM4WT/BUILD/nomacs-3.4.1/build /tmp/B.qjM4WT/BUILD/nomacs-3.4.1/build/CMakeFiles/nomacsLoader.dir/DependInfo.cmake --color=
Scanning dependencies of target nomacsLoader
make[2]: Leaving directory '/tmp/B.qjM4WT/BUILD/nomacs-3.4.1/build'
/usr/bin/make -f CMakeFiles/nomacsLoader.dir/build.make CMakeFiles/nomacsLoader.dir/build
make[2]: Entering directory '/tmp/B.qjM4WT/BUILD/nomacs-3.4.1/build'
[ 16%] Building CXX object CMakeFiles/nomacsLoader.dir/src/DkLoader/DkBatchInfo.cpp.o
/usr/bin/x86_64-pld-linux-g++  -DHAVE_EXIV2_HPP -DNOMACS_VERSION=\"3.4\" -DQT5 -DQT_CONCURRENT_LIB -DQT_CORE_LIB -DQT_GUI_LIB -DQT_NETWORK_LIB -DQT_NO_DEBUG -DQT_NO_DEBUG_OUTPUT -DQT_PRINTSUPPORT_LIB -DQT_SVG_LIB -DQT_WIDGETS_LIB -DWITH_LIBRAW -DWITH_LIBTIFF -DWITH_OPENCV -DWITH_PLUGINS -DWITH_QUAZIP -DnomacsLoader_EXPORTS -I/tmp/B.qjM4WT/BUILD/nomacs-3.4.1/build -I/tmp/B.qjM4WT/BUILD/nomacs-3.4.1/ImageLounge -I/tmp/B.qjM4WT/BUILD/nomacs-3.4.1/build/nomacsLoader_autogen/include -I/usr/include/libraw -I/tmp/B.qjM4WT/BUILD/nomacs-3.4.1/ImageLounge/src -I/tmp/B.qjM4WT/BUILD/nomacs-3.4.1/ImageLounge/src/DkCore -I/tmp/B.qjM4WT/BUILD/nomacs-3.4.1/ImageLounge/src/DkLoader -I/tmp/B.qjM4WT/BUILD/nomacs-3.4.1/ImageLounge/src/DkGui -isystem /usr/include/qt5 -isystem /usr/include/qt5/QtWidgets -isystem /usr/include/qt5/QtGui -isystem /usr/include/qt5/QtCore -isystem /usr/lib64/qt5/./mkspecs/linux-g++ -isystem /usr/include/qt5/QtNetwork -isystem /usr/include/qt5/QtPrintSupport -isystem /usr/include/qt5/QtConcurrent -isystem /usr/include/qt5/QtSvg -isystem /usr/include/opencv  -std=c++11 -Wno-unknown-pragmas -O2 -fwrapv -pipe -Wformat -Werror=format-security -gdwarf-4 -fno-debug-types-section -fvar-tracking-assignments -g2 -Wp,-D_FORTIFY_SOURCE=2 -fstack-protector-strong --param=ssp-buffer-size=4 -fPIC -march=x86-64 -gdwarf-4 -fno-debug-types-section -fvar-tracking-assignments -g2  -DNDEBUG -DQT_NO_DEBUG -fPIC   -DDK_LOADER_DLL_EXPORT -DNOMINMAX -fPIC -std=gnu++11 -o CMakeFiles/nomacsLoader.dir/src/DkLoader/DkBatchInfo.cpp.o -c /tmp/B.qjM4WT/BUILD/nomacs-3.4.1/ImageLounge/src/DkLoader/DkBatchInfo.cpp
make[2]: Leaving directory '/tmp/B.qjM4WT/BUILD/nomacs-3.4.1/build'
make[2]: Entering directory '/tmp/B.qjM4WT/BUILD/nomacs-3.4.1/build'
[ 20%] Building CXX object CMakeFiles/nomacsLoader.dir/src/DkLoader/DkDependencyResolver.cpp.o
/usr/bin/x86_64-pld-linux-g++  -DHAVE_EXIV2_HPP -DNOMACS_VERSION=\"3.4\" -DQT5 -DQT_CONCURRENT_LIB -DQT_CORE_LIB -DQT_GUI_LIB -DQT_NETWORK_LIB -DQT_NO_DEBUG -DQT_NO_DEBUG_OUTPUT -DQT_PRINTSUPPORT_LIB -DQT_SVG_LIB -DQT_WIDGETS_LIB -DWITH_LIBRAW -DWITH_LIBTIFF -DWITH_OPENCV -DWITH_PLUGINS -DWITH_QUAZIP -DnomacsLoader_EXPORTS -I/tmp/B.qjM4WT/BUILD/nomacs-3.4.1/build -I/tmp/B.qjM4WT/BUILD/nomacs-3.4.1/ImageLounge -I/tmp/B.qjM4WT/BUILD/nomacs-3.4.1/build/nomacsLoader_autogen/include -I/usr/include/libraw -I/tmp/B.qjM4WT/BUILD/nomacs-3.4.1/ImageLounge/src -I/tmp/B.qjM4WT/BUILD/nomacs-3.4.1/ImageLounge/src/DkCore -I/tmp/B.qjM4WT/BUILD/nomacs-3.4.1/ImageLounge/src/DkLoader -I/tmp/B.qjM4WT/BUILD/nomacs-3.4.1/ImageLounge/src/DkGui -isystem /usr/include/qt5 -isystem /usr/include/qt5/QtWidgets -isystem /usr/include/qt5/QtGui -isystem /usr/include/qt5/QtCore -isystem /usr/lib64/qt5/./mkspecs/linux-g++ -isystem /usr/include/qt5/QtNetwork -isystem /usr/include/qt5/QtPrintSupport -isystem /usr/include/qt5/QtConcurrent -isystem /usr/include/qt5/QtSvg -isystem /usr/include/opencv  -std=c++11 -Wno-unknown-pragmas -O2 -fwrapv -pipe -Wformat -Werror=format-security -gdwarf-4 -fno-debug-types-section -fvar-tracking-assignments -g2 -Wp,-D_FORTIFY_SOURCE=2 -fstack-protector-strong --param=ssp-buffer-size=4 -fPIC -march=x86-64 -gdwarf-4 -fno-debug-types-section -fvar-tracking-assignments -g2  -DNDEBUG -DQT_NO_DEBUG -fPIC   -DDK_LOADER_DLL_EXPORT -DNOMINMAX -fPIC -std=gnu++11 -o CMakeFiles/nomacsLoader.dir/src/DkLoader/DkDependencyResolver.cpp.o -c /tmp/B.qjM4WT/BUILD/nomacs-3.4.1/ImageLounge/src/DkLoader/DkDependencyResolver.cpp
make[2]: Leaving directory '/tmp/B.qjM4WT/BUILD/nomacs-3.4.1/build'
make[2]: Entering directory '/tmp/B.qjM4WT/BUILD/nomacs-3.4.1/build'
[ 19%] Building CXX object CMakeFiles/nomacsLoader.dir/src/DkLoader/DkBasicWidgets.cpp.o
/usr/bin/x86_64-pld-linux-g++  -DHAVE_EXIV2_HPP -DNOMACS_VERSION=\"3.4\" -DQT5 -DQT_CONCURRENT_LIB -DQT_CORE_LIB -DQT_GUI_LIB -DQT_NETWORK_LIB -DQT_NO_DEBUG -DQT_NO_DEBUG_OUTPUT -DQT_PRINTSUPPORT_LIB -DQT_SVG_LIB -DQT_WIDGETS_LIB -DWITH_LIBRAW -DWITH_LIBTIFF -DWITH_OPENCV -DWITH_PLUGINS -DWITH_QUAZIP -DnomacsLoader_EXPORTS -I/tmp/B.qjM4WT/BUILD/nomacs-3.4.1/build -I/tmp/B.qjM4WT/BUILD/nomacs-3.4.1/ImageLounge -I/tmp/B.qjM4WT/BUILD/nomacs-3.4.1/build/nomacsLoader_autogen/include -I/usr/include/libraw -I/tmp/B.qjM4WT/BUILD/nomacs-3.4.1/ImageLounge/src -I/tmp/B.qjM4WT/BUILD/nomacs-3.4.1/ImageLounge/src/DkCore -I/tmp/B.qjM4WT/BUILD/nomacs-3.4.1/ImageLounge/src/DkLoader -I/tmp/B.qjM4WT/BUILD/nomacs-3.4.1/ImageLounge/src/DkGui -isystem /usr/include/qt5 -isystem /usr/include/qt5/QtWidgets -isystem /usr/include/qt5/QtGui -isystem /usr/include/qt5/QtCore -isystem /usr/lib64/qt5/./mkspecs/linux-g++ -isystem /usr/include/qt5/QtNetwork -isystem /usr/include/qt5/QtPrintSupport -isystem /usr/include/qt5/QtConcurrent -isystem /usr/include/qt5/QtSvg -isystem /usr/include/opencv  -std=c++11 -Wno-unknown-pragmas -O2 -fwrapv -pipe -Wformat -Werror=format-security -gdwarf-4 -fno-debug-types-section -fvar-tracking-assignments -g2 -Wp,-D_FORTIFY_SOURCE=2 -fstack-protector-strong --param=ssp-buffer-size=4 -fPIC -march=x86-64 -gdwarf-4 -fno-debug-types-section -fvar-tracking-assignments -g2  -DNDEBUG -DQT_NO_DEBUG -fPIC   -DDK_LOADER_DLL_EXPORT -DNOMINMAX -fPIC -std=gnu++11 -o CMakeFiles/nomacsLoader.dir/src/DkLoader/DkBasicWidgets.cpp.o -c /tmp/B.qjM4WT/BUILD/nomacs-3.4.1/ImageLounge/src/DkLoader/DkBasicWidgets.cpp
make[2]: Leaving directory '/tmp/B.qjM4WT/BUILD/nomacs-3.4.1/build'
make[2]: Entering directory '/tmp/B.qjM4WT/BUILD/nomacs-3.4.1/build'
[ 14%] Building CXX object CMakeFiles/nomacsLoader.dir/src/DkLoader/DkBaseViewPort.cpp.o
/usr/bin/x86_64-pld-linux-g++  -DHAVE_EXIV2_HPP -DNOMACS_VERSION=\"3.4\" -DQT5 -DQT_CONCURRENT_LIB -DQT_CORE_LIB -DQT_GUI_LIB -DQT_NETWORK_LIB -DQT_NO_DEBUG -DQT_NO_DEBUG_OUTPUT -DQT_PRINTSUPPORT_LIB -DQT_SVG_LIB -DQT_WIDGETS_LIB -DWITH_LIBRAW -DWITH_LIBTIFF -DWITH_OPENCV -DWITH_PLUGINS -DWITH_QUAZIP -DnomacsLoader_EXPORTS -I/tmp/B.qjM4WT/BUILD/nomacs-3.4.1/build -I/tmp/B.qjM4WT/BUILD/nomacs-3.4.1/ImageLounge -I/tmp/B.qjM4WT/BUILD/nomacs-3.4.1/build/nomacsLoader_autogen/include -I/usr/include/libraw -I/tmp/B.qjM4WT/BUILD/nomacs-3.4.1/ImageLounge/src -I/tmp/B.qjM4WT/BUILD/nomacs-3.4.1/ImageLounge/src/DkCore -I/tmp/B.qjM4WT/BUILD/nomacs-3.4.1/ImageLounge/src/DkLoader -I/tmp/B.qjM4WT/BUILD/nomacs-3.4.1/ImageLounge/src/DkGui -isystem /usr/include/qt5 -isystem /usr/include/qt5/QtWidgets -isystem /usr/include/qt5/QtGui -isystem /usr/include/qt5/QtCore -isystem /usr/lib64/qt5/./mkspecs/linux-g++ -isystem /usr/include/qt5/QtNetwork -isystem /usr/include/qt5/QtPrintSupport -isystem /usr/include/qt5/QtConcurrent -isystem /usr/include/qt5/QtSvg -isystem /usr/include/opencv  -std=c++11 -Wno-unknown-pragmas -O2 -fwrapv -pipe -Wformat -Werror=format-security -gdwarf-4 -fno-debug-types-section -fvar-tracking-assignments -g2 -Wp,-D_FORTIFY_SOURCE=2 -fstack-protector-strong --param=ssp-buffer-size=4 -fPIC -march=x86-64 -gdwarf-4 -fno-debug-types-section -fvar-tracking-assignments -g2  -DNDEBUG -DQT_NO_DEBUG -fPIC   -DDK_LOADER_DLL_EXPORT -DNOMINMAX -fPIC -std=gnu++11 -o CMakeFiles/nomacsLoader.dir/src/DkLoader/DkBaseViewPort.cpp.o -c /tmp/B.qjM4WT/BUILD/nomacs-3.4.1/ImageLounge/src/DkLoader/DkBaseViewPort.cpp
make[2]: Leaving directory '/tmp/B.qjM4WT/BUILD/nomacs-3.4.1/build'
make[2]: Entering directory '/tmp/B.qjM4WT/BUILD/nomacs-3.4.1/build'
[ 25%] Building CXX object CMakeFiles/nomacsLoader.dir/src/DkLoader/DkMessageBox.cpp.o
/usr/bin/x86_64-pld-linux-g++  -DHAVE_EXIV2_HPP -DNOMACS_VERSION=\"3.4\" -DQT5 -DQT_CONCURRENT_LIB -DQT_CORE_LIB -DQT_GUI_LIB -DQT_NETWORK_LIB -DQT_NO_DEBUG -DQT_NO_DEBUG_OUTPUT -DQT_PRINTSUPPORT_LIB -DQT_SVG_LIB -DQT_WIDGETS_LIB -DWITH_LIBRAW -DWITH_LIBTIFF -DWITH_OPENCV -DWITH_PLUGINS -DWITH_QUAZIP -DnomacsLoader_EXPORTS -I/tmp/B.qjM4WT/BUILD/nomacs-3.4.1/build -I/tmp/B.qjM4WT/BUILD/nomacs-3.4.1/ImageLounge -I/tmp/B.qjM4WT/BUILD/nomacs-3.4.1/build/nomacsLoader_autogen/include -I/usr/include/libraw -I/tmp/B.qjM4WT/BUILD/nomacs-3.4.1/ImageLounge/src -I/tmp/B.qjM4WT/BUILD/nomacs-3.4.1/ImageLounge/src/DkCore -I/tmp/B.qjM4WT/BUILD/nomacs-3.4.1/ImageLounge/src/DkLoader -I/tmp/B.qjM4WT/BUILD/nomacs-3.4.1/ImageLounge/src/DkGui -isystem /usr/include/qt5 -isystem /usr/include/qt5/QtWidgets -isystem /usr/include/qt5/QtGui -isystem /usr/include/qt5/QtCore -isystem /usr/lib64/qt5/./mkspecs/linux-g++ -isystem /usr/include/qt5/QtNetwork -isystem /usr/include/qt5/QtPrintSupport -isystem /usr/include/qt5/QtConcurrent -isystem /usr/include/qt5/QtSvg -isystem /usr/include/opencv  -std=c++11 -Wno-unknown-pragmas -O2 -fwrapv -pipe -Wformat -Werror=format-security -gdwarf-4 -fno-debug-types-section -fvar-tracking-assignments -g2 -Wp,-D_FORTIFY_SOURCE=2 -fstack-protector-strong --param=ssp-buffer-size=4 -fPIC -march=x86-64 -gdwarf-4 -fno-debug-types-section -fvar-tracking-assignments -g2  -DNDEBUG -DQT_NO_DEBUG -fPIC   -DDK_LOADER_DLL_EXPORT -DNOMINMAX -fPIC -std=gnu++11 -o CMakeFiles/nomacsLoader.dir/src/DkLoader/DkMessageBox.cpp.o -c /tmp/B.qjM4WT/BUILD/nomacs-3.4.1/ImageLounge/src/DkLoader/DkMessageBox.cpp
make[2]: Leaving directory '/tmp/B.qjM4WT/BUILD/nomacs-3.4.1/build'
make[2]: Entering directory '/tmp/B.qjM4WT/BUILD/nomacs-3.4.1/build'
[ 23%] Building CXX object CMakeFiles/nomacsLoader.dir/src/DkLoader/DkImageStorage.cpp.o
/usr/bin/x86_64-pld-linux-g++  -DHAVE_EXIV2_HPP -DNOMACS_VERSION=\"3.4\" -DQT5 -DQT_CONCURRENT_LIB -DQT_CORE_LIB -DQT_GUI_LIB -DQT_NETWORK_LIB -DQT_NO_DEBUG -DQT_NO_DEBUG_OUTPUT -DQT_PRINTSUPPORT_LIB -DQT_SVG_LIB -DQT_WIDGETS_LIB -DWITH_LIBRAW -DWITH_LIBTIFF -DWITH_OPENCV -DWITH_PLUGINS -DWITH_QUAZIP -DnomacsLoader_EXPORTS -I/tmp/B.qjM4WT/BUILD/nomacs-3.4.1/build -I/tmp/B.qjM4WT/BUILD/nomacs-3.4.1/ImageLounge -I/tmp/B.qjM4WT/BUILD/nomacs-3.4.1/build/nomacsLoader_autogen/include -I/usr/include/libraw -I/tmp/B.qjM4WT/BUILD/nomacs-3.4.1/ImageLounge/src -I/tmp/B.qjM4WT/BUILD/nomacs-3.4.1/ImageLounge/src/DkCore -I/tmp/B.qjM4WT/BUILD/nomacs-3.4.1/ImageLounge/src/DkLoader -I/tmp/B.qjM4WT/BUILD/nomacs-3.4.1/ImageLounge/src/DkGui -isystem /usr/include/qt5 -isystem /usr/include/qt5/QtWidgets -isystem /usr/include/qt5/QtGui -isystem /usr/include/qt5/QtCore -isystem /usr/lib64/qt5/./mkspecs/linux-g++ -isystem /usr/include/qt5/QtNetwork -isystem /usr/include/qt5/QtPrintSupport -isystem /usr/include/qt5/QtConcurrent -isystem /usr/include/qt5/QtSvg -isystem /usr/include/opencv  -std=c++11 -Wno-unknown-pragmas -O2 -fwrapv -pipe -Wformat -Werror=format-security -gdwarf-4 -fno-debug-types-section -fvar-tracking-assignments -g2 -Wp,-D_FORTIFY_SOURCE=2 -fstack-protector-strong --param=ssp-buffer-size=4 -fPIC -march=x86-64 -gdwarf-4 -fno-debug-types-section -fvar-tracking-assignments -g2  -DNDEBUG -DQT_NO_DEBUG -fPIC   -DDK_LOADER_DLL_EXPORT -DNOMINMAX -fPIC -std=gnu++11 -o CMakeFiles/nomacsLoader.dir/src/DkLoader/DkImageStorage.cpp.o -c /tmp/B.qjM4WT/BUILD/nomacs-3.4.1/ImageLounge/src/DkLoader/DkImageStorage.cpp
make[2]: Leaving directory '/tmp/B.qjM4WT/BUILD/nomacs-3.4.1/build'
make[2]: Entering directory '/tmp/B.qjM4WT/BUILD/nomacs-3.4.1/build'
[ 26%] Building CXX object CMakeFiles/nomacsLoader.dir/src/DkLoader/DkMetaData.cpp.o
/usr/bin/x86_64-pld-linux-g++  -DHAVE_EXIV2_HPP -DNOMACS_VERSION=\"3.4\" -DQT5 -DQT_CONCURRENT_LIB -DQT_CORE_LIB -DQT_GUI_LIB -DQT_NETWORK_LIB -DQT_NO_DEBUG -DQT_NO_DEBUG_OUTPUT -DQT_PRINTSUPPORT_LIB -DQT_SVG_LIB -DQT_WIDGETS_LIB -DWITH_LIBRAW -DWITH_LIBTIFF -DWITH_OPENCV -DWITH_PLUGINS -DWITH_QUAZIP -DnomacsLoader_EXPORTS -I/tmp/B.qjM4WT/BUILD/nomacs-3.4.1/build -I/tmp/B.qjM4WT/BUILD/nomacs-3.4.1/ImageLounge -I/tmp/B.qjM4WT/BUILD/nomacs-3.4.1/build/nomacsLoader_autogen/include -I/usr/include/libraw -I/tmp/B.qjM4WT/BUILD/nomacs-3.4.1/ImageLounge/src -I/tmp/B.qjM4WT/BUILD/nomacs-3.4.1/ImageLounge/src/DkCore -I/tmp/B.qjM4WT/BUILD/nomacs-3.4.1/ImageLounge/src/DkLoader -I/tmp/B.qjM4WT/BUILD/nomacs-3.4.1/ImageLounge/src/DkGui -isystem /usr/include/qt5 -isystem /usr/include/qt5/QtWidgets -isystem /usr/include/qt5/QtGui -isystem /usr/include/qt5/QtCore -isystem /usr/lib64/qt5/./mkspecs/linux-g++ -isystem /usr/include/qt5/QtNetwork -isystem /usr/include/qt5/QtPrintSupport -isystem /usr/include/qt5/QtConcurrent -isystem /usr/include/qt5/QtSvg -isystem /usr/include/opencv  -std=c++11 -Wno-unknown-pragmas -O2 -fwrapv -pipe -Wformat -Werror=format-security -gdwarf-4 -fno-debug-types-section -fvar-tracking-assignments -g2 -Wp,-D_FORTIFY_SOURCE=2 -fstack-protector-strong --param=ssp-buffer-size=4 -fPIC -march=x86-64 -gdwarf-4 -fno-debug-types-section -fvar-tracking-assignments -g2  -DNDEBUG -DQT_NO_DEBUG -fPIC   -DDK_LOADER_DLL_EXPORT -DNOMINMAX -fPIC -std=gnu++11 -o CMakeFiles/nomacsLoader.dir/src/DkLoader/DkMetaData.cpp.o -c /tmp/B.qjM4WT/BUILD/nomacs-3.4.1/ImageLounge/src/DkLoader/DkMetaData.cpp
/tmp/B.qjM4WT/BUILD/nomacs-3.4.1/ImageLounge/src/DkLoader/DkMetaData.cpp: In member function 'void nmc::DkMetaDataT::printMetaData() const':
/tmp/B.qjM4WT/BUILD/nomacs-3.4.1/ImageLounge/src/DkLoader/DkMetaData.cpp:1267:55: error: no matching function for call to 'Exiv2::BasicError<char>::BasicError(int, const char [29])'
   throw Exiv2::Error(1, "Failed to serialize XMP data");
                                                       ^
In file included from /usr/include/exiv2/iptc.hpp:34,
                 from /usr/include/exiv2/bmpimage.hpp:33,
                 from /usr/include/exiv2/exiv2.hpp:35,
                 from /tmp/B.qjM4WT/BUILD/nomacs-3.4.1/ImageLounge/src/DkLoader/DkMetaData.h:39,
                 from /tmp/B.qjM4WT/BUILD/nomacs-3.4.1/ImageLounge/src/DkLoader/DkMetaData.cpp:28:
/usr/include/exiv2/error.hpp:280:9: note: candidate: 'template<class A, class B, class C> Exiv2::BasicError<charT>::BasicError(Exiv2::ErrorCode, const A&, const B&, const C&)'
         BasicError(ErrorCode code, const A& arg1, const B& arg2, const C& arg3);
         ^~~~~~~~~~
/usr/include/exiv2/error.hpp:280:9: note:   template argument deduction/substitution failed:
/tmp/B.qjM4WT/BUILD/nomacs-3.4.1/ImageLounge/src/DkLoader/DkMetaData.cpp:1267:55: note:   candidate expects 4 arguments, 2 provided
   throw Exiv2::Error(1, "Failed to serialize XMP data");
                                                       ^
In file included from /usr/include/exiv2/iptc.hpp:34,
                 from /usr/include/exiv2/bmpimage.hpp:33,
                 from /usr/include/exiv2/exiv2.hpp:35,
                 from /tmp/B.qjM4WT/BUILD/nomacs-3.4.1/ImageLounge/src/DkLoader/DkMetaData.h:39,
                 from /tmp/B.qjM4WT/BUILD/nomacs-3.4.1/ImageLounge/src/DkLoader/DkMetaData.cpp:28:
/usr/include/exiv2/error.hpp:276:9: note: candidate: 'template<class A, class B> Exiv2::BasicError<charT>::BasicError(Exiv2::ErrorCode, const A&, const B&)'
         BasicError(ErrorCode code, const A& arg1, const B& arg2);
         ^~~~~~~~~~
/usr/include/exiv2/error.hpp:276:9: note:   template argument deduction/substitution failed:
/tmp/B.qjM4WT/BUILD/nomacs-3.4.1/ImageLounge/src/DkLoader/DkMetaData.cpp:1267:55: note:   candidate expects 3 arguments, 2 provided
   throw Exiv2::Error(1, "Failed to serialize XMP data");
                                                       ^
In file included from /usr/include/exiv2/iptc.hpp:34,
                 from /usr/include/exiv2/bmpimage.hpp:33,
                 from /usr/include/exiv2/exiv2.hpp:35,
                 from /tmp/B.qjM4WT/BUILD/nomacs-3.4.1/ImageLounge/src/DkLoader/DkMetaData.h:39,
                 from /tmp/B.qjM4WT/BUILD/nomacs-3.4.1/ImageLounge/src/DkLoader/DkMetaData.cpp:28:
/usr/include/exiv2/error.hpp:272:9: note: candidate: 'template<class A> Exiv2::BasicError<charT>::BasicError(Exiv2::ErrorCode, const A&)'
         BasicError(ErrorCode code, const A& arg1);
         ^~~~~~~~~~
/usr/include/exiv2/error.hpp:272:9: note:   template argument deduction/substitution failed:
/tmp/B.qjM4WT/BUILD/nomacs-3.4.1/ImageLounge/src/DkLoader/DkMetaData.cpp:1267:55: note:   cannot convert '1' (type 'int') to type 'Exiv2::ErrorCode'
   throw Exiv2::Error(1, "Failed to serialize XMP data");
                                                       ^
In file included from /usr/include/exiv2/iptc.hpp:34,
                 from /usr/include/exiv2/bmpimage.hpp:33,
                 from /usr/include/exiv2/exiv2.hpp:35,
                 from /tmp/B.qjM4WT/BUILD/nomacs-3.4.1/ImageLounge/src/DkLoader/DkMetaData.h:39,
                 from /tmp/B.qjM4WT/BUILD/nomacs-3.4.1/ImageLounge/src/DkLoader/DkMetaData.cpp:28:
/usr/include/exiv2/error.hpp:336:5: note: candidate: 'Exiv2::BasicError<charT>::BasicError(Exiv2::ErrorCode) [with charT = char]'
     BasicError<charT>::BasicError(ErrorCode code)
     ^~~~~~~~~~~~~~~~~
/usr/include/exiv2/error.hpp:336:5: note:   candidate expects 1 argument, 2 provided
/usr/include/exiv2/error.hpp:263:11: note: candidate: 'Exiv2::BasicError<char>::BasicError(const Exiv2::BasicError<char>&)'
     class BasicError : public AnyError {
           ^~~~~~~~~~
/usr/include/exiv2/error.hpp:263:11: note:   candidate expects 1 argument, 2 provided
make[2]: *** [CMakeFiles/nomacsLoader.dir/build.make:284: CMakeFiles/nomacsLoader.dir/src/DkLoader/DkMetaData.cpp.o] Error 1
make[2]: Leaving directory '/tmp/B.qjM4WT/BUILD/nomacs-3.4.1/build'
make[2]: *** Waiting for unfinished jobs....
make[2]: Entering directory '/tmp/B.qjM4WT/BUILD/nomacs-3.4.1/build'
[ 21%] Building CXX object CMakeFiles/nomacsLoader.dir/src/DkLoader/DkImageContainer.cpp.o
/usr/bin/x86_64-pld-linux-g++  -DHAVE_EXIV2_HPP -DNOMACS_VERSION=\"3.4\" -DQT5 -DQT_CONCURRENT_LIB -DQT_CORE_LIB -DQT_GUI_LIB -DQT_NETWORK_LIB -DQT_NO_DEBUG -DQT_NO_DEBUG_OUTPUT -DQT_PRINTSUPPORT_LIB -DQT_SVG_LIB -DQT_WIDGETS_LIB -DWITH_LIBRAW -DWITH_LIBTIFF -DWITH_OPENCV -DWITH_PLUGINS -DWITH_QUAZIP -DnomacsLoader_EXPORTS -I/tmp/B.qjM4WT/BUILD/nomacs-3.4.1/build -I/tmp/B.qjM4WT/BUILD/nomacs-3.4.1/ImageLounge -I/tmp/B.qjM4WT/BUILD/nomacs-3.4.1/build/nomacsLoader_autogen/include -I/usr/include/libraw -I/tmp/B.qjM4WT/BUILD/nomacs-3.4.1/ImageLounge/src -I/tmp/B.qjM4WT/BUILD/nomacs-3.4.1/ImageLounge/src/DkCore -I/tmp/B.qjM4WT/BUILD/nomacs-3.4.1/ImageLounge/src/DkLoader -I/tmp/B.qjM4WT/BUILD/nomacs-3.4.1/ImageLounge/src/DkGui -isystem /usr/include/qt5 -isystem /usr/include/qt5/QtWidgets -isystem /usr/include/qt5/QtGui -isystem /usr/include/qt5/QtCore -isystem /usr/lib64/qt5/./mkspecs/linux-g++ -isystem /usr/include/qt5/QtNetwork -isystem /usr/include/qt5/QtPrintSupport -isystem /usr/include/qt5/QtConcurrent -isystem /usr/include/qt5/QtSvg -isystem /usr/include/opencv  -std=c++11 -Wno-unknown-pragmas -O2 -fwrapv -pipe -Wformat -Werror=format-security -gdwarf-4 -fno-debug-types-section -fvar-tracking-assignments -g2 -Wp,-D_FORTIFY_SOURCE=2 -fstack-protector-strong --param=ssp-buffer-size=4 -fPIC -march=x86-64 -gdwarf-4 -fno-debug-types-section -fvar-tracking-assignments -g2  -DNDEBUG -DQT_NO_DEBUG -fPIC   -DDK_LOADER_DLL_EXPORT -DNOMINMAX -fPIC -std=gnu++11 -o CMakeFiles/nomacsLoader.dir/src/DkLoader/DkImageContainer.cpp.o -c /tmp/B.qjM4WT/BUILD/nomacs-3.4.1/ImageLounge/src/DkLoader/DkImageContainer.cpp
make[2]: Leaving directory '/tmp/B.qjM4WT/BUILD/nomacs-3.4.1/build'
make[2]: Entering directory '/tmp/B.qjM4WT/BUILD/nomacs-3.4.1/build'
[ 19%] Building CXX object CMakeFiles/nomacsLoader.dir/src/DkLoader/DkBasicLoader.cpp.o
/usr/bin/x86_64-pld-linux-g++  -DHAVE_EXIV2_HPP -DNOMACS_VERSION=\"3.4\" -DQT5 -DQT_CONCURRENT_LIB -DQT_CORE_LIB -DQT_GUI_LIB -DQT_NETWORK_LIB -DQT_NO_DEBUG -DQT_NO_DEBUG_OUTPUT -DQT_PRINTSUPPORT_LIB -DQT_SVG_LIB -DQT_WIDGETS_LIB -DWITH_LIBRAW -DWITH_LIBTIFF -DWITH_OPENCV -DWITH_PLUGINS -DWITH_QUAZIP -DnomacsLoader_EXPORTS -I/tmp/B.qjM4WT/BUILD/nomacs-3.4.1/build -I/tmp/B.qjM4WT/BUILD/nomacs-3.4.1/ImageLounge -I/tmp/B.qjM4WT/BUILD/nomacs-3.4.1/build/nomacsLoader_autogen/include -I/usr/include/libraw -I/tmp/B.qjM4WT/BUILD/nomacs-3.4.1/ImageLounge/src -I/tmp/B.qjM4WT/BUILD/nomacs-3.4.1/ImageLounge/src/DkCore -I/tmp/B.qjM4WT/BUILD/nomacs-3.4.1/ImageLounge/src/DkLoader -I/tmp/B.qjM4WT/BUILD/nomacs-3.4.1/ImageLounge/src/DkGui -isystem /usr/include/qt5 -isystem /usr/include/qt5/QtWidgets -isystem /usr/include/qt5/QtGui -isystem /usr/include/qt5/QtCore -isystem /usr/lib64/qt5/./mkspecs/linux-g++ -isystem /usr/include/qt5/QtNetwork -isystem /usr/include/qt5/QtPrintSupport -isystem /usr/include/qt5/QtConcurrent -isystem /usr/include/qt5/QtSvg -isystem /usr/include/opencv  -std=c++11 -Wno-unknown-pragmas -O2 -fwrapv -pipe -Wformat -Werror=format-security -gdwarf-4 -fno-debug-types-section -fvar-tracking-assignments -g2 -Wp,-D_FORTIFY_SOURCE=2 -fstack-protector-strong --param=ssp-buffer-size=4 -fPIC -march=x86-64 -gdwarf-4 -fno-debug-types-section -fvar-tracking-assignments -g2  -DNDEBUG -DQT_NO_DEBUG -fPIC   -DDK_LOADER_DLL_EXPORT -DNOMINMAX -fPIC -std=gnu++11 -o CMakeFiles/nomacsLoader.dir/src/DkLoader/DkBasicLoader.cpp.o -c /tmp/B.qjM4WT/BUILD/nomacs-3.4.1/ImageLounge/src/DkLoader/DkBasicLoader.cpp
make[2]: Leaving directory '/tmp/B.qjM4WT/BUILD/nomacs-3.4.1/build'
make[2]: Entering directory '/tmp/B.qjM4WT/BUILD/nomacs-3.4.1/build'
[ 30%] Building CXX object CMakeFiles/nomacsLoader.dir/src/DkLoader/DkStatusBar.cpp.o
/usr/bin/x86_64-pld-linux-g++  -DHAVE_EXIV2_HPP -DNOMACS_VERSION=\"3.4\" -DQT5 -DQT_CONCURRENT_LIB -DQT_CORE_LIB -DQT_GUI_LIB -DQT_NETWORK_LIB -DQT_NO_DEBUG -DQT_NO_DEBUG_OUTPUT -DQT_PRINTSUPPORT_LIB -DQT_SVG_LIB -DQT_WIDGETS_LIB -DWITH_LIBRAW -DWITH_LIBTIFF -DWITH_OPENCV -DWITH_PLUGINS -DWITH_QUAZIP -DnomacsLoader_EXPORTS -I/tmp/B.qjM4WT/BUILD/nomacs-3.4.1/build -I/tmp/B.qjM4WT/BUILD/nomacs-3.4.1/ImageLounge -I/tmp/B.qjM4WT/BUILD/nomacs-3.4.1/build/nomacsLoader_autogen/include -I/usr/include/libraw -I/tmp/B.qjM4WT/BUILD/nomacs-3.4.1/ImageLounge/src -I/tmp/B.qjM4WT/BUILD/nomacs-3.4.1/ImageLounge/src/DkCore -I/tmp/B.qjM4WT/BUILD/nomacs-3.4.1/ImageLounge/src/DkLoader -I/tmp/B.qjM4WT/BUILD/nomacs-3.4.1/ImageLounge/src/DkGui -isystem /usr/include/qt5 -isystem /usr/include/qt5/QtWidgets -isystem /usr/include/qt5/QtGui -isystem /usr/include/qt5/QtCore -isystem /usr/lib64/qt5/./mkspecs/linux-g++ -isystem /usr/include/qt5/QtNetwork -isystem /usr/include/qt5/QtPrintSupport -isystem /usr/include/qt5/QtConcurrent -isystem /usr/include/qt5/QtSvg -isystem /usr/include/opencv  -std=c++11 -Wno-unknown-pragmas -O2 -fwrapv -pipe -Wformat -Werror=format-security -gdwarf-4 -fno-debug-types-section -fvar-tracking-assignments -g2 -Wp,-D_FORTIFY_SOURCE=2 -fstack-protector-strong --param=ssp-buffer-size=4 -fPIC -march=x86-64 -gdwarf-4 -fno-debug-types-section -fvar-tracking-assignments -g2  -DNDEBUG -DQT_NO_DEBUG -fPIC   -DDK_LOADER_DLL_EXPORT -DNOMINMAX -fPIC -std=gnu++11 -o CMakeFiles/nomacsLoader.dir/src/DkLoader/DkStatusBar.cpp.o -c /tmp/B.qjM4WT/BUILD/nomacs-3.4.1/ImageLounge/src/DkLoader/DkStatusBar.cpp
make[2]: Leaving directory '/tmp/B.qjM4WT/BUILD/nomacs-3.4.1/build'
make[2]: Entering directory '/tmp/B.qjM4WT/BUILD/nomacs-3.4.1/build'
[ 22%] Building CXX object CMakeFiles/nomacsLoader.dir/src/DkLoader/DkImageLoader.cpp.o
/usr/bin/x86_64-pld-linux-g++  -DHAVE_EXIV2_HPP -DNOMACS_VERSION=\"3.4\" -DQT5 -DQT_CONCURRENT_LIB -DQT_CORE_LIB -DQT_GUI_LIB -DQT_NETWORK_LIB -DQT_NO_DEBUG -DQT_NO_DEBUG_OUTPUT -DQT_PRINTSUPPORT_LIB -DQT_SVG_LIB -DQT_WIDGETS_LIB -DWITH_LIBRAW -DWITH_LIBTIFF -DWITH_OPENCV -DWITH_PLUGINS -DWITH_QUAZIP -DnomacsLoader_EXPORTS -I/tmp/B.qjM4WT/BUILD/nomacs-3.4.1/build -I/tmp/B.qjM4WT/BUILD/nomacs-3.4.1/ImageLounge -I/tmp/B.qjM4WT/BUILD/nomacs-3.4.1/build/nomacsLoader_autogen/include -I/usr/include/libraw -I/tmp/B.qjM4WT/BUILD/nomacs-3.4.1/ImageLounge/src -I/tmp/B.qjM4WT/BUILD/nomacs-3.4.1/ImageLounge/src/DkCore -I/tmp/B.qjM4WT/BUILD/nomacs-3.4.1/ImageLounge/src/DkLoader -I/tmp/B.qjM4WT/BUILD/nomacs-3.4.1/ImageLounge/src/DkGui -isystem /usr/include/qt5 -isystem /usr/include/qt5/QtWidgets -isystem /usr/include/qt5/QtGui -isystem /usr/include/qt5/QtCore -isystem /usr/lib64/qt5/./mkspecs/linux-g++ -isystem /usr/include/qt5/QtNetwork -isystem /usr/include/qt5/QtPrintSupport -isystem /usr/include/qt5/QtConcurrent -isystem /usr/include/qt5/QtSvg -isystem /usr/include/opencv  -std=c++11 -Wno-unknown-pragmas -O2 -fwrapv -pipe -Wformat -Werror=format-security -gdwarf-4 -fno-debug-types-section -fvar-tracking-assignments -g2 -Wp,-D_FORTIFY_SOURCE=2 -fstack-protector-strong --param=ssp-buffer-size=4 -fPIC -march=x86-64 -gdwarf-4 -fno-debug-types-section -fvar-tracking-assignments -g2  -DNDEBUG -DQT_NO_DEBUG -fPIC   -DDK_LOADER_DLL_EXPORT -DNOMINMAX -fPIC -std=gnu++11 -o CMakeFiles/nomacsLoader.dir/src/DkLoader/DkImageLoader.cpp.o -c /tmp/B.qjM4WT/BUILD/nomacs-3.4.1/ImageLounge/src/DkLoader/DkImageLoader.cpp
make[2]: Leaving directory '/tmp/B.qjM4WT/BUILD/nomacs-3.4.1/build'
make[2]: Entering directory '/tmp/B.qjM4WT/BUILD/nomacs-3.4.1/build'
[ 29%] Building CXX object CMakeFiles/nomacsLoader.dir/src/DkLoader/DkSaveDialog.cpp.o
/usr/bin/x86_64-pld-linux-g++  -DHAVE_EXIV2_HPP -DNOMACS_VERSION=\"3.4\" -DQT5 -DQT_CONCURRENT_LIB -DQT_CORE_LIB -DQT_GUI_LIB -DQT_NETWORK_LIB -DQT_NO_DEBUG -DQT_NO_DEBUG_OUTPUT -DQT_PRINTSUPPORT_LIB -DQT_SVG_LIB -DQT_WIDGETS_LIB -DWITH_LIBRAW -DWITH_LIBTIFF -DWITH_OPENCV -DWITH_PLUGINS -DWITH_QUAZIP -DnomacsLoader_EXPORTS -I/tmp/B.qjM4WT/BUILD/nomacs-3.4.1/build -I/tmp/B.qjM4WT/BUILD/nomacs-3.4.1/ImageLounge -I/tmp/B.qjM4WT/BUILD/nomacs-3.4.1/build/nomacsLoader_autogen/include -I/usr/include/libraw -I/tmp/B.qjM4WT/BUILD/nomacs-3.4.1/ImageLounge/src -I/tmp/B.qjM4WT/BUILD/nomacs-3.4.1/ImageLounge/src/DkCore -I/tmp/B.qjM4WT/BUILD/nomacs-3.4.1/ImageLounge/src/DkLoader -I/tmp/B.qjM4WT/BUILD/nomacs-3.4.1/ImageLounge/src/DkGui -isystem /usr/include/qt5 -isystem /usr/include/qt5/QtWidgets -isystem /usr/include/qt5/QtGui -isystem /usr/include/qt5/QtCore -isystem /usr/lib64/qt5/./mkspecs/linux-g++ -isystem /usr/include/qt5/QtNetwork -isystem /usr/include/qt5/QtPrintSupport -isystem /usr/include/qt5/QtConcurrent -isystem /usr/include/qt5/QtSvg -isystem /usr/include/opencv  -std=c++11 -Wno-unknown-pragmas -O2 -fwrapv -pipe -Wformat -Werror=format-security -gdwarf-4 -fno-debug-types-section -fvar-tracking-assignments -g2 -Wp,-D_FORTIFY_SOURCE=2 -fstack-protector-strong --param=ssp-buffer-size=4 -fPIC -march=x86-64 -gdwarf-4 -fno-debug-types-section -fvar-tracking-assignments -g2  -DNDEBUG -DQT_NO_DEBUG -fPIC   -DDK_LOADER_DLL_EXPORT -DNOMINMAX -fPIC -std=gnu++11 -o CMakeFiles/nomacsLoader.dir/src/DkLoader/DkSaveDialog.cpp.o -c /tmp/B.qjM4WT/BUILD/nomacs-3.4.1/ImageLounge/src/DkLoader/DkSaveDialog.cpp
make[2]: Leaving directory '/tmp/B.qjM4WT/BUILD/nomacs-3.4.1/build'
make[2]: Entering directory '/tmp/B.qjM4WT/BUILD/nomacs-3.4.1/build'
[ 28%] Building CXX object CMakeFiles/nomacsLoader.dir/src/DkLoader/DkProcess.cpp.o
/usr/bin/x86_64-pld-linux-g++  -DHAVE_EXIV2_HPP -DNOMACS_VERSION=\"3.4\" -DQT5 -DQT_CONCURRENT_LIB -DQT_CORE_LIB -DQT_GUI_LIB -DQT_NETWORK_LIB -DQT_NO_DEBUG -DQT_NO_DEBUG_OUTPUT -DQT_PRINTSUPPORT_LIB -DQT_SVG_LIB -DQT_WIDGETS_LIB -DWITH_LIBRAW -DWITH_LIBTIFF -DWITH_OPENCV -DWITH_PLUGINS -DWITH_QUAZIP -DnomacsLoader_EXPORTS -I/tmp/B.qjM4WT/BUILD/nomacs-3.4.1/build -I/tmp/B.qjM4WT/BUILD/nomacs-3.4.1/ImageLounge -I/tmp/B.qjM4WT/BUILD/nomacs-3.4.1/build/nomacsLoader_autogen/include -I/usr/include/libraw -I/tmp/B.qjM4WT/BUILD/nomacs-3.4.1/ImageLounge/src -I/tmp/B.qjM4WT/BUILD/nomacs-3.4.1/ImageLounge/src/DkCore -I/tmp/B.qjM4WT/BUILD/nomacs-3.4.1/ImageLounge/src/DkLoader -I/tmp/B.qjM4WT/BUILD/nomacs-3.4.1/ImageLounge/src/DkGui -isystem /usr/include/qt5 -isystem /usr/include/qt5/QtWidgets -isystem /usr/include/qt5/QtGui -isystem /usr/include/qt5/QtCore -isystem /usr/lib64/qt5/./mkspecs/linux-g++ -isystem /usr/include/qt5/QtNetwork -isystem /usr/include/qt5/QtPrintSupport -isystem /usr/include/qt5/QtConcurrent -isystem /usr/include/qt5/QtSvg -isystem /usr/include/opencv  -std=c++11 -Wno-unknown-pragmas -O2 -fwrapv -pipe -Wformat -Werror=format-security -gdwarf-4 -fno-debug-types-section -fvar-tracking-assignments -g2 -Wp,-D_FORTIFY_SOURCE=2 -fstack-protector-strong --param=ssp-buffer-size=4 -fPIC -march=x86-64 -gdwarf-4 -fno-debug-types-section -fvar-tracking-assignments -g2  -DNDEBUG -DQT_NO_DEBUG -fPIC   -DDK_LOADER_DLL_EXPORT -DNOMINMAX -fPIC -std=gnu++11 -o CMakeFiles/nomacsLoader.dir/src/DkLoader/DkProcess.cpp.o -c /tmp/B.qjM4WT/BUILD/nomacs-3.4.1/ImageLounge/src/DkLoader/DkProcess.cpp
make[2]: Leaving directory '/tmp/B.qjM4WT/BUILD/nomacs-3.4.1/build'
make[2]: Entering directory '/tmp/B.qjM4WT/BUILD/nomacs-3.4.1/build'
[ 16%] Building CXX object CMakeFiles/nomacsLoader.dir/src/DkLoader/DkActionManager.cpp.o
/usr/bin/x86_64-pld-linux-g++  -DHAVE_EXIV2_HPP -DNOMACS_VERSION=\"3.4\" -DQT5 -DQT_CONCURRENT_LIB -DQT_CORE_LIB -DQT_GUI_LIB -DQT_NETWORK_LIB -DQT_NO_DEBUG -DQT_NO_DEBUG_OUTPUT -DQT_PRINTSUPPORT_LIB -DQT_SVG_LIB -DQT_WIDGETS_LIB -DWITH_LIBRAW -DWITH_LIBTIFF -DWITH_OPENCV -DWITH_PLUGINS -DWITH_QUAZIP -DnomacsLoader_EXPORTS -I/tmp/B.qjM4WT/BUILD/nomacs-3.4.1/build -I/tmp/B.qjM4WT/BUILD/nomacs-3.4.1/ImageLounge -I/tmp/B.qjM4WT/BUILD/nomacs-3.4.1/build/nomacsLoader_autogen/include -I/usr/include/libraw -I/tmp/B.qjM4WT/BUILD/nomacs-3.4.1/ImageLounge/src -I/tmp/B.qjM4WT/BUILD/nomacs-3.4.1/ImageLounge/src/DkCore -I/tmp/B.qjM4WT/BUILD/nomacs-3.4.1/ImageLounge/src/DkLoader -I/tmp/B.qjM4WT/BUILD/nomacs-3.4.1/ImageLounge/src/DkGui -isystem /usr/include/qt5 -isystem /usr/include/qt5/QtWidgets -isystem /usr/include/qt5/QtGui -isystem /usr/include/qt5/QtCore -isystem /usr/lib64/qt5/./mkspecs/linux-g++ -isystem /usr/include/qt5/QtNetwork -isystem /usr/include/qt5/QtPrintSupport -isystem /usr/include/qt5/QtConcurrent -isystem /usr/include/qt5/QtSvg -isystem /usr/include/opencv  -std=c++11 -Wno-unknown-pragmas -O2 -fwrapv -pipe -Wformat -Werror=format-security -gdwarf-4 -fno-debug-types-section -fvar-tracking-assignments -g2 -Wp,-D_FORTIFY_SOURCE=2 -fstack-protector-strong --param=ssp-buffer-size=4 -fPIC -march=x86-64 -gdwarf-4 -fno-debug-types-section -fvar-tracking-assignments -g2  -DNDEBUG -DQT_NO_DEBUG -fPIC   -DDK_LOADER_DLL_EXPORT -DNOMINMAX -fPIC -std=gnu++11 -o CMakeFiles/nomacsLoader.dir/src/DkLoader/DkActionManager.cpp.o -c /tmp/B.qjM4WT/BUILD/nomacs-3.4.1/ImageLounge/src/DkLoader/DkActionManager.cpp
make[2]: Leaving directory '/tmp/B.qjM4WT/BUILD/nomacs-3.4.1/build'
make[2]: Entering directory '/tmp/B.qjM4WT/BUILD/nomacs-3.4.1/build'
[ 27%] Building CXX object CMakeFiles/nomacsLoader.dir/src/DkLoader/DkPluginManager.cpp.o
/usr/bin/x86_64-pld-linux-g++  -DHAVE_EXIV2_HPP -DNOMACS_VERSION=\"3.4\" -DQT5 -DQT_CONCURRENT_LIB -DQT_CORE_LIB -DQT_GUI_LIB -DQT_NETWORK_LIB -DQT_NO_DEBUG -DQT_NO_DEBUG_OUTPUT -DQT_PRINTSUPPORT_LIB -DQT_SVG_LIB -DQT_WIDGETS_LIB -DWITH_LIBRAW -DWITH_LIBTIFF -DWITH_OPENCV -DWITH_PLUGINS -DWITH_QUAZIP -DnomacsLoader_EXPORTS -I/tmp/B.qjM4WT/BUILD/nomacs-3.4.1/build -I/tmp/B.qjM4WT/BUILD/nomacs-3.4.1/ImageLounge -I/tmp/B.qjM4WT/BUILD/nomacs-3.4.1/build/nomacsLoader_autogen/include -I/usr/include/libraw -I/tmp/B.qjM4WT/BUILD/nomacs-3.4.1/ImageLounge/src -I/tmp/B.qjM4WT/BUILD/nomacs-3.4.1/ImageLounge/src/DkCore -I/tmp/B.qjM4WT/BUILD/nomacs-3.4.1/ImageLounge/src/DkLoader -I/tmp/B.qjM4WT/BUILD/nomacs-3.4.1/ImageLounge/src/DkGui -isystem /usr/include/qt5 -isystem /usr/include/qt5/QtWidgets -isystem /usr/include/qt5/QtGui -isystem /usr/include/qt5/QtCore -isystem /usr/lib64/qt5/./mkspecs/linux-g++ -isystem /usr/include/qt5/QtNetwork -isystem /usr/include/qt5/QtPrintSupport -isystem /usr/include/qt5/QtConcurrent -isystem /usr/include/qt5/QtSvg -isystem /usr/include/opencv  -std=c++11 -Wno-unknown-pragmas -O2 -fwrapv -pipe -Wformat -Werror=format-security -gdwarf-4 -fno-debug-types-section -fvar-tracking-assignments -g2 -Wp,-D_FORTIFY_SOURCE=2 -fstack-protector-strong --param=ssp-buffer-size=4 -fPIC -march=x86-64 -gdwarf-4 -fno-debug-types-section -fvar-tracking-assignments -g2  -DNDEBUG -DQT_NO_DEBUG -fPIC   -DDK_LOADER_DLL_EXPORT -DNOMINMAX -fPIC -std=gnu++11 -o CMakeFiles/nomacsLoader.dir/src/DkLoader/DkPluginManager.cpp.o -c /tmp/B.qjM4WT/BUILD/nomacs-3.4.1/ImageLounge/src/DkLoader/DkPluginManager.cpp
make[2]: Leaving directory '/tmp/B.qjM4WT/BUILD/nomacs-3.4.1/build'
make[1]: *** [CMakeFiles/Makefile2:186: CMakeFiles/nomacsLoader.dir/all] Error 2
make: *** [Makefile:155: all] Error 2
error: Bad exit status from /tmp/B.qjM4WT/BUILD/tmp/rpm-tmp.73986 (%build)


RPM build errors:
    Bad exit status from /tmp/B.qjM4WT/BUILD/tmp/rpm-tmp.73986 (%build)
ended at: Sun Feb 10 12:01:30 2019, done in 0:00:23.554731
error: No files produced.
+ chmod -R u+rwX /tmp/B.qjM4WT/BUILD
+ rm -rf /tmp/B.qjM4WT/tmp /tmp/B.qjM4WT/BUILD
+ rm -rf /tmp/B.qjM4WT
Begin-PLD-Builder-Info
Build-Time: user:98.43s sys:8.44s real:28.96s (faults io:0 non-io:1970075)

End-PLD-Builder-Info
[Back to list of logs] [View rpm -qa of builder]