FailedOk

th/SRPMS[OK]
th/x32[OK]
th/i686[OK]
th/x86_64[OK]

ac/SRPMS[OK]
ac/i386[OK]
ac/i586[OK]
ac/i686[OK]
ac/alpha[OK]
ac/amd64[OK]
ac/athlon[OK]
ac/ppc[OK]
ac/sparc[OK]
ac/sparc64[OK]

Advanced Search
main()
Powered by PLD Linux
(c) 2002-2019 PLD Team
$Revision: 1.37 $
Powered by Ken.
Your IP: 34.237.76.91

obs-studio 7ce2d401-2162-43b7-a16f-98fa2a76cace

Status:Failed
Source URL:ftp://buildlogs.pld-linux.org/th/x86_64/FAIL/obs-studio,7ce2d401-2162-43b7-a16f-98fa2a76cace.bz2
text/plain URL:View!
rpm -qa of builder:View!
Date:2019/08/08 15:29:58
Runtime:0:00:14.923881

Toc:

  • error 1
  • rpm: error: Failed build dependencies:
  • error 2
  • rpm: error: Failed build dependencies:
  • prep
  • Executing(%prep): /bin/sh -e /tmp/B.Ey4Kql/BUILD/tmp/rpm-tmp.89197
  • build
  • Executing(%build): /bin/sh -e /tmp/B.Ey4Kql/BUILD/tmp/rpm-tmp.89197
  • error 3
  • /tmp/B.Ey4Kql/BUILD/obs-studio-21.0.1/plugins/obs-libfdk/obs-libfdk.c:266:27: error: 'AACENC_InfoStruct' {aka 'struct <anonymous>'} has no member named 'encoderDelay'; did you mean 'nDelay'?
  • error 4
  • /tmp/B.Ey4Kql/BUILD/obs-studio-21.0.1/plugins/obs-libfdk/obs-libfdk.c:267:48: error: 'AACENC_InfoStruct' {aka 'struct <anonymous>'} has no member named 'encoderDelay'; did you mean 'nDelay'?
  • error 5
  • make[2]: *** [plugins/obs-libfdk/CMakeFiles/obs-libfdk.dir/build.make:66: plugins/obs-libfdk/CMakeFiles/obs-libfdk.dir/obs-libfdk.c.o] Error 1
  • error 6
  • make[1]: *** [CMakeFiles/Makefile2:1304: plugins/obs-libfdk/CMakeFiles/obs-libfdk.dir/all] Error 2
  • error 7
  • error: Bad exit status from /tmp/B.Ey4Kql/BUILD/tmp/rpm-tmp.89197 (%build)
  • error 8
  • RPM build errors:
  • error 9
  • error: No files produced.

Content:

request from: qboosh
checking if we should skip the build
started at: Thu Aug  8 15:29:16 2019
killing old processes on a builder
sending signal 9 to pid -1
Killed
cleaning up /tmp
fetching https://srcbuilder.pld-linux.org/th//srpms/7ce2d401-2162-43b7-a16f-98fa2a76cace/obs-studio-21.0.1-4.src.rpm
fetched 5919898 bytes, 6255.4 K/s
installing srpm: obs-studio-21.0.1-4.src.rpm
+ install -d /tmp/B.Ey4Kql/BUILD /tmp/B.Ey4Kql/RPMS
+ LC_ALL=en_US.UTF-8
+ rpm -qp --changelog obs-studio-21.0.1-4.src.rpm
* Thu Aug 08 2019 PLD Linux Team <feedback@pld-linux.org>
- For complete changelog see: http://git.pld-linux.org/?p=packages/obs-studio.git;a=log;h=master
* Mon Jan 14 2019 Jan Palus <atler@pld-linux.org> b4ad78b
- fix build; rel 4 + rpm -Uhv --nodeps --define '_topdir /tmp/B.Ey4Kql' --define '_specdir %{_topdir}' --define '_sourcedir %{_specdir}' --define '_rpmdir %{_topdir}/RPMS' --define '_builddir %{_topdir}/BUILD' obs-studio-21.0.1-4.src.rpm Preparing... ################################################## obs-studio ################################################## + rm -f obs-studio-21.0.1-4.src.rpm + install -m 700 -d /tmp/B.Ey4Kql/BUILD/tmp + TMPDIR=/tmp/B.Ey4Kql/BUILD/tmp + exec nice -n 0 rpmbuild -bp --short-circuit --nodeps --define '_topdir /tmp/B.Ey4Kql' --define '_specdir %{_topdir}' --define '_sourcedir %{_specdir}' --define '_rpmdir %{_topdir}/RPMS' --define '_builddir %{_topdir}/BUILD' --target x86_64-pld-linux --define 'prep exit 0' /tmp/B.Ey4Kql/obs-studio.spec Building target platforms: x86_64-pld-linux checking BuildConflict-ing packages no BuildConflicts found checking BR rpm: error: Failed build dependencies: rpm: vlc-devel is needed by obs-studio-21.0.1-4.src rpm: Building target platforms: x86_64-pld-linux updating poldek cache... ready is up to date Retrieving th::packages.ndir.md... th is up to date Retrieving th::packages.ndir.md... th is up to date Retrieving th-ready::packages.ndir.md... th-ready is up to date Retrieving th-ready::packages.ndir.md... th-ready is up to date Retrieving th-test::packages.ndir.md... th-test is up to date Retrieving th-test::packages.ndir.md... th-test is up to date checking conflicting packages in BRed packages poldek: Loading [pndir]ready... poldek: Loading [pndir]th-test... poldek: Loading [pndir]th-test... poldek: Loading [pndir]th-ready... poldek: Loading [pndir]th-ready... poldek: Loading [pndir]th... poldek: Loading [pndir]th... poldek: 29987 packages read poldek: Removed 2259 duplicate packages from available set poldek: Processing dependencies... poldek: vlc-devel-3.0.7.1-1.x86_64 marks vlc-3.0.7.1-1.x86_64 (cap /usr/lib64/vlc) poldek: There are 2 packages to install (1 marked by dependencies): poldek: I vlc-devel-3.0.7.1-1.x86_64 poldek: D vlc-3.0.7.1-1.x86_64 poldek: This operation will use 48.9MB of disk space. poldek: Need to get 8.0MB of archives. poldek: Executing pm-command.sh --upgrade -vh --test --root / --define _check_dirname_deps 1... poldek: Preparing... ################################################## no conflicts found checking BR rpm: error: Failed build dependencies: rpm: vlc-devel is needed by obs-studio-21.0.1-4.src rpm: Building target platforms: x86_64-pld-linux installing BR: vlc\-devel + poldek --noask --caplookup -Q -v '--ignore=hhvm-*' '--ignore=php4-*' '--ignore=php52-*' '--ignore=php54-*' '--ignore=php55-*' '--ignore=php56-*' '--ignore=php70-*' '--ignore=php71-*' '--ignore=php72-*' '--ignore=php73-*' '--ignore=php74-*' --upgrade vlc-devel Loading [pndir]ready... Loading [pndir]th-test... Loading [pndir]th-test... Loading [pndir]th-ready... Loading [pndir]th-ready... Loading [pndir]th... Loading [pndir]th... 29987 packages read Removed 2259 duplicate packages from available set Processing dependencies... vlc-devel-3.0.7.1-1.x86_64 marks vlc-3.0.7.1-1.x86_64 (cap /usr/lib64/vlc) There are 2 packages to install (1 marked by dependencies): I vlc-devel-3.0.7.1-1.x86_64 D vlc-3.0.7.1-1.x86_64 This operation will use 48.9MB of disk space. Need to get 8.0MB of archives. Executing pm-command.sh --upgrade -vh --root / --define _check_dirname_deps 1... Preparing... ################################################## vlc ################################################## vlc-devel ################################################## building RPM using: set -ex; : build-id: 7ce2d401-2162-43b7-a16f-98fa2a76cace; TMPDIR=/tmp/B.Ey4Kql/BUILD/tmp exec nice -n 0 rpmbuild -bb --define '_smp_mflags -j9' --define '_make_opts -Otarget' --define '_pld_builder 1' --define '_topdir /tmp/B.Ey4Kql' --define '_specdir %{_topdir}' --define '_sourcedir %{_specdir}' --define '_rpmdir %{_topdir}/RPMS' --define '_builddir %{_topdir}/BUILD' --target x86_64-pld-linux /tmp/B.Ey4Kql/obs-studio.spec + : build-id: 7ce2d401-2162-43b7-a16f-98fa2a76cace + TMPDIR=/tmp/B.Ey4Kql/BUILD/tmp + exec nice -n 0 rpmbuild -bb --define '_smp_mflags -j9' --define '_make_opts -Otarget' --define '_pld_builder 1' --define '_topdir /tmp/B.Ey4Kql' --define '_specdir %{_topdir}' --define '_sourcedir %{_specdir}' --define '_rpmdir %{_topdir}/RPMS' --define '_builddir %{_topdir}/BUILD' --target x86_64-pld-linux /tmp/B.Ey4Kql/obs-studio.spec Building target platforms: x86_64-pld-linux Executing(%prep): /bin/sh -e /tmp/B.Ey4Kql/BUILD/tmp/rpm-tmp.89197 + umask 022 + cd /tmp/B.Ey4Kql/BUILD + cd /tmp/B.Ey4Kql/BUILD + rm -rf obs-studio-21.0.1 + /usr/bin/gzip -dc /tmp/B.Ey4Kql/obs-studio-21.0.1.tar.gz + /bin/tar -xf - + STATUS=0 + '[' 0 -ne 0 ']' + cd obs-studio-21.0.1 + /bin/id -u + '[' 1000 '=' 0 ']' + /bin/id -u + '[' 1000 '=' 0 ']' + /bin/chmod -Rf a+rX,u+w,g-w,o-w . + echo 'Patch #0 (libobs_link.patch):' Patch #0 (libobs_link.patch): + '[' -f /tmp/B.Ey4Kql/libobs_link.patch ']' + /bin/cat /tmp/B.Ey4Kql/libobs_link.patch + /usr/bin/patch -s -p1 + echo 'Patch #1 (obs-studio-build.patch):' Patch #1 (obs-studio-build.patch): + '[' -f /tmp/B.Ey4Kql/obs-studio-build.patch ']' + /bin/cat /tmp/B.Ey4Kql/obs-studio-build.patch + /usr/bin/patch -s -p1 + exit 0 Executing(%build): /bin/sh -e /tmp/B.Ey4Kql/BUILD/tmp/rpm-tmp.89197 TMP=/home/users/builder/tmp HOME=/home/users/builder PATH=/home/users/builder/GNUstep/Tools:/usr/local/bin:/usr/bin:/bin:/home/users/builder/bin TMPDIR=/tmp/B.Ey4Kql/BUILD/tmp + umask 022 + cd /tmp/B.Ey4Kql/BUILD + cd obs-studio-21.0.1 + install -d build + cd build + export 'OBS_MULTIARCH_SUFFIX=64' + CC=x86_64-pld-linux-gcc CXX=x86_64-pld-linux-g++ CPPFLAGS='' /usr/bin/cmake -Wno-dev '-DCMAKE_VERBOSE_MAKEFILE=ON' '-DCMAKE_BUILD_TYPE=PLD' '-DCMAKE_INSTALL_BINDIR:PATH=/usr/bin' '-DCMAKE_INSTALL_SBINDIR:PATH=/usr/sbin' '-DCMAKE_INSTALL_LIBEXECDIR:PATH=/usr/libexec' '-DCMAKE_INSTALL_SYSCONFDIR:PATH=/etc' '-DCMAKE_INSTALL_SHAREDSTATEDIRPATH:PATH=/var/lib' '-DCMAKE_INSTALL_LOCALSTATEDIRPATH:PATH=/var' '-DCMAKE_INSTALL_LIBDIR:PATH=/usr/lib64' '-DCMAKE_INSTALL_INCLUDEDIR:PATH=/usr/include' '-DCMAKE_INSTALL_OLDINCLUDEDIR:PATH=/usr/include' '-DCMAKE_INSTALL_DATAROOTDIR:PATH=/usr/share' '-DCMAKE_INSTALL_DATADIR:PATH=/usr/share' '-DCMAKE_INSTALL_INFODIR:PATH=/usr/share/info' '-DCMAKE_INSTALL_LOCALEDIR:PATH=/usr/share/locale' '-DCMAKE_INSTALL_MANDIR:PATH=/usr/share/man' '-DCMAKE_INSTALL_DOCDIR:PATH=/usr/share/doc' '-DCMAKE_INSTALL_PREFIX:PATH=/usr' '-DSYSCONF_INSTALL_DIR:PATH=/etc' '-DCMAKE_CXX_FLAGS_PLD=-O2 -fwrapv -pipe -Wformat -Werror=format-security -gdwarf-4 -fno-debug-types-section -fvar-tracking-assignments -g2 -Wp,-D_FORTIFY_SOURCE=2 -fstack-protector-strong --param=ssp-buffer-size=4 -Werror=trampolines -fPIC -march=x86-64 -gdwarf-4 -fno-debug-types-section -fvar-tracking-assignments -g2 -DNDEBUG -DQT_NO_DEBUG' '-DCMAKE_C_FLAGS_PLD=-O2 -fwrapv -pipe -Wformat -Werror=format-security -gdwarf-4 -fno-debug-types-section -fvar-tracking-assignments -g2 -Wp,-D_FORTIFY_SOURCE=2 -fstack-protector-strong --param=ssp-buffer-size=4 -Werror=trampolines -fPIC -march=x86-64 -gdwarf-4 -fno-debug-types-section -fvar-tracking-assignments -g2 -DNDEBUG -DQT_NO_DEBUG' '-DCMAKE_Fortran_FLAGS_PLD=-O2 -fwrapv -pipe -Wformat -Werror=format-security -gdwarf-4 -fno-debug-types-section -fvar-tracking-assignments -g2 -Wp,-D_FORTIFY_SOURCE=2 -fstack-protector-strong --param=ssp-buffer-size=4 -Werror=trampolines -fPIC -march=x86-64 -gdwarf-4 -fno-debug-types-section -fvar-tracking-assignments -g2 -DNDEBUG -DQT_NO_DEBUG' '-DCMAKE_EXE_LINKER_FLAGS_PLD=-Wl,--as-needed -Wl,--no-copy-dt-needed-entries -Wl,-z,relro -Wl,-z,combreloc ' '-DCMAKE_SHARED_LINKER_FLAGS_PLD=-Wl,--as-needed -Wl,--no-copy-dt-needed-entries -Wl,-z,relro -Wl,-z,combreloc ' '-DCMAKE_MODULE_LINKER_FLAGS_PLD=-Wl,--as-needed -Wl,--no-copy-dt-needed-entries -Wl,-z,relro -Wl,-z,combreloc ' '-DLIB_SUFFIX=64' '-DBUILD_SHARED_LIBS:BOOL=ON' '-DOBS_VERSION_OVERRIDE=21.0.1' ../ -- The C compiler identification is GNU 8.3.0 -- The CXX compiler identification is GNU 8.3.0 -- Check for working C compiler: /usr/bin/x86_64-pld-linux-gcc -- Check for working C compiler: /usr/bin/x86_64-pld-linux-gcc -- works -- Detecting C compiler ABI info -- Detecting C compiler ABI info - done -- Detecting C compile features -- Detecting C compile features - done -- Check for working CXX compiler: /usr/bin/x86_64-pld-linux-g++ -- Check for working CXX compiler: /usr/bin/x86_64-pld-linux-g++ -- works -- Detecting CXX compiler ABI info -- Detecting CXX compiler ABI info - done -- Detecting CXX compile features -- Detecting CXX compile features - done -- OBS_VERSION: 21.0.1 -- Try C++11 flag = [-std=gnu++11] -- Performing Test CXX11_FLAG_DETECTED -- Performing Test CXX11_FLAG_DETECTED - Success -- Found CXX11: -std=gnu++11 -- Found OpenGL: /usr/lib64/libGL.so -- Found X11: /usr/include -- Looking for XOpenDisplay in /usr/lib64/libX11.so;/usr/lib64/libXext.so -- Looking for XOpenDisplay in /usr/lib64/libX11.so;/usr/lib64/libXext.so - found -- Looking for gethostbyname -- Looking for gethostbyname - found -- Looking for connect -- Looking for connect - found -- Looking for remove -- Looking for remove - found -- Looking for shmat -- Looking for shmat - found -- Looking for IceConnectionNumber in ICE -- Looking for IceConnectionNumber in ICE - found -- Found FFmpeg: /usr/bin/../lib64/libavcodec.so (found version "58.54.100") found components: avcodec avdevice avutil avformat -- Found Libcurl: /usr/bin/../lib64/libcurl.so -- Scripting: Luajit supported -- Scripting: Python 3 supported -- Found SWIG: /usr/bin/swig (found suitable version "3.0.12", minimum required is "2") -- Using system Jansson library -- Found PkgConfig: /usr/bin/pkg-config (found version "0.29.2") -- XCB[XCB]: Found component XCB -- Found XCB_XCB: /usr/lib64/libxcb.so -- Found XCB: /usr/lib64/libxcb.so -- Found X11_XCB: /usr/lib64/libX11-xcb.so -- Looking for include file pthread.h -- Looking for include file pthread.h - found -- Looking for pthread_create -- Looking for pthread_create - not found -- Check if compiler accepts -pthread -- Check if compiler accepts -pthread - yes -- Found Threads: TRUE -- Found FFmpeg: /usr/bin/../lib64/libavformat.so (found version "58.29.100") found components: avformat avutil swscale swresample avcodec -- Found PulseAudio - Audio Monitor enabled -- Using libavcodec for image loading in libobs -- Found zlib: /usr/bin/../lib64/libz.so -- Found FFmpeg: /usr/bin/../lib64/libavcodec.so (found version "58.54.100") found components: avcodec avutil avformat -- XCB[XCB]: Found component XCB -- XCB[SHM]: Found component SHM -- Found XCB_SHM: /usr/lib64/libxcb-shm.so -- XCB[XFIXES]: Found component XFIXES -- Found XCB_XFIXES: /usr/lib64/libxcb-xfixes.so -- XCB[XINERAMA]: Found component XINERAMA -- Found XCB_XINERAMA: /usr/lib64/libxcb-xinerama.so -- Found XCB: /usr/lib64/libxcb.so;/usr/lib64/libxcb-shm.so;/usr/lib64/libxcb-xfixes.so;/usr/lib64/libxcb-xinerama.so -- Found LibV4L2: /usr/lib64/libv4l2.so -- Found UDev: /lib64/libudev.so -- Checking for module 'jack' -- Found jack, version 1.9.12 -- Found jack: /usr/lib64/libjack.so -- Found ALSA: /usr/lib64/libasound.so (found version "1.1.9") -- Found LibVLC_INCLUDES: /usr/include/vlc -- Found Libx264: /usr/bin/../lib64/libx264.so -- Found FFmpeg: /usr/bin/../lib64/libavcodec.so (found version "58.54.100") found components: avcodec avfilter avdevice avutil swscale avformat swresample -- Found FFmpeg: /usr/bin/../lib64/libavcodec.so (found version "58.54.100") found components: avcodec avutil avformat -- Configuring done -- Generating done CMake Warning: Manually-specified variables were not used by the project: CMAKE_Fortran_FLAGS_PLD CMAKE_INSTALL_LOCALSTATEDIRPATH CMAKE_INSTALL_SHAREDSTATEDIRPATH LIB_SUFFIX SYSCONF_INSTALL_DIR -- Build files have been written to: /tmp/B.Ey4Kql/BUILD/obs-studio-21.0.1/build + /usr/bin/make -Otarget -j9 /usr/bin/cmake -S/tmp/B.Ey4Kql/BUILD/obs-studio-21.0.1 -B/tmp/B.Ey4Kql/BUILD/obs-studio-21.0.1/build --check-build-system CMakeFiles/Makefile.cmake 0 /usr/bin/cmake -E cmake_progress_start /tmp/B.Ey4Kql/BUILD/obs-studio-21.0.1/build/CMakeFiles /tmp/B.Ey4Kql/BUILD/obs-studio-21.0.1/build/CMakeFiles/progress.marks /usr/bin/make -f CMakeFiles/Makefile2 all /usr/bin/make -f deps/glad/CMakeFiles/glad.dir/build.make deps/glad/CMakeFiles/glad.dir/depend /usr/bin/make -f deps/media-playback/CMakeFiles/media-playback.dir/build.make deps/media-playback/CMakeFiles/media-playback.dir/depend /usr/bin/make -f libobs/CMakeFiles/libobs.dir/build.make libobs/CMakeFiles/libobs.dir/depend /usr/bin/make -f deps/obs-scripting/obspython/CMakeFiles/obspython_swig_compilation.dir/build.make deps/obs-scripting/obspython/CMakeFiles/obspython_swig_compilation.dir/depend /usr/bin/make -f deps/obs-scripting/obslua/CMakeFiles/obslua_swig_compilation.dir/build.make deps/obs-scripting/obslua/CMakeFiles/obslua_swig_compilation.dir/depend /usr/bin/make -f plugins/obs-ffmpeg/ffmpeg-mux/CMakeFiles/ffmpeg-mux.dir/build.make plugins/obs-ffmpeg/ffmpeg-mux/CMakeFiles/ffmpeg-mux.dir/depend make[2]: Entering directory '/tmp/B.Ey4Kql/BUILD/obs-studio-21.0.1/build' cd /tmp/B.Ey4Kql/BUILD/obs-studio-21.0.1/build && /usr/bin/cmake -E cmake_depends "Unix Makefiles" /tmp/B.Ey4Kql/BUILD/obs-studio-21.0.1 /tmp/B.Ey4Kql/BUILD/obs-studio-21.0.1/plugins/obs-ffmpeg/ffmpeg-mux /tmp/B.Ey4Kql/BUILD/obs-studio-21.0.1/build /tmp/B.Ey4Kql/BUILD/obs-studio-21.0.1/build/plugins/obs-ffmpeg/ffmpeg-mux /tmp/B.Ey4Kql/BUILD/obs-studio-21.0.1/build/plugins/obs-ffmpeg/ffmpeg-mux/CMakeFiles/ffmpeg-mux.dir/DependInfo.cmake --color= Scanning dependencies of target ffmpeg-mux make[2]: Leaving directory '/tmp/B.Ey4Kql/BUILD/obs-studio-21.0.1/build' /usr/bin/make -f plugins/obs-ffmpeg/ffmpeg-mux/CMakeFiles/ffmpeg-mux.dir/build.make plugins/obs-ffmpeg/ffmpeg-mux/CMakeFiles/ffmpeg-mux.dir/build make[2]: Entering directory '/tmp/B.Ey4Kql/BUILD/obs-studio-21.0.1/build' cd /tmp/B.Ey4Kql/BUILD/obs-studio-21.0.1/build && /usr/bin/cmake -E cmake_depends "Unix Makefiles" /tmp/B.Ey4Kql/BUILD/obs-studio-21.0.1 /tmp/B.Ey4Kql/BUILD/obs-studio-21.0.1/deps/glad /tmp/B.Ey4Kql/BUILD/obs-studio-21.0.1/build /tmp/B.Ey4Kql/BUILD/obs-studio-21.0.1/build/deps/glad /tmp/B.Ey4Kql/BUILD/obs-studio-21.0.1/build/deps/glad/CMakeFiles/glad.dir/DependInfo.cmake --color= Scanning dependencies of target glad make[2]: Leaving directory '/tmp/B.Ey4Kql/BUILD/obs-studio-21.0.1/build' /usr/bin/make -f deps/glad/CMakeFiles/glad.dir/build.make deps/glad/CMakeFiles/glad.dir/build make[2]: Entering directory '/tmp/B.Ey4Kql/BUILD/obs-studio-21.0.1/build' cd /tmp/B.Ey4Kql/BUILD/obs-studio-21.0.1/build && /usr/bin/cmake -E cmake_depends "Unix Makefiles" /tmp/B.Ey4Kql/BUILD/obs-studio-21.0.1 /tmp/B.Ey4Kql/BUILD/obs-studio-21.0.1/deps/obs-scripting/obspython /tmp/B.Ey4Kql/BUILD/obs-studio-21.0.1/build /tmp/B.Ey4Kql/BUILD/obs-studio-21.0.1/build/deps/obs-scripting/obspython /tmp/B.Ey4Kql/BUILD/obs-studio-21.0.1/build/deps/obs-scripting/obspython/CMakeFiles/obspython_swig_compilation.dir/DependInfo.cmake --color= Scanning dependencies of target obspython_swig_compilation make[2]: Leaving directory '/tmp/B.Ey4Kql/BUILD/obs-studio-21.0.1/build' make[2]: Entering directory '/tmp/B.Ey4Kql/BUILD/obs-studio-21.0.1/build' cd /tmp/B.Ey4Kql/BUILD/obs-studio-21.0.1/build && /usr/bin/cmake -E cmake_depends "Unix Makefiles" /tmp/B.Ey4Kql/BUILD/obs-studio-21.0.1 /tmp/B.Ey4Kql/BUILD/obs-studio-21.0.1/deps/media-playback /tmp/B.Ey4Kql/BUILD/obs-studio-21.0.1/build /tmp/B.Ey4Kql/BUILD/obs-studio-21.0.1/build/deps/media-playback /tmp/B.Ey4Kql/BUILD/obs-studio-21.0.1/build/deps/media-playback/CMakeFiles/media-playback.dir/DependInfo.cmake --color= Scanning dependencies of target media-playback make[2]: Leaving directory '/tmp/B.Ey4Kql/BUILD/obs-studio-21.0.1/build' /usr/bin/make -f deps/media-playback/CMakeFiles/media-playback.dir/build.make deps/media-playback/CMakeFiles/media-playback.dir/build /usr/bin/make -f deps/obs-scripting/obspython/CMakeFiles/obspython_swig_compilation.dir/build.make deps/obs-scripting/obspython/CMakeFiles/obspython_swig_compilation.dir/build make[2]: Entering directory '/tmp/B.Ey4Kql/BUILD/obs-studio-21.0.1/build' cd /tmp/B.Ey4Kql/BUILD/obs-studio-21.0.1/build && /usr/bin/cmake -E cmake_depends "Unix Makefiles" /tmp/B.Ey4Kql/BUILD/obs-studio-21.0.1 /tmp/B.Ey4Kql/BUILD/obs-studio-21.0.1/deps/obs-scripting/obslua /tmp/B.Ey4Kql/BUILD/obs-studio-21.0.1/build /tmp/B.Ey4Kql/BUILD/obs-studio-21.0.1/build/deps/obs-scripting/obslua /tmp/B.Ey4Kql/BUILD/obs-studio-21.0.1/build/deps/obs-scripting/obslua/CMakeFiles/obslua_swig_compilation.dir/DependInfo.cmake --color= Scanning dependencies of target obslua_swig_compilation make[2]: Leaving directory '/tmp/B.Ey4Kql/BUILD/obs-studio-21.0.1/build' /usr/bin/make -f deps/obs-scripting/obslua/CMakeFiles/obslua_swig_compilation.dir/build.make deps/obs-scripting/obslua/CMakeFiles/obslua_swig_compilation.dir/build make[2]: Entering directory '/tmp/B.Ey4Kql/BUILD/obs-studio-21.0.1/build' cd /tmp/B.Ey4Kql/BUILD/obs-studio-21.0.1/build && /usr/bin/cmake -E cmake_depends "Unix Makefiles" /tmp/B.Ey4Kql/BUILD/obs-studio-21.0.1 /tmp/B.Ey4Kql/BUILD/obs-studio-21.0.1/libobs /tmp/B.Ey4Kql/BUILD/obs-studio-21.0.1/build /tmp/B.Ey4Kql/BUILD/obs-studio-21.0.1/build/libobs /tmp/B.Ey4Kql/BUILD/obs-studio-21.0.1/build/libobs/CMakeFiles/libobs.dir/DependInfo.cmake --color= Scanning dependencies of target libobs make[2]: Leaving directory '/tmp/B.Ey4Kql/BUILD/obs-studio-21.0.1/build' /usr/bin/make -f libobs/CMakeFiles/libobs.dir/build.make libobs/CMakeFiles/libobs.dir/build make[2]: Entering directory '/tmp/B.Ey4Kql/BUILD/obs-studio-21.0.1/build' [ 3%] Building C object libobs/CMakeFiles/libobs.dir/callback/calldata.c.o cd /tmp/B.Ey4Kql/BUILD/obs-studio-21.0.1/build/libobs && /usr/bin/x86_64-pld-linux-gcc -DHAVE_OBSCONFIG_H -DLIBOBS_EXPORTS -DUSE_XDG -Dlibobs_EXPORTS -I/usr/include/dbus-1.0 -I/usr/lib64/dbus-1.0/include -I/tmp/B.Ey4Kql/BUILD/obs-studio-21.0.1/libobs -I/tmp/B.Ey4Kql/BUILD/obs-studio-21.0.1/build/config -Wall -Wextra -Wno-unused-function -Werror-implicit-function-declaration -Wno-missing-braces -Wno-missing-field-initializers -std=gnu99 -fno-strict-aliasing -O2 -fwrapv -pipe -Wformat -Werror=format-security -gdwarf-4 -fno-debug-types-section -fvar-tracking-assignments -g2 -Wp,-D_FORTIFY_SOURCE=2 -fstack-protector-strong --param=ssp-buffer-size=4 -Werror=trampolines -fPIC -march=x86-64 -gdwarf-4 -fno-debug-types-section -fvar-tracking-assignments -g2 -DNDEBUG -DQT_NO_DEBUG -fPIC -mmmx -msse -msse2 -pthread -o CMakeFiles/libobs.dir/callback/calldata.c.o -c /tmp/B.Ey4Kql/BUILD/obs-studio-21.0.1/libobs/callback/calldata.c make[2]: Leaving directory '/tmp/B.Ey4Kql/BUILD/obs-studio-21.0.1/build' make[2]: Entering directory '/tmp/B.Ey4Kql/BUILD/obs-studio-21.0.1/build' [ 1%] Building C object plugins/obs-ffmpeg/ffmpeg-mux/CMakeFiles/ffmpeg-mux.dir/ffmpeg-mux.c.o cd /tmp/B.Ey4Kql/BUILD/obs-studio-21.0.1/build/plugins/obs-ffmpeg/ffmpeg-mux && /usr/bin/x86_64-pld-linux-gcc -DUSE_XDG -Wall -Wextra -Wno-unused-function -Werror-implicit-function-declaration -Wno-missing-braces -Wno-missing-field-initializers -std=gnu99 -fno-strict-aliasing -O2 -fwrapv -pipe -Wformat -Werror=format-security -gdwarf-4 -fno-debug-types-section -fvar-tracking-assignments -g2 -Wp,-D_FORTIFY_SOURCE=2 -fstack-protector-strong --param=ssp-buffer-size=4 -Werror=trampolines -fPIC -march=x86-64 -gdwarf-4 -fno-debug-types-section -fvar-tracking-assignments -g2 -DNDEBUG -DQT_NO_DEBUG -o CMakeFiles/ffmpeg-mux.dir/ffmpeg-mux.c.o -c /tmp/B.Ey4Kql/BUILD/obs-studio-21.0.1/plugins/obs-ffmpeg/ffmpeg-mux/ffmpeg-mux.c /tmp/B.Ey4Kql/BUILD/obs-studio-21.0.1/plugins/obs-ffmpeg/ffmpeg-mux/ffmpeg-mux.c: In function 'create_video_stream': /tmp/B.Ey4Kql/BUILD/obs-studio-21.0.1/plugins/obs-ffmpeg/ffmpeg-mux/ffmpeg-mux.c:307:2: warning: 'codec' is deprecated [-Wdeprecated-declarations] context = ffm->video_stream->codec; ^~~~~~~ In file included from /tmp/B.Ey4Kql/BUILD/obs-studio-21.0.1/plugins/obs-ffmpeg/ffmpeg-mux/ffmpeg-mux.c:30: /usr/include/libavformat/avformat.h:885:21: note: declared here AVCodecContext *codec; ^~~~~ /tmp/B.Ey4Kql/BUILD/obs-studio-21.0.1/plugins/obs-ffmpeg/ffmpeg-mux/ffmpeg-mux.c: In function 'create_audio_stream': /tmp/B.Ey4Kql/BUILD/obs-studio-21.0.1/plugins/obs-ffmpeg/ffmpeg-mux/ffmpeg-mux.c:345:2: warning: 'codec' is deprecated [-Wdeprecated-declarations] context = stream->codec; ^~~~~~~ In file included from /tmp/B.Ey4Kql/BUILD/obs-studio-21.0.1/plugins/obs-ffmpeg/ffmpeg-mux/ffmpeg-mux.c:30: /usr/include/libavformat/avformat.h:885:21: note: declared here AVCodecContext *codec; ^~~~~ /tmp/B.Ey4Kql/BUILD/obs-studio-21.0.1/plugins/obs-ffmpeg/ffmpeg-mux/ffmpeg-mux.c: In function 'open_output_file': /tmp/B.Ey4Kql/BUILD/obs-studio-21.0.1/plugins/obs-ffmpeg/ffmpeg-mux/ffmpeg-mux.c:477:2: warning: 'filename' is deprecated [-Wdeprecated-declarations] strncpy(ffm->output->filename, ffm->params.file, ^~~~~~~ In file included from /tmp/B.Ey4Kql/BUILD/obs-studio-21.0.1/plugins/obs-ffmpeg/ffmpeg-mux/ffmpeg-mux.c:30: /usr/include/libavformat/avformat.h:1424:10: note: declared here char filename[1024]; ^~~~~~~~ /tmp/B.Ey4Kql/BUILD/obs-studio-21.0.1/plugins/obs-ffmpeg/ffmpeg-mux/ffmpeg-mux.c:478:4: warning: 'filename' is deprecated [-Wdeprecated-declarations] sizeof(ffm->output->filename)); ^~~~~~ In file included from /tmp/B.Ey4Kql/BUILD/obs-studio-21.0.1/plugins/obs-ffmpeg/ffmpeg-mux/ffmpeg-mux.c:30: /usr/include/libavformat/avformat.h:1424:10: note: declared here char filename[1024]; ^~~~~~~~ /tmp/B.Ey4Kql/BUILD/obs-studio-21.0.1/plugins/obs-ffmpeg/ffmpeg-mux/ffmpeg-mux.c:479:2: warning: 'filename' is deprecated [-Wdeprecated-declarations] ffm->output->filename[sizeof(ffm->output->filename) - 1] = 0; ^~~ In file included from /tmp/B.Ey4Kql/BUILD/obs-studio-21.0.1/plugins/obs-ffmpeg/ffmpeg-mux/ffmpeg-mux.c:30: /usr/include/libavformat/avformat.h:1424:10: note: declared here char filename[1024]; ^~~~~~~~ /tmp/B.Ey4Kql/BUILD/obs-studio-21.0.1/plugins/obs-ffmpeg/ffmpeg-mux/ffmpeg-mux.c:479:2: warning: 'filename' is deprecated [-Wdeprecated-declarations] ffm->output->filename[sizeof(ffm->output->filename) - 1] = 0; ^~~ In file included from /tmp/B.Ey4Kql/BUILD/obs-studio-21.0.1/plugins/obs-ffmpeg/ffmpeg-mux/ffmpeg-mux.c:30: /usr/include/libavformat/avformat.h:1424:10: note: declared here char filename[1024]; ^~~~~~~~ /tmp/B.Ey4Kql/BUILD/obs-studio-21.0.1/plugins/obs-ffmpeg/ffmpeg-mux/ffmpeg-mux.c: In function 'ffmpeg_mux_init_internal': /tmp/B.Ey4Kql/BUILD/obs-studio-21.0.1/plugins/obs-ffmpeg/ffmpeg-mux/ffmpeg-mux.c:566:2: warning: 'av_register_all' is deprecated [-Wdeprecated-declarations] av_register_all(); ^~~~~~~~~~~~~~~ In file included from /tmp/B.Ey4Kql/BUILD/obs-studio-21.0.1/plugins/obs-ffmpeg/ffmpeg-mux/ffmpeg-mux.c:30: /usr/include/libavformat/avformat.h:2050:6: note: declared here void av_register_all(void); ^~~~~~~~~~~~~~~ /tmp/B.Ey4Kql/BUILD/obs-studio-21.0.1/plugins/obs-ffmpeg/ffmpeg-mux/ffmpeg-mux.c: In function 'rescale_ts': /tmp/B.Ey4Kql/BUILD/obs-studio-21.0.1/plugins/obs-ffmpeg/ffmpeg-mux/ffmpeg-mux.c:613:2: warning: 'codec' is deprecated [-Wdeprecated-declarations] return av_rescale_q_rnd(val / stream->codec->time_base.num, ^~~~~~ In file included from /tmp/B.Ey4Kql/BUILD/obs-studio-21.0.1/plugins/obs-ffmpeg/ffmpeg-mux/ffmpeg-mux.c:30: /usr/include/libavformat/avformat.h:885:21: note: declared here AVCodecContext *codec; ^~~~~ /tmp/B.Ey4Kql/BUILD/obs-studio-21.0.1/plugins/obs-ffmpeg/ffmpeg-mux/ffmpeg-mux.c:614:4: warning: 'codec' is deprecated [-Wdeprecated-declarations] stream->codec->time_base, stream->time_base, ^~~~~~ In file included from /tmp/B.Ey4Kql/BUILD/obs-studio-21.0.1/plugins/obs-ffmpeg/ffmpeg-mux/ffmpeg-mux.c:30: /usr/include/libavformat/avformat.h:885:21: note: declared here AVCodecContext *codec; ^~~~~ make[2]: Leaving directory '/tmp/B.Ey4Kql/BUILD/obs-studio-21.0.1/build' make[2]: Entering directory '/tmp/B.Ey4Kql/BUILD/obs-studio-21.0.1/build' [ 2%] Building C object deps/media-playback/CMakeFiles/media-playback.dir/media-playback/media.c.o cd /tmp/B.Ey4Kql/BUILD/obs-studio-21.0.1/build/deps/media-playback && /usr/bin/x86_64-pld-linux-gcc -DUSE_XDG -I/tmp/B.Ey4Kql/BUILD/obs-studio-21.0.1/libobs -I/tmp/B.Ey4Kql/BUILD/obs-studio-21.0.1/deps/media-playback/. -Wall -Wextra -Wno-unused-function -Werror-implicit-function-declaration -Wno-missing-braces -Wno-missing-field-initializers -std=gnu99 -fno-strict-aliasing -O2 -fwrapv -pipe -Wformat -Werror=format-security -gdwarf-4 -fno-debug-types-section -fvar-tracking-assignments -g2 -Wp,-D_FORTIFY_SOURCE=2 -fstack-protector-strong --param=ssp-buffer-size=4 -Werror=trampolines -fPIC -march=x86-64 -gdwarf-4 -fno-debug-types-section -fvar-tracking-assignments -g2 -DNDEBUG -DQT_NO_DEBUG -mmmx -msse -msse2 -fPIC -o CMakeFiles/media-playback.dir/media-playback/media.c.o -c /tmp/B.Ey4Kql/BUILD/obs-studio-21.0.1/deps/media-playback/media-playback/media.c /tmp/B.Ey4Kql/BUILD/obs-studio-21.0.1/deps/media-playback/media-playback/media.c: In function 'mp_media_init': /tmp/B.Ey4Kql/BUILD/obs-studio-21.0.1/deps/media-playback/media-playback/media.c:707:3: warning: 'av_register_all' is deprecated [-Wdeprecated-declarations] av_register_all(); ^~~~~~~~~~~~~~~ In file included from /tmp/B.Ey4Kql/BUILD/obs-studio-21.0.1/deps/media-playback/media-playback/decode.h:31, from /tmp/B.Ey4Kql/BUILD/obs-studio-21.0.1/deps/media-playback/media-playback/media.h:20, from /tmp/B.Ey4Kql/BUILD/obs-studio-21.0.1/deps/media-playback/media-playback/media.c:22: /usr/include/libavformat/avformat.h:2050:6: note: declared here void av_register_all(void); ^~~~~~~~~~~~~~~ /tmp/B.Ey4Kql/BUILD/obs-studio-21.0.1/deps/media-playback/media-playback/media.c:709:3: warning: 'avcodec_register_all' is deprecated [-Wdeprecated-declarations] avcodec_register_all(); ^~~~~~~~~~~~~~~~~~~~ In file included from /usr/include/libavformat/avformat.h:317, from /tmp/B.Ey4Kql/BUILD/obs-studio-21.0.1/deps/media-playback/media-playback/decode.h:31, from /tmp/B.Ey4Kql/BUILD/obs-studio-21.0.1/deps/media-playback/media-playback/media.h:20, from /tmp/B.Ey4Kql/BUILD/obs-studio-21.0.1/deps/media-playback/media-playback/media.c:22: /usr/include/libavcodec/avcodec.h:4159:6: note: declared here void avcodec_register_all(void); ^~~~~~~~~~~~~~~~~~~~ make[2]: Leaving directory '/tmp/B.Ey4Kql/BUILD/obs-studio-21.0.1/build' make[2]: Entering directory '/tmp/B.Ey4Kql/BUILD/obs-studio-21.0.1/build' [ 3%] Building C object deps/media-playback/CMakeFiles/media-playback.dir/media-playback/decode.c.o cd /tmp/B.Ey4Kql/BUILD/obs-studio-21.0.1/build/deps/media-playback && /usr/bin/x86_64-pld-linux-gcc -DUSE_XDG -I/tmp/B.Ey4Kql/BUILD/obs-studio-21.0.1/libobs -I/tmp/B.Ey4Kql/BUILD/obs-studio-21.0.1/deps/media-playback/. -Wall -Wextra -Wno-unused-function -Werror-implicit-function-declaration -Wno-missing-braces -Wno-missing-field-initializers -std=gnu99 -fno-strict-aliasing -O2 -fwrapv -pipe -Wformat -Werror=format-security -gdwarf-4 -fno-debug-types-section -fvar-tracking-assignments -g2 -Wp,-D_FORTIFY_SOURCE=2 -fstack-protector-strong --param=ssp-buffer-size=4 -Werror=trampolines -fPIC -march=x86-64 -gdwarf-4 -fno-debug-types-section -fvar-tracking-assignments -g2 -DNDEBUG -DQT_NO_DEBUG -mmmx -msse -msse2 -fPIC -o CMakeFiles/media-playback.dir/media-playback/decode.c.o -c /tmp/B.Ey4Kql/BUILD/obs-studio-21.0.1/deps/media-playback/media-playback/decode.c /tmp/B.Ey4Kql/BUILD/obs-studio-21.0.1/deps/media-playback/media-playback/decode.c: In function 'find_hardware_decoder': /tmp/B.Ey4Kql/BUILD/obs-studio-21.0.1/deps/media-playback/media-playback/decode.c:22:2: warning: 'av_hwaccel_next' is deprecated [-Wdeprecated-declarations] AVHWAccel *hwa = av_hwaccel_next(NULL); ^~~~~~~~~ In file included from /usr/include/libavformat/avformat.h:317, from /tmp/B.Ey4Kql/BUILD/obs-studio-21.0.1/deps/media-playback/media-playback/decode.h:31, from /tmp/B.Ey4Kql/BUILD/obs-studio-21.0.1/deps/media-playback/media-playback/decode.c:17: /usr/include/libavcodec/avcodec.h:6120:12: note: declared here AVHWAccel *av_hwaccel_next(const AVHWAccel *hwaccel); ^~~~~~~~~~~~~~~ /tmp/B.Ey4Kql/BUILD/obs-studio-21.0.1/deps/media-playback/media-playback/decode.c:36:3: warning: 'av_hwaccel_next' is deprecated [-Wdeprecated-declarations] hwa = av_hwaccel_next(hwa); ^~~ In file included from /usr/include/libavformat/avformat.h:317, from /tmp/B.Ey4Kql/BUILD/obs-studio-21.0.1/deps/media-playback/media-playback/decode.h:31, from /tmp/B.Ey4Kql/BUILD/obs-studio-21.0.1/deps/media-playback/media-playback/decode.c:17: /usr/include/libavcodec/avcodec.h:6120:12: note: declared here AVHWAccel *av_hwaccel_next(const AVHWAccel *hwaccel); ^~~~~~~~~~~~~~~ make[2]: Leaving directory '/tmp/B.Ey4Kql/BUILD/obs-studio-21.0.1/build' make[2]: Entering directory '/tmp/B.Ey4Kql/BUILD/obs-studio-21.0.1/build' [ 4%] Building C object libobs/CMakeFiles/libobs.dir/callback/signal.c.o cd /tmp/B.Ey4Kql/BUILD/obs-studio-21.0.1/build/libobs && /usr/bin/x86_64-pld-linux-gcc -DHAVE_OBSCONFIG_H -DLIBOBS_EXPORTS -DUSE_XDG -Dlibobs_EXPORTS -I/usr/include/dbus-1.0 -I/usr/lib64/dbus-1.0/include -I/tmp/B.Ey4Kql/BUILD/obs-studio-21.0.1/libobs -I/tmp/B.Ey4Kql/BUILD/obs-studio-21.0.1/build/config -Wall -Wextra -Wno-unused-function -Werror-implicit-function-declaration -Wno-missing-braces -Wno-missing-field-initializers -std=gnu99 -fno-strict-aliasing -O2 -fwrapv -pipe -Wformat -Werror=format-security -gdwarf-4 -fno-debug-types-section -fvar-tracking-assignments -g2 -Wp,-D_FORTIFY_SOURCE=2 -fstack-protector-strong --param=ssp-buffer-size=4 -Werror=trampolines -fPIC -march=x86-64 -gdwarf-4 -fno-debug-types-section -fvar-tracking-assignments -g2 -DNDEBUG -DQT_NO_DEBUG -fPIC -mmmx -msse -msse2 -pthread -o CMakeFiles/libobs.dir/callback/signal.c.o -c /tmp/B.Ey4Kql/BUILD/obs-studio-21.0.1/libobs/callback/signal.c make[2]: Leaving directory '/tmp/B.Ey4Kql/BUILD/obs-studio-21.0.1/build' make[2]: Entering directory '/tmp/B.Ey4Kql/BUILD/obs-studio-21.0.1/build' [ 3%] Building C object deps/glad/CMakeFiles/glad.dir/src/glad_glx.c.o cd /tmp/B.Ey4Kql/BUILD/obs-studio-21.0.1/build/deps/glad && /usr/bin/x86_64-pld-linux-gcc -DGLAD_GLAPI_EXPORT_BUILD -DUSE_XDG -Dglad_EXPORTS -I/tmp/B.Ey4Kql/BUILD/obs-studio-21.0.1/deps/glad/include -Wall -Wextra -Wno-unused-function -Werror-implicit-function-declaration -Wno-missing-braces -Wno-missing-field-initializers -std=gnu99 -fno-strict-aliasing -O2 -fwrapv -pipe -Wformat -Werror=format-security -gdwarf-4 -fno-debug-types-section -fvar-tracking-assignments -g2 -Wp,-D_FORTIFY_SOURCE=2 -fstack-protector-strong --param=ssp-buffer-size=4 -Werror=trampolines -fPIC -march=x86-64 -gdwarf-4 -fno-debug-types-section -fvar-tracking-assignments -g2 -DNDEBUG -DQT_NO_DEBUG -fPIC -DPIC -fvisibility=hidden -fPIC -o CMakeFiles/glad.dir/src/glad_glx.c.o -c /tmp/B.Ey4Kql/BUILD/obs-studio-21.0.1/deps/glad/src/glad_glx.c make[2]: Leaving directory '/tmp/B.Ey4Kql/BUILD/obs-studio-21.0.1/build' make[2]: Entering directory '/tmp/B.Ey4Kql/BUILD/obs-studio-21.0.1/build' [ 4%] Linking C static library libmedia-playback.a cd /tmp/B.Ey4Kql/BUILD/obs-studio-21.0.1/build/deps/media-playback && /usr/bin/cmake -P CMakeFiles/media-playback.dir/cmake_clean_target.cmake cd /tmp/B.Ey4Kql/BUILD/obs-studio-21.0.1/build/deps/media-playback && /usr/bin/cmake -E cmake_link_script CMakeFiles/media-playback.dir/link.txt --verbose=1 /usr/bin/ar qc libmedia-playback.a CMakeFiles/media-playback.dir/media-playback/decode.c.o CMakeFiles/media-playback.dir/media-playback/media.c.o /usr/bin/ranlib libmedia-playback.a make[2]: Leaving directory '/tmp/B.Ey4Kql/BUILD/obs-studio-21.0.1/build' make[1]: Entering directory '/tmp/B.Ey4Kql/BUILD/obs-studio-21.0.1/build' [ 5%] Built target media-playback make[1]: Leaving directory '/tmp/B.Ey4Kql/BUILD/obs-studio-21.0.1/build' make[2]: Entering directory '/tmp/B.Ey4Kql/BUILD/obs-studio-21.0.1/build' [ 4%] Building C object libobs/CMakeFiles/libobs.dir/callback/proc.c.o cd /tmp/B.Ey4Kql/BUILD/obs-studio-21.0.1/build/libobs && /usr/bin/x86_64-pld-linux-gcc -DHAVE_OBSCONFIG_H -DLIBOBS_EXPORTS -DUSE_XDG -Dlibobs_EXPORTS -I/usr/include/dbus-1.0 -I/usr/lib64/dbus-1.0/include -I/tmp/B.Ey4Kql/BUILD/obs-studio-21.0.1/libobs -I/tmp/B.Ey4Kql/BUILD/obs-studio-21.0.1/build/config -Wall -Wextra -Wno-unused-function -Werror-implicit-function-declaration -Wno-missing-braces -Wno-missing-field-initializers -std=gnu99 -fno-strict-aliasing -O2 -fwrapv -pipe -Wformat -Werror=format-security -gdwarf-4 -fno-debug-types-section -fvar-tracking-assignments -g2 -Wp,-D_FORTIFY_SOURCE=2 -fstack-protector-strong --param=ssp-buffer-size=4 -Werror=trampolines -fPIC -march=x86-64 -gdwarf-4 -fno-debug-types-section -fvar-tracking-assignments -g2 -DNDEBUG -DQT_NO_DEBUG -fPIC -mmmx -msse -msse2 -pthread -o CMakeFiles/libobs.dir/callback/proc.c.o -c /tmp/B.Ey4Kql/BUILD/obs-studio-21.0.1/libobs/callback/proc.c make[2]: Leaving directory '/tmp/B.Ey4Kql/BUILD/obs-studio-21.0.1/build' make[2]: Entering directory '/tmp/B.Ey4Kql/BUILD/obs-studio-21.0.1/build' [ 3%] Building C object libobs/CMakeFiles/libobs.dir/callback/decl.c.o cd /tmp/B.Ey4Kql/BUILD/obs-studio-21.0.1/build/libobs && /usr/bin/x86_64-pld-linux-gcc -DHAVE_OBSCONFIG_H -DLIBOBS_EXPORTS -DUSE_XDG -Dlibobs_EXPORTS -I/usr/include/dbus-1.0 -I/usr/lib64/dbus-1.0/include -I/tmp/B.Ey4Kql/BUILD/obs-studio-21.0.1/libobs -I/tmp/B.Ey4Kql/BUILD/obs-studio-21.0.1/build/config -Wall -Wextra -Wno-unused-function -Werror-implicit-function-declaration -Wno-missing-braces -Wno-missing-field-initializers -std=gnu99 -fno-strict-aliasing -O2 -fwrapv -pipe -Wformat -Werror=format-security -gdwarf-4 -fno-debug-types-section -fvar-tracking-assignments -g2 -Wp,-D_FORTIFY_SOURCE=2 -fstack-protector-strong --param=ssp-buffer-size=4 -Werror=trampolines -fPIC -march=x86-64 -gdwarf-4 -fno-debug-types-section -fvar-tracking-assignments -g2 -DNDEBUG -DQT_NO_DEBUG -fPIC -mmmx -msse -msse2 -pthread -o CMakeFiles/libobs.dir/callback/decl.c.o -c /tmp/B.Ey4Kql/BUILD/obs-studio-21.0.1/libobs/callback/decl.c make[2]: Leaving directory '/tmp/B.Ey4Kql/BUILD/obs-studio-21.0.1/build' make[2]: Entering directory '/tmp/B.Ey4Kql/BUILD/obs-studio-21.0.1/build' [ 5%] Building C object libobs/CMakeFiles/libobs.dir/graphics/axisang.c.o cd /tmp/B.Ey4Kql/BUILD/obs-studio-21.0.1/build/libobs && /usr/bin/x86_64-pld-linux-gcc -DHAVE_OBSCONFIG_H -DLIBOBS_EXPORTS -DUSE_XDG -Dlibobs_EXPORTS -I/usr/include/dbus-1.0 -I/usr/lib64/dbus-1.0/include -I/tmp/B.Ey4Kql/BUILD/obs-studio-21.0.1/libobs -I/tmp/B.Ey4Kql/BUILD/obs-studio-21.0.1/build/config -Wall -Wextra -Wno-unused-function -Werror-implicit-function-declaration -Wno-missing-braces -Wno-missing-field-initializers -std=gnu99 -fno-strict-aliasing -O2 -fwrapv -pipe -Wformat -Werror=format-security -gdwarf-4 -fno-debug-types-section -fvar-tracking-assignments -g2 -Wp,-D_FORTIFY_SOURCE=2 -fstack-protector-strong --param=ssp-buffer-size=4 -Werror=trampolines -fPIC -march=x86-64 -gdwarf-4 -fno-debug-types-section -fvar-tracking-assignments -g2 -DNDEBUG -DQT_NO_DEBUG -fPIC -mmmx -msse -msse2 -pthread -o CMakeFiles/libobs.dir/graphics/axisang.c.o -c /tmp/B.Ey4Kql/BUILD/obs-studio-21.0.1/libobs/graphics/axisang.c make[2]: Leaving directory '/tmp/B.Ey4Kql/BUILD/obs-studio-21.0.1/build' make[2]: Entering directory '/tmp/B.Ey4Kql/BUILD/obs-studio-21.0.1/build' [ 4%] Building C object libobs/CMakeFiles/libobs.dir/graphics/graphics-ffmpeg.c.o cd /tmp/B.Ey4Kql/BUILD/obs-studio-21.0.1/build/libobs && /usr/bin/x86_64-pld-linux-gcc -DHAVE_OBSCONFIG_H -DLIBOBS_EXPORTS -DUSE_XDG -Dlibobs_EXPORTS -I/usr/include/dbus-1.0 -I/usr/lib64/dbus-1.0/include -I/tmp/B.Ey4Kql/BUILD/obs-studio-21.0.1/libobs -I/tmp/B.Ey4Kql/BUILD/obs-studio-21.0.1/build/config -Wall -Wextra -Wno-unused-function -Werror-implicit-function-declaration -Wno-missing-braces -Wno-missing-field-initializers -std=gnu99 -fno-strict-aliasing -O2 -fwrapv -pipe -Wformat -Werror=format-security -gdwarf-4 -fno-debug-types-section -fvar-tracking-assignments -g2 -Wp,-D_FORTIFY_SOURCE=2 -fstack-protector-strong --param=ssp-buffer-size=4 -Werror=trampolines -fPIC -march=x86-64 -gdwarf-4 -fno-debug-types-section -fvar-tracking-assignments -g2 -DNDEBUG -DQT_NO_DEBUG -fPIC -mmmx -msse -msse2 -pthread -o CMakeFiles/libobs.dir/graphics/graphics-ffmpeg.c.o -c /tmp/B.Ey4Kql/BUILD/obs-studio-21.0.1/libobs/graphics/graphics-ffmpeg.c /tmp/B.Ey4Kql/BUILD/obs-studio-21.0.1/libobs/graphics/graphics-ffmpeg.c: In function 'ffmpeg_image_open_decoder_context': /tmp/B.Ey4Kql/BUILD/obs-studio-21.0.1/libobs/graphics/graphics-ffmpeg.c:33:2: warning: 'codec' is deprecated [-Wdeprecated-declarations] info->decoder_ctx = info->stream->codec; ^~~~ In file included from /tmp/B.Ey4Kql/BUILD/obs-studio-21.0.1/libobs/graphics/graphics-ffmpeg.c:4: /usr/include/libavformat/avformat.h:885:21: note: declared here AVCodecContext *codec; ^~~~~ /tmp/B.Ey4Kql/BUILD/obs-studio-21.0.1/libobs/graphics/graphics-ffmpeg.c: In function 'gs_init_image_deps': /tmp/B.Ey4Kql/BUILD/obs-studio-21.0.1/libobs/graphics/graphics-ffmpeg.c:197:2: warning: 'av_register_all' is deprecated [-Wdeprecated-declarations] av_register_all(); ^~~~~~~~~~~~~~~ In file included from /tmp/B.Ey4Kql/BUILD/obs-studio-21.0.1/libobs/graphics/graphics-ffmpeg.c:4: /usr/include/libavformat/avformat.h:2050:6: note: declared here void av_register_all(void); ^~~~~~~~~~~~~~~ make[2]: Leaving directory '/tmp/B.Ey4Kql/BUILD/obs-studio-21.0.1/build' make[2]: Entering directory '/tmp/B.Ey4Kql/BUILD/obs-studio-21.0.1/build' [ 5%] Building C object libobs/CMakeFiles/libobs.dir/graphics/quat.c.o cd /tmp/B.Ey4Kql/BUILD/obs-studio-21.0.1/build/libobs && /usr/bin/x86_64-pld-linux-gcc -DHAVE_OBSCONFIG_H -DLIBOBS_EXPORTS -DUSE_XDG -Dlibobs_EXPORTS -I/usr/include/dbus-1.0 -I/usr/lib64/dbus-1.0/include -I/tmp/B.Ey4Kql/BUILD/obs-studio-21.0.1/libobs -I/tmp/B.Ey4Kql/BUILD/obs-studio-21.0.1/build/config -Wall -Wextra -Wno-unused-function -Werror-implicit-function-declaration -Wno-missing-braces -Wno-missing-field-initializers -std=gnu99 -fno-strict-aliasing -O2 -fwrapv -pipe -Wformat -Werror=format-security -gdwarf-4 -fno-debug-types-section -fvar-tracking-assignments -g2 -Wp,-D_FORTIFY_SOURCE=2 -fstack-protector-strong --param=ssp-buffer-size=4 -Werror=trampolines -fPIC -march=x86-64 -gdwarf-4 -fno-debug-types-section -fvar-tracking-assignments -g2 -DNDEBUG -DQT_NO_DEBUG -fPIC -mmmx -msse -msse2 -pthread -o CMakeFiles/libobs.dir/graphics/quat.c.o -c /tmp/B.Ey4Kql/BUILD/obs-studio-21.0.1/libobs/graphics/quat.c make[2]: Leaving directory '/tmp/B.Ey4Kql/BUILD/obs-studio-21.0.1/build' make[2]: Entering directory '/tmp/B.Ey4Kql/BUILD/obs-studio-21.0.1/build' [ 6%] Building C object libobs/CMakeFiles/libobs.dir/graphics/vec4.c.o cd /tmp/B.Ey4Kql/BUILD/obs-studio-21.0.1/build/libobs && /usr/bin/x86_64-pld-linux-gcc -DHAVE_OBSCONFIG_H -DLIBOBS_EXPORTS -DUSE_XDG -Dlibobs_EXPORTS -I/usr/include/dbus-1.0 -I/usr/lib64/dbus-1.0/include -I/tmp/B.Ey4Kql/BUILD/obs-studio-21.0.1/libobs -I/tmp/B.Ey4Kql/BUILD/obs-studio-21.0.1/build/config -Wall -Wextra -Wno-unused-function -Werror-implicit-function-declaration -Wno-missing-braces -Wno-missing-field-initializers -std=gnu99 -fno-strict-aliasing -O2 -fwrapv -pipe -Wformat -Werror=format-security -gdwarf-4 -fno-debug-types-section -fvar-tracking-assignments -g2 -Wp,-D_FORTIFY_SOURCE=2 -fstack-protector-strong --param=ssp-buffer-size=4 -Werror=trampolines -fPIC -march=x86-64 -gdwarf-4 -fno-debug-types-section -fvar-tracking-assignments -g2 -DNDEBUG -DQT_NO_DEBUG -fPIC -mmmx -msse -msse2 -pthread -o CMakeFiles/libobs.dir/graphics/vec4.c.o -c /tmp/B.Ey4Kql/BUILD/obs-studio-21.0.1/libobs/graphics/vec4.c make[2]: Leaving directory '/tmp/B.Ey4Kql/BUILD/obs-studio-21.0.1/build' make[2]: Entering directory '/tmp/B.Ey4Kql/BUILD/obs-studio-21.0.1/build' [ 6%] Building C object libobs/CMakeFiles/libobs.dir/graphics/vec2.c.o cd /tmp/B.Ey4Kql/BUILD/obs-studio-21.0.1/build/libobs && /usr/bin/x86_64-pld-linux-gcc -DHAVE_OBSCONFIG_H -DLIBOBS_EXPORTS -DUSE_XDG -Dlibobs_EXPORTS -I/usr/include/dbus-1.0 -I/usr/lib64/dbus-1.0/include -I/tmp/B.Ey4Kql/BUILD/obs-studio-21.0.1/libobs -I/tmp/B.Ey4Kql/BUILD/obs-studio-21.0.1/build/config -Wall -Wextra -Wno-unused-function -Werror-implicit-function-declaration -Wno-missing-braces -Wno-missing-field-initializers -std=gnu99 -fno-strict-aliasing -O2 -fwrapv -pipe -Wformat -Werror=format-security -gdwarf-4 -fno-debug-types-section -fvar-tracking-assignments -g2 -Wp,-D_FORTIFY_SOURCE=2 -fstack-protector-strong --param=ssp-buffer-size=4 -Werror=trampolines -fPIC -march=x86-64 -gdwarf-4 -fno-debug-types-section -fvar-tracking-assignments -g2 -DNDEBUG -DQT_NO_DEBUG -fPIC -mmmx -msse -msse2 -pthread -o CMakeFiles/libobs.dir/graphics/vec2.c.o -c /tmp/B.Ey4Kql/BUILD/obs-studio-21.0.1/libobs/graphics/vec2.c make[2]: Leaving directory '/tmp/B.Ey4Kql/BUILD/obs-studio-21.0.1/build' make[2]: Entering directory '/tmp/B.Ey4Kql/BUILD/obs-studio-21.0.1/build' [ 7%] Building C object libobs/CMakeFiles/libobs.dir/graphics/texture-render.c.o cd /tmp/B.Ey4Kql/BUILD/obs-studio-21.0.1/build/libobs && /usr/bin/x86_64-pld-linux-gcc -DHAVE_OBSCONFIG_H -DLIBOBS_EXPORTS -DUSE_XDG -Dlibobs_EXPORTS -I/usr/include/dbus-1.0 -I/usr/lib64/dbus-1.0/include -I/tmp/B.Ey4Kql/BUILD/obs-studio-21.0.1/libobs -I/tmp/B.Ey4Kql/BUILD/obs-studio-21.0.1/build/config -Wall -Wextra -Wno-unused-function -Werror-implicit-function-declaration -Wno-missing-braces -Wno-missing-field-initializers -std=gnu99 -fno-strict-aliasing -O2 -fwrapv -pipe -Wformat -Werror=format-security -gdwarf-4 -fno-debug-types-section -fvar-tracking-assignments -g2 -Wp,-D_FORTIFY_SOURCE=2 -fstack-protector-strong --param=ssp-buffer-size=4 -Werror=trampolines -fPIC -march=x86-64 -gdwarf-4 -fno-debug-types-section -fvar-tracking-assignments -g2 -DNDEBUG -DQT_NO_DEBUG -fPIC -mmmx -msse -msse2 -pthread -o CMakeFiles/libobs.dir/graphics/texture-render.c.o -c /tmp/B.Ey4Kql/BUILD/obs-studio-21.0.1/libobs/graphics/texture-render.c make[2]: Leaving directory '/tmp/B.Ey4Kql/BUILD/obs-studio-21.0.1/build' make[2]: Entering directory '/tmp/B.Ey4Kql/BUILD/obs-studio-21.0.1/build' [ 7%] Building C object libobs/CMakeFiles/libobs.dir/graphics/image-file.c.o cd /tmp/B.Ey4Kql/BUILD/obs-studio-21.0.1/build/libobs && /usr/bin/x86_64-pld-linux-gcc -DHAVE_OBSCONFIG_H -DLIBOBS_EXPORTS -DUSE_XDG -Dlibobs_EXPORTS -I/usr/include/dbus-1.0 -I/usr/lib64/dbus-1.0/include -I/tmp/B.Ey4Kql/BUILD/obs-studio-21.0.1/libobs -I/tmp/B.Ey4Kql/BUILD/obs-studio-21.0.1/build/config -Wall -Wextra -Wno-unused-function -Werror-implicit-function-declaration -Wno-missing-braces -Wno-missing-field-initializers -std=gnu99 -fno-strict-aliasing -O2 -fwrapv -pipe -Wformat -Werror=format-security -gdwarf-4 -fno-debug-types-section -fvar-tracking-assignments -g2 -Wp,-D_FORTIFY_SOURCE=2 -fstack-protector-strong --param=ssp-buffer-size=4 -Werror=trampolines -fPIC -march=x86-64 -gdwarf-4 -fno-debug-types-section -fvar-tracking-assignments -g2 -DNDEBUG -DQT_NO_DEBUG -fPIC -mmmx -msse -msse2 -pthread -o CMakeFiles/libobs.dir/graphics/image-file.c.o -c /tmp/B.Ey4Kql/BUILD/obs-studio-21.0.1/libobs/graphics/image-file.c make[2]: Leaving directory '/tmp/B.Ey4Kql/BUILD/obs-studio-21.0.1/build' make[2]: Entering directory '/tmp/B.Ey4Kql/BUILD/obs-studio-21.0.1/build' [ 7%] Building C object libobs/CMakeFiles/libobs.dir/graphics/bounds.c.o cd /tmp/B.Ey4Kql/BUILD/obs-studio-21.0.1/build/libobs && /usr/bin/x86_64-pld-linux-gcc -DHAVE_OBSCONFIG_H -DLIBOBS_EXPORTS -DUSE_XDG -Dlibobs_EXPORTS -I/usr/include/dbus-1.0 -I/usr/lib64/dbus-1.0/include -I/tmp/B.Ey4Kql/BUILD/obs-studio-21.0.1/libobs -I/tmp/B.Ey4Kql/BUILD/obs-studio-21.0.1/build/config -Wall -Wextra -Wno-unused-function -Werror-implicit-function-declaration -Wno-missing-braces -Wno-missing-field-initializers -std=gnu99 -fno-strict-aliasing -O2 -fwrapv -pipe -Wformat -Werror=format-security -gdwarf-4 -fno-debug-types-section -fvar-tracking-assignments -g2 -Wp,-D_FORTIFY_SOURCE=2 -fstack-protector-strong --param=ssp-buffer-size=4 -Werror=trampolines -fPIC -march=x86-64 -gdwarf-4 -fno-debug-types-section -fvar-tracking-assignments -g2 -DNDEBUG -DQT_NO_DEBUG -fPIC -mmmx -msse -msse2 -pthread -o CMakeFiles/libobs.dir/graphics/bounds.c.o -c /tmp/B.Ey4Kql/BUILD/obs-studio-21.0.1/libobs/graphics/bounds.c make[2]: Leaving directory '/tmp/B.Ey4Kql/BUILD/obs-studio-21.0.1/build' make[2]: Entering directory '/tmp/B.Ey4Kql/BUILD/obs-studio-21.0.1/build' [ 4%] Linking C executable ffmpeg-mux cd /tmp/B.Ey4Kql/BUILD/obs-studio-21.0.1/build/plugins/obs-ffmpeg/ffmpeg-mux && /usr/bin/cmake -E cmake_link_script CMakeFiles/ffmpeg-mux.dir/link.txt --verbose=1 /usr/bin/x86_64-pld-linux-gcc -Wall -Wextra -Wno-unused-function -Werror-implicit-function-declaration -Wno-missing-braces -Wno-missing-field-initializers -std=gnu99 -fno-strict-aliasing -O2 -fwrapv -pipe -Wformat -Werror=format-security -gdwarf-4 -fno-debug-types-section -fvar-tracking-assignments -g2 -Wp,-D_FORTIFY_SOURCE=2 -fstack-protector-strong --param=ssp-buffer-size=4 -Werror=trampolines -fPIC -march=x86-64 -gdwarf-4 -fno-debug-types-section -fvar-tracking-assignments -g2 -DNDEBUG -DQT_NO_DEBUG -Wl,--as-needed -Wl,--no-copy-dt-needed-entries -Wl,-z,relro -Wl,-z,combreloc -rdynamic CMakeFiles/ffmpeg-mux.dir/ffmpeg-mux.c.o -o ffmpeg-mux /usr/bin/../lib64/libavcodec.so /usr/bin/../lib64/libavutil.so /usr/bin/../lib64/libavformat.so cd /tmp/B.Ey4Kql/BUILD/obs-studio-21.0.1/build/plugins/obs-ffmpeg/ffmpeg-mux && /usr/bin/cmake -E copy /tmp/B.Ey4Kql/BUILD/obs-studio-21.0.1/build/plugins/obs-ffmpeg/ffmpeg-mux/ffmpeg-mux /tmp/B.Ey4Kql/BUILD/obs-studio-21.0.1/build/rundir/PLD/data/obs-plugins/obs-ffmpeg/ffmpeg-mux make[2]: Leaving directory '/tmp/B.Ey4Kql/BUILD/obs-studio-21.0.1/build' make[2]: Entering directory '/tmp/B.Ey4Kql/BUILD/obs-studio-21.0.1/build' [ 8%] Building C object libobs/CMakeFiles/libobs.dir/graphics/matrix3.c.o cd /tmp/B.Ey4Kql/BUILD/obs-studio-21.0.1/build/libobs && /usr/bin/x86_64-pld-linux-gcc -DHAVE_OBSCONFIG_H -DLIBOBS_EXPORTS -DUSE_XDG -Dlibobs_EXPORTS -I/usr/include/dbus-1.0 -I/usr/lib64/dbus-1.0/include -I/tmp/B.Ey4Kql/BUILD/obs-studio-21.0.1/libobs -I/tmp/B.Ey4Kql/BUILD/obs-studio-21.0.1/build/config -Wall -Wextra -Wno-unused-function -Werror-implicit-function-declaration -Wno-missing-braces -Wno-missing-field-initializers -std=gnu99 -fno-strict-aliasing -O2 -fwrapv -pipe -Wformat -Werror=format-security -gdwarf-4 -fno-debug-types-section -fvar-tracking-assignments -g2 -Wp,-D_FORTIFY_SOURCE=2 -fstack-protector-strong --param=ssp-buffer-size=4 -Werror=trampolines -fPIC -march=x86-64 -gdwarf-4 -fno-debug-types-section -fvar-tracking-assignments -g2 -DNDEBUG -DQT_NO_DEBUG -fPIC -mmmx -msse -msse2 -pthread -o CMakeFiles/libobs.dir/graphics/matrix3.c.o -c /tmp/B.Ey4Kql/BUILD/obs-studio-21.0.1/libobs/graphics/matrix3.c make[2]: Leaving directory '/tmp/B.Ey4Kql/BUILD/obs-studio-21.0.1/build' make[1]: Entering directory '/tmp/B.Ey4Kql/BUILD/obs-studio-21.0.1/build' [ 8%] Built target ffmpeg-mux make[1]: Leaving directory '/tmp/B.Ey4Kql/BUILD/obs-studio-21.0.1/build' make[2]: Entering directory '/tmp/B.Ey4Kql/BUILD/obs-studio-21.0.1/build' [ 6%] Building C object libobs/CMakeFiles/libobs.dir/graphics/libnsgif/libnsgif.c.o cd /tmp/B.Ey4Kql/BUILD/obs-studio-21.0.1/build/libobs && /usr/bin/x86_64-pld-linux-gcc -DHAVE_OBSCONFIG_H -DLIBOBS_EXPORTS -DUSE_XDG -Dlibobs_EXPORTS -I/usr/include/dbus-1.0 -I/usr/lib64/dbus-1.0/include -I/tmp/B.Ey4Kql/BUILD/obs-studio-21.0.1/libobs -I/tmp/B.Ey4Kql/BUILD/obs-studio-21.0.1/build/config -Wall -Wextra -Wno-unused-function -Werror-implicit-function-declaration -Wno-missing-braces -Wno-missing-field-initializers -std=gnu99 -fno-strict-aliasing -O2 -fwrapv -pipe -Wformat -Werror=format-security -gdwarf-4 -fno-debug-types-section -fvar-tracking-assignments -g2 -Wp,-D_FORTIFY_SOURCE=2 -fstack-protector-strong --param=ssp-buffer-size=4 -Werror=trampolines -fPIC -march=x86-64 -gdwarf-4 -fno-debug-types-section -fvar-tracking-assignments -g2 -DNDEBUG -DQT_NO_DEBUG -fPIC -mmmx -msse -msse2 -pthread -o CMakeFiles/libobs.dir/graphics/libnsgif/libnsgif.c.o -c /tmp/B.Ey4Kql/BUILD/obs-studio-21.0.1/libobs/graphics/libnsgif/libnsgif.c make[2]: Leaving directory '/tmp/B.Ey4Kql/BUILD/obs-studio-21.0.1/build' make[2]: Entering directory '/tmp/B.Ey4Kql/BUILD/obs-studio-21.0.1/build' [ 8%] Building C object libobs/CMakeFiles/libobs.dir/graphics/vec3.c.o cd /tmp/B.Ey4Kql/BUILD/obs-studio-21.0.1/build/libobs && /usr/bin/x86_64-pld-linux-gcc -DHAVE_OBSCONFIG_H -DLIBOBS_EXPORTS -DUSE_XDG -Dlibobs_EXPORTS -I/usr/include/dbus-1.0 -I/usr/lib64/dbus-1.0/include -I/tmp/B.Ey4Kql/BUILD/obs-studio-21.0.1/libobs -I/tmp/B.Ey4Kql/BUILD/obs-studio-21.0.1/build/config -Wall -Wextra -Wno-unused-function -Werror-implicit-function-declaration -Wno-missing-braces -Wno-missing-field-initializers -std=gnu99 -fno-strict-aliasing -O2 -fwrapv -pipe -Wformat -Werror=format-security -gdwarf-4 -fno-debug-types-section -fvar-tracking-assignments -g2 -Wp,-D_FORTIFY_SOURCE=2 -fstack-protector-strong --param=ssp-buffer-size=4 -Werror=trampolines -fPIC -march=x86-64 -gdwarf-4 -fno-debug-types-section -fvar-tracking-assignments -g2 -DNDEBUG -DQT_NO_DEBUG -fPIC -mmmx -msse -msse2 -pthread -o CMakeFiles/libobs.dir/graphics/vec3.c.o -c /tmp/B.Ey4Kql/BUILD/obs-studio-21.0.1/libobs/graphics/vec3.c make[2]: Leaving directory '/tmp/B.Ey4Kql/BUILD/obs-studio-21.0.1/build' make[2]: Entering directory '/tmp/B.Ey4Kql/BUILD/obs-studio-21.0.1/build' [ 8%] Building C object libobs/CMakeFiles/libobs.dir/graphics/matrix4.c.o cd /tmp/B.Ey4Kql/BUILD/obs-studio-21.0.1/build/libobs && /usr/bin/x86_64-pld-linux-gcc -DHAVE_OBSCONFIG_H -DLIBOBS_EXPORTS -DUSE_XDG -Dlibobs_EXPORTS -I/usr/include/dbus-1.0 -I/usr/lib64/dbus-1.0/include -I/tmp/B.Ey4Kql/BUILD/obs-studio-21.0.1/libobs -I/tmp/B.Ey4Kql/BUILD/obs-studio-21.0.1/build/config -Wall -Wextra -Wno-unused-function -Werror-implicit-function-declaration -Wno-missing-braces -Wno-missing-field-initializers -std=gnu99 -fno-strict-aliasing -O2 -fwrapv -pipe -Wformat -Werror=format-security -gdwarf-4 -fno-debug-types-section -fvar-tracking-assignments -g2 -Wp,-D_FORTIFY_SOURCE=2 -fstack-protector-strong --param=ssp-buffer-size=4 -Werror=trampolines -fPIC -march=x86-64 -gdwarf-4 -fno-debug-types-section -fvar-tracking-assignments -g2 -DNDEBUG -DQT_NO_DEBUG -fPIC -mmmx -msse -msse2 -pthread -o CMakeFiles/libobs.dir/graphics/matrix4.c.o -c /tmp/B.Ey4Kql/BUILD/obs-studio-21.0.1/libobs/graphics/matrix4.c make[2]: Leaving directory '/tmp/B.Ey4Kql/BUILD/obs-studio-21.0.1/build' make[2]: Entering directory '/tmp/B.Ey4Kql/BUILD/obs-studio-21.0.1/build' [ 10%] Building C object libobs/CMakeFiles/libobs.dir/graphics/math-extra.c.o cd /tmp/B.Ey4Kql/BUILD/obs-studio-21.0.1/build/libobs && /usr/bin/x86_64-pld-linux-gcc -DHAVE_OBSCONFIG_H -DLIBOBS_EXPORTS -DUSE_XDG -Dlibobs_EXPORTS -I/usr/include/dbus-1.0 -I/usr/lib64/dbus-1.0/include -I/tmp/B.Ey4Kql/BUILD/obs-studio-21.0.1/libobs -I/tmp/B.Ey4Kql/BUILD/obs-studio-21.0.1/build/config -Wall -Wextra -Wno-unused-function -Werror-implicit-function-declaration -Wno-missing-braces -Wno-missing-field-initializers -std=gnu99 -fno-strict-aliasing -O2 -fwrapv -pipe -Wformat -Werror=format-security -gdwarf-4 -fno-debug-types-section -fvar-tracking-assignments -g2 -Wp,-D_FORTIFY_SOURCE=2 -fstack-protector-strong --param=ssp-buffer-size=4 -Werror=trampolines -fPIC -march=x86-64 -gdwarf-4 -fno-debug-types-section -fvar-tracking-assignments -g2 -DNDEBUG -DQT_NO_DEBUG -fPIC -mmmx -msse -msse2 -pthread -o CMakeFiles/libobs.dir/graphics/math-extra.c.o -c /tmp/B.Ey4Kql/BUILD/obs-studio-21.0.1/libobs/graphics/math-extra.c make[2]: Leaving directory '/tmp/B.Ey4Kql/BUILD/obs-studio-21.0.1/build' make[2]: Entering directory '/tmp/B.Ey4Kql/BUILD/obs-studio-21.0.1/build' [ 9%] Building C object libobs/CMakeFiles/libobs.dir/graphics/plane.c.o cd /tmp/B.Ey4Kql/BUILD/obs-studio-21.0.1/build/libobs && /usr/bin/x86_64-pld-linux-gcc -DHAVE_OBSCONFIG_H -DLIBOBS_EXPORTS -DUSE_XDG -Dlibobs_EXPORTS -I/usr/include/dbus-1.0 -I/usr/lib64/dbus-1.0/include -I/tmp/B.Ey4Kql/BUILD/obs-studio-21.0.1/libobs -I/tmp/B.Ey4Kql/BUILD/obs-studio-21.0.1/build/config -Wall -Wextra -Wno-unused-function -Werror-implicit-function-declaration -Wno-missing-braces -Wno-missing-field-initializers -std=gnu99 -fno-strict-aliasing -O2 -fwrapv -pipe -Wformat -Werror=format-security -gdwarf-4 -fno-debug-types-section -fvar-tracking-assignments -g2 -Wp,-D_FORTIFY_SOURCE=2 -fstack-protector-strong --param=ssp-buffer-size=4 -Werror=trampolines -fPIC -march=x86-64 -gdwarf-4 -fno-debug-types-section -fvar-tracking-assignments -g2 -DNDEBUG -DQT_NO_DEBUG -fPIC -mmmx -msse -msse2 -pthread -o CMakeFiles/libobs.dir/graphics/plane.c.o -c /tmp/B.Ey4Kql/BUILD/obs-studio-21.0.1/libobs/graphics/plane.c make[2]: Leaving directory '/tmp/B.Ey4Kql/BUILD/obs-studio-21.0.1/build' make[2]: Entering directory '/tmp/B.Ey4Kql/BUILD/obs-studio-21.0.1/build' [ 3%] Swig compile obslua.i for lua cd /tmp/B.Ey4Kql/BUILD/obs-studio-21.0.1/build/deps/obs-scripting/obslua && /usr/bin/cmake -E make_directory /tmp/B.Ey4Kql/BUILD/obs-studio-21.0.1/build/deps/obs-scripting/obslua /tmp/B.Ey4Kql/BUILD/obs-studio-21.0.1/build/deps/obs-scripting/obslua/CMakeFiles/obslua.dir cd /tmp/B.Ey4Kql/BUILD/obs-studio-21.0.1/build/deps/obs-scripting/obslua && /usr/bin/cmake -E touch /tmp/B.Ey4Kql/BUILD/obs-studio-21.0.1/build/deps/obs-scripting/obslua/CMakeFiles/obslua.dir/obsluaLUA.stamp cd /tmp/B.Ey4Kql/BUILD/obs-studio-21.0.1/build/deps/obs-scripting/obslua && /usr/bin/cmake -E env SWIG_LIB=/usr/share/swig/3.0.12 /usr/bin/swig -lua -outdir /tmp/B.Ey4Kql/BUILD/obs-studio-21.0.1/build/deps/obs-scripting/obslua -I/tmp/B.Ey4Kql/BUILD/obs-studio-21.0.1/UI/obs-frontend-api -I/tmp/B.Ey4Kql/BUILD/obs-studio-21.0.1/libobs -I/tmp/B.Ey4Kql/BUILD/obs-studio-21.0.1/deps/obs-scripting -I/tmp/B.Ey4Kql/BUILD/obs-studio-21.0.1/build/deps/obs-scripting -I/usr/include/python3.7m -I/usr/include/luajit-2.0 -I/tmp/B.Ey4Kql/BUILD/obs-studio-21.0.1/deps/obs-scripting/obslua -o /tmp/B.Ey4Kql/BUILD/obs-studio-21.0.1/build/deps/obs-scripting/obslua/CMakeFiles/obslua.dir/obsluaLUA_wrap.c /tmp/B.Ey4Kql/BUILD/obs-studio-21.0.1/deps/obs-scripting/obslua/obslua.i make[2]: Leaving directory '/tmp/B.Ey4Kql/BUILD/obs-studio-21.0.1/build' make[1]: Entering directory '/tmp/B.Ey4Kql/BUILD/obs-studio-21.0.1/build' [ 11%] Built target obslua_swig_compilation make[1]: Leaving directory '/tmp/B.Ey4Kql/BUILD/obs-studio-21.0.1/build' make[2]: Entering directory '/tmp/B.Ey4Kql/BUILD/obs-studio-21.0.1/build' [ 11%] Building C object libobs/CMakeFiles/libobs.dir/media-io/video-fourcc.c.o cd /tmp/B.Ey4Kql/BUILD/obs-studio-21.0.1/build/libobs && /usr/bin/x86_64-pld-linux-gcc -DHAVE_OBSCONFIG_H -DLIBOBS_EXPORTS -DUSE_XDG -Dlibobs_EXPORTS -I/usr/include/dbus-1.0 -I/usr/lib64/dbus-1.0/include -I/tmp/B.Ey4Kql/BUILD/obs-studio-21.0.1/libobs -I/tmp/B.Ey4Kql/BUILD/obs-studio-21.0.1/build/config -Wall -Wextra -Wno-unused-function -Werror-implicit-function-declaration -Wno-missing-braces -Wno-missing-field-initializers -std=gnu99 -fno-strict-aliasing -O2 -fwrapv -pipe -Wformat -Werror=format-security -gdwarf-4 -fno-debug-types-section -fvar-tracking-assignments -g2 -Wp,-D_FORTIFY_SOURCE=2 -fstack-protector-strong --param=ssp-buffer-size=4 -Werror=trampolines -fPIC -march=x86-64 -gdwarf-4 -fno-debug-types-section -fvar-tracking-assignments -g2 -DNDEBUG -DQT_NO_DEBUG -fPIC -mmmx -msse -msse2 -pthread -o CMakeFiles/libobs.dir/media-io/video-fourcc.c.o -c /tmp/B.Ey4Kql/BUILD/obs-studio-21.0.1/libobs/media-io/video-fourcc.c make[2]: Leaving directory '/tmp/B.Ey4Kql/BUILD/obs-studio-21.0.1/build' make[2]: Entering directory '/tmp/B.Ey4Kql/BUILD/obs-studio-21.0.1/build' [ 10%] Building C object libobs/CMakeFiles/libobs.dir/graphics/effect.c.o cd /tmp/B.Ey4Kql/BUILD/obs-studio-21.0.1/build/libobs && /usr/bin/x86_64-pld-linux-gcc -DHAVE_OBSCONFIG_H -DLIBOBS_EXPORTS -DUSE_XDG -Dlibobs_EXPORTS -I/usr/include/dbus-1.0 -I/usr/lib64/dbus-1.0/include -I/tmp/B.Ey4Kql/BUILD/obs-studio-21.0.1/libobs -I/tmp/B.Ey4Kql/BUILD/obs-studio-21.0.1/build/config -Wall -Wextra -Wno-unused-function -Werror-implicit-function-declaration -Wno-missing-braces -Wno-missing-field-initializers -std=gnu99 -fno-strict-aliasing -O2 -fwrapv -pipe -Wformat -Werror=format-security -gdwarf-4 -fno-debug-types-section -fvar-tracking-assignments -g2 -Wp,-D_FORTIFY_SOURCE=2 -fstack-protector-strong --param=ssp-buffer-size=4 -Werror=trampolines -fPIC -march=x86-64 -gdwarf-4 -fno-debug-types-section -fvar-tracking-assignments -g2 -DNDEBUG -DQT_NO_DEBUG -fPIC -mmmx -msse -msse2 -pthread -o CMakeFiles/libobs.dir/graphics/effect.c.o -c /tmp/B.Ey4Kql/BUILD/obs-studio-21.0.1/libobs/graphics/effect.c make[2]: Leaving directory '/tmp/B.Ey4Kql/BUILD/obs-studio-21.0.1/build' make[2]: Entering directory '/tmp/B.Ey4Kql/BUILD/obs-studio-21.0.1/build' [ 11%] Building C object libobs/CMakeFiles/libobs.dir/media-io/video-io.c.o cd /tmp/B.Ey4Kql/BUILD/obs-studio-21.0.1/build/libobs && /usr/bin/x86_64-pld-linux-gcc -DHAVE_OBSCONFIG_H -DLIBOBS_EXPORTS -DUSE_XDG -Dlibobs_EXPORTS -I/usr/include/dbus-1.0 -I/usr/lib64/dbus-1.0/include -I/tmp/B.Ey4Kql/BUILD/obs-studio-21.0.1/libobs -I/tmp/B.Ey4Kql/BUILD/obs-studio-21.0.1/build/config -Wall -Wextra -Wno-unused-function -Werror-implicit-function-declaration -Wno-missing-braces -Wno-missing-field-initializers -std=gnu99 -fno-strict-aliasing -O2 -fwrapv -pipe -Wformat -Werror=format-security -gdwarf-4 -fno-debug-types-section -fvar-tracking-assignments -g2 -Wp,-D_FORTIFY_SOURCE=2 -fstack-protector-strong --param=ssp-buffer-size=4 -Werror=trampolines -fPIC -march=x86-64 -gdwarf-4 -fno-debug-types-section -fvar-tracking-assignments -g2 -DNDEBUG -DQT_NO_DEBUG -fPIC -mmmx -msse -msse2 -pthread -o CMakeFiles/libobs.dir/media-io/video-io.c.o -c /tmp/B.Ey4Kql/BUILD/obs-studio-21.0.1/libobs/media-io/video-io.c make[2]: Leaving directory '/tmp/B.Ey4Kql/BUILD/obs-studio-21.0.1/build' make[2]: Entering directory '/tmp/B.Ey4Kql/BUILD/obs-studio-21.0.1/build' [ 10%] Building C object libobs/CMakeFiles/libobs.dir/graphics/graphics-imports.c.o cd /tmp/B.Ey4Kql/BUILD/obs-studio-21.0.1/build/libobs && /usr/bin/x86_64-pld-linux-gcc -DHAVE_OBSCONFIG_H -DLIBOBS_EXPORTS -DUSE_XDG -Dlibobs_EXPORTS -I/usr/include/dbus-1.0 -I/usr/lib64/dbus-1.0/include -I/tmp/B.Ey4Kql/BUILD/obs-studio-21.0.1/libobs -I/tmp/B.Ey4Kql/BUILD/obs-studio-21.0.1/build/config -Wall -Wextra -Wno-unused-function -Werror-implicit-function-declaration -Wno-missing-braces -Wno-missing-field-initializers -std=gnu99 -fno-strict-aliasing -O2 -fwrapv -pipe -Wformat -Werror=format-security -gdwarf-4 -fno-debug-types-section -fvar-tracking-assignments -g2 -Wp,-D_FORTIFY_SOURCE=2 -fstack-protector-strong --param=ssp-buffer-size=4 -Werror=trampolines -fPIC -march=x86-64 -gdwarf-4 -fno-debug-types-section -fvar-tracking-assignments -g2 -DNDEBUG -DQT_NO_DEBUG -fPIC -mmmx -msse -msse2 -pthread -o CMakeFiles/libobs.dir/graphics/graphics-imports.c.o -c /tmp/B.Ey4Kql/BUILD/obs-studio-21.0.1/libobs/graphics/graphics-imports.c make[2]: Leaving directory '/tmp/B.Ey4Kql/BUILD/obs-studio-21.0.1/build' make[2]: Entering directory '/tmp/B.Ey4Kql/BUILD/obs-studio-21.0.1/build' [ 11%] Building C object libobs/CMakeFiles/libobs.dir/media-io/video-matrices.c.o cd /tmp/B.Ey4Kql/BUILD/obs-studio-21.0.1/build/libobs && /usr/bin/x86_64-pld-linux-gcc -DHAVE_OBSCONFIG_H -DLIBOBS_EXPORTS -DUSE_XDG -Dlibobs_EXPORTS -I/usr/include/dbus-1.0 -I/usr/lib64/dbus-1.0/include -I/tmp/B.Ey4Kql/BUILD/obs-studio-21.0.1/libobs -I/tmp/B.Ey4Kql/BUILD/obs-studio-21.0.1/build/config -Wall -Wextra -Wno-unused-function -Werror-implicit-function-declaration -Wno-missing-braces -Wno-missing-field-initializers -std=gnu99 -fno-strict-aliasing -O2 -fwrapv -pipe -Wformat -Werror=format-security -gdwarf-4 -fno-debug-types-section -fvar-tracking-assignments -g2 -Wp,-D_FORTIFY_SOURCE=2 -fstack-protector-strong --param=ssp-buffer-size=4 -Werror=trampolines -fPIC -march=x86-64 -gdwarf-4 -fno-debug-types-section -fvar-tracking-assignments -g2 -DNDEBUG -DQT_NO_DEBUG -fPIC -mmmx -msse -msse2 -pthread -o CMakeFiles/libobs.dir/media-io/video-matrices.c.o -c /tmp/B.Ey4Kql/BUILD/obs-studio-21.0.1/libobs/media-io/video-matrices.c make[2]: Leaving directory '/tmp/B.Ey4Kql/BUILD/obs-studio-21.0.1/build' make[2]: Entering directory '/tmp/B.Ey4Kql/BUILD/obs-studio-21.0.1/build' [ 12%] Building C object libobs/CMakeFiles/libobs.dir/media-io/video-frame.c.o cd /tmp/B.Ey4Kql/BUILD/obs-studio-21.0.1/build/libobs && /usr/bin/x86_64-pld-linux-gcc -DHAVE_OBSCONFIG_H -DLIBOBS_EXPORTS -DUSE_XDG -Dlibobs_EXPORTS -I/usr/include/dbus-1.0 -I/usr/lib64/dbus-1.0/include -I/tmp/B.Ey4Kql/BUILD/obs-studio-21.0.1/libobs -I/tmp/B.Ey4Kql/BUILD/obs-studio-21.0.1/build/config -Wall -Wextra -Wno-unused-function -Werror-implicit-function-declaration -Wno-missing-braces -Wno-missing-field-initializers -std=gnu99 -fno-strict-aliasing -O2 -fwrapv -pipe -Wformat -Werror=format-security -gdwarf-4 -fno-debug-types-section -fvar-tracking-assignments -g2 -Wp,-D_FORTIFY_SOURCE=2 -fstack-protector-strong --param=ssp-buffer-size=4 -Werror=trampolines -fPIC -march=x86-64 -gdwarf-4 -fno-debug-types-section -fvar-tracking-assignments -g2 -DNDEBUG -DQT_NO_DEBUG -fPIC -mmmx -msse -msse2 -pthread -o CMakeFiles/libobs.dir/media-io/video-frame.c.o -c /tmp/B.Ey4Kql/BUILD/obs-studio-21.0.1/libobs/media-io/video-frame.c make[2]: Leaving directory '/tmp/B.Ey4Kql/BUILD/obs-studio-21.0.1/build' make[2]: Entering directory '/tmp/B.Ey4Kql/BUILD/obs-studio-21.0.1/build' [ 13%] Building C object libobs/CMakeFiles/libobs.dir/media-io/audio-resampler-ffmpeg.c.o cd /tmp/B.Ey4Kql/BUILD/obs-studio-21.0.1/build/libobs && /usr/bin/x86_64-pld-linux-gcc -DHAVE_OBSCONFIG_H -DLIBOBS_EXPORTS -DUSE_XDG -Dlibobs_EXPORTS -I/usr/include/dbus-1.0 -I/usr/lib64/dbus-1.0/include -I/tmp/B.Ey4Kql/BUILD/obs-studio-21.0.1/libobs -I/tmp/B.Ey4Kql/BUILD/obs-studio-21.0.1/build/config -Wall -Wextra -Wno-unused-function -Werror-implicit-function-declaration -Wno-missing-braces -Wno-missing-field-initializers -std=gnu99 -fno-strict-aliasing -O2 -fwrapv -pipe -Wformat -Werror=format-security -gdwarf-4 -fno-debug-types-section -fvar-tracking-assignments -g2 -Wp,-D_FORTIFY_SOURCE=2 -fstack-protector-strong --param=ssp-buffer-size=4 -Werror=trampolines -fPIC -march=x86-64 -gdwarf-4 -fno-debug-types-section -fvar-tracking-assignments -g2 -DNDEBUG -DQT_NO_DEBUG -fPIC -mmmx -msse -msse2 -pthread -o CMakeFiles/libobs.dir/media-io/audio-resampler-ffmpeg.c.o -c /tmp/B.Ey4Kql/BUILD/obs-studio-21.0.1/libobs/media-io/audio-resampler-ffmpeg.c make[2]: Leaving directory '/tmp/B.Ey4Kql/BUILD/obs-studio-21.0.1/build' make[2]: Entering directory '/tmp/B.Ey4Kql/BUILD/obs-studio-21.0.1/build' [ 13%] Building C object libobs/CMakeFiles/libobs.dir/media-io/video-scaler-ffmpeg.c.o cd /tmp/B.Ey4Kql/BUILD/obs-studio-21.0.1/build/libobs && /usr/bin/x86_64-pld-linux-gcc -DHAVE_OBSCONFIG_H -DLIBOBS_EXPORTS -DUSE_XDG -Dlibobs_EXPORTS -I/usr/include/dbus-1.0 -I/usr/lib64/dbus-1.0/include -I/tmp/B.Ey4Kql/BUILD/obs-studio-21.0.1/libobs -I/tmp/B.Ey4Kql/BUILD/obs-studio-21.0.1/build/config -Wall -Wextra -Wno-unused-function -Werror-implicit-function-declaration -Wno-missing-braces -Wno-missing-field-initializers -std=gnu99 -fno-strict-aliasing -O2 -fwrapv -pipe -Wformat -Werror=format-security -gdwarf-4 -fno-debug-types-section -fvar-tracking-assignments -g2 -Wp,-D_FORTIFY_SOURCE=2 -fstack-protector-strong --param=ssp-buffer-size=4 -Werror=trampolines -fPIC -march=x86-64 -gdwarf-4 -fno-debug-types-section -fvar-tracking-assignments -g2 -DNDEBUG -DQT_NO_DEBUG -fPIC -mmmx -msse -msse2 -pthread -o CMakeFiles/libobs.dir/media-io/video-scaler-ffmpeg.c.o -c /tmp/B.Ey4Kql/BUILD/obs-studio-21.0.1/libobs/media-io/video-scaler-ffmpeg.c make[2]: Leaving directory '/tmp/B.Ey4Kql/BUILD/obs-studio-21.0.1/build' make[2]: Entering directory '/tmp/B.Ey4Kql/BUILD/obs-studio-21.0.1/build' [ 12%] Building C object libobs/CMakeFiles/libobs.dir/media-io/format-conversion.c.o cd /tmp/B.Ey4Kql/BUILD/obs-studio-21.0.1/build/libobs && /usr/bin/x86_64-pld-linux-gcc -DHAVE_OBSCONFIG_H -DLIBOBS_EXPORTS -DUSE_XDG -Dlibobs_EXPORTS -I/usr/include/dbus-1.0 -I/usr/lib64/dbus-1.0/include -I/tmp/B.Ey4Kql/BUILD/obs-studio-21.0.1/libobs -I/tmp/B.Ey4Kql/BUILD/obs-studio-21.0.1/build/config -Wall -Wextra -Wno-unused-function -Werror-implicit-function-declaration -Wno-missing-braces -Wno-missing-field-initializers -std=gnu99 -fno-strict-aliasing -O2 -fwrapv -pipe -Wformat -Werror=format-security -gdwarf-4 -fno-debug-types-section -fvar-tracking-assignments -g2 -Wp,-D_FORTIFY_SOURCE=2 -fstack-protector-strong --param=ssp-buffer-size=4 -Werror=trampolines -fPIC -march=x86-64 -gdwarf-4 -fno-debug-types-section -fvar-tracking-assignments -g2 -DNDEBUG -DQT_NO_DEBUG -fPIC -mmmx -msse -msse2 -pthread -o CMakeFiles/libobs.dir/media-io/format-conversion.c.o -c /tmp/B.Ey4Kql/BUILD/obs-studio-21.0.1/libobs/media-io/format-conversion.c make[2]: Leaving directory '/tmp/B.Ey4Kql/BUILD/obs-studio-21.0.1/build' make[2]: Entering directory '/tmp/B.Ey4Kql/BUILD/obs-studio-21.0.1/build' [ 14%] Building C object libobs/CMakeFiles/libobs.dir/util/array-serializer.c.o cd /tmp/B.Ey4Kql/BUILD/obs-studio-21.0.1/build/libobs && /usr/bin/x86_64-pld-linux-gcc -DHAVE_OBSCONFIG_H -DLIBOBS_EXPORTS -DUSE_XDG -Dlibobs_EXPORTS -I/usr/include/dbus-1.0 -I/usr/lib64/dbus-1.0/include -I/tmp/B.Ey4Kql/BUILD/obs-studio-21.0.1/libobs -I/tmp/B.Ey4Kql/BUILD/obs-studio-21.0.1/build/config -Wall -Wextra -Wno-unused-function -Werror-implicit-function-declaration -Wno-missing-braces -Wno-missing-field-initializers -std=gnu99 -fno-strict-aliasing -O2 -fwrapv -pipe -Wformat -Werror=format-security -gdwarf-4 -fno-debug-types-section -fvar-tracking-assignments -g2 -Wp,-D_FORTIFY_SOURCE=2 -fstack-protector-strong --param=ssp-buffer-size=4 -Werror=trampolines -fPIC -march=x86-64 -gdwarf-4 -fno-debug-types-section -fvar-tracking-assignments -g2 -DNDEBUG -DQT_NO_DEBUG -fPIC -mmmx -msse -msse2 -pthread -o CMakeFiles/libobs.dir/util/array-serializer.c.o -c /tmp/B.Ey4Kql/BUILD/obs-studio-21.0.1/libobs/util/array-serializer.c make[2]: Leaving directory '/tmp/B.Ey4Kql/BUILD/obs-studio-21.0.1/build' make[2]: Entering directory '/tmp/B.Ey4Kql/BUILD/obs-studio-21.0.1/build' [ 13%] Building C object libobs/CMakeFiles/libobs.dir/media-io/media-remux.c.o cd /tmp/B.Ey4Kql/BUILD/obs-studio-21.0.1/build/libobs && /usr/bin/x86_64-pld-linux-gcc -DHAVE_OBSCONFIG_H -DLIBOBS_EXPORTS -DUSE_XDG -Dlibobs_EXPORTS -I/usr/include/dbus-1.0 -I/usr/lib64/dbus-1.0/include -I/tmp/B.Ey4Kql/BUILD/obs-studio-21.0.1/libobs -I/tmp/B.Ey4Kql/BUILD/obs-studio-21.0.1/build/config -Wall -Wextra -Wno-unused-function -Werror-implicit-function-declaration -Wno-missing-braces -Wno-missing-field-initializers -std=gnu99 -fno-strict-aliasing -O2 -fwrapv -pipe -Wformat -Werror=format-security -gdwarf-4 -fno-debug-types-section -fvar-tracking-assignments -g2 -Wp,-D_FORTIFY_SOURCE=2 -fstack-protector-strong --param=ssp-buffer-size=4 -Werror=trampolines -fPIC -march=x86-64 -gdwarf-4 -fno-debug-types-section -fvar-tracking-assignments -g2 -DNDEBUG -DQT_NO_DEBUG -fPIC -mmmx -msse -msse2 -pthread -o CMakeFiles/libobs.dir/media-io/media-remux.c.o -c /tmp/B.Ey4Kql/BUILD/obs-studio-21.0.1/libobs/media-io/media-remux.c /tmp/B.Ey4Kql/BUILD/obs-studio-21.0.1/libobs/media-io/media-remux.c: In function 'init_output': /tmp/B.Ey4Kql/BUILD/obs-studio-21.0.1/libobs/media-io/media-remux.c:88:5: warning: 'codec' is deprecated [-Wdeprecated-declarations] in_stream->codec->codec); ^~~~~~~~~ In file included from /tmp/B.Ey4Kql/BUILD/obs-studio-21.0.1/libobs/media-io/media-remux.c:24: /usr/include/libavformat/avformat.h:885:21: note: declared here AVCodecContext *codec; ^~~~~ /tmp/B.Ey4Kql/BUILD/obs-studio-21.0.1/libobs/media-io/media-remux.c:97:3: warning: 'codec' is deprecated [-Wdeprecated-declarations] ret = avcodec_parameters_from_context(par, in_stream->codec); ^~~ In file included from /tmp/B.Ey4Kql/BUILD/obs-studio-21.0.1/libobs/media-io/media-remux.c:24: /usr/include/libavformat/avformat.h:885:21: note: declared here AVCodecContext *codec; ^~~~~ /tmp/B.Ey4Kql/BUILD/obs-studio-21.0.1/libobs/media-io/media-remux.c:99:4: warning: 'codec' is deprecated [-Wdeprecated-declarations] ret = avcodec_parameters_to_context(out_stream->codec, ^~~ In file included from /tmp/B.Ey4Kql/BUILD/obs-studio-21.0.1/libobs/media-io/media-remux.c:24: /usr/include/libavformat/avformat.h:885:21: note: declared here AVCodecContext *codec; ^~~~~ /tmp/B.Ey4Kql/BUILD/obs-studio-21.0.1/libobs/media-io/media-remux.c:110:3: warning: 'codec' is deprecated [-Wdeprecated-declarations] out_stream->time_base = out_stream->codec->time_base; ^~~~~~~~~~ In file included from /tmp/B.Ey4Kql/BUILD/obs-studio-21.0.1/libobs/media-io/media-remux.c:24: /usr/include/libavformat/avformat.h:885:21: note: declared here AVCodecContext *codec; ^~~~~ /tmp/B.Ey4Kql/BUILD/obs-studio-21.0.1/libobs/media-io/media-remux.c:112:3: warning: 'codec' is deprecated [-Wdeprecated-declarations] out_stream->codec->codec_tag = 0; ^~~~~~~~~~ In file included from /tmp/B.Ey4Kql/BUILD/obs-studio-21.0.1/libobs/media-io/media-remux.c:24: /usr/include/libavformat/avformat.h:885:21: note: declared here AVCodecContext *codec; ^~~~~ /tmp/B.Ey4Kql/BUILD/obs-studio-21.0.1/libobs/media-io/media-remux.c:114:4: warning: 'codec' is deprecated [-Wdeprecated-declarations] out_stream->codec->flags |= CODEC_FLAG_GLOBAL_H; ^~~~~~~~~~ In file included from /tmp/B.Ey4Kql/BUILD/obs-studio-21.0.1/libobs/media-io/media-remux.c:24: /usr/include/libavformat/avformat.h:885:21: note: declared here AVCodecContext *codec; ^~~~~ /tmp/B.Ey4Kql/BUILD/obs-studio-21.0.1/libobs/media-io/media-remux.c: In function 'media_remux_job_create': /tmp/B.Ey4Kql/BUILD/obs-studio-21.0.1/libobs/media-io/media-remux.c:150:2: warning: 'av_register_all' is deprecated [-Wdeprecated-declarations] av_register_all(); ^~~~~~~~~~~~~~~ In file included from /tmp/B.Ey4Kql/BUILD/obs-studio-21.0.1/libobs/media-io/media-remux.c:24: /usr/include/libavformat/avformat.h:2050:6: note: declared here void av_register_all(void); ^~~~~~~~~~~~~~~ make[2]: Leaving directory '/tmp/B.Ey4Kql/BUILD/obs-studio-21.0.1/build' make[2]: Entering directory '/tmp/B.Ey4Kql/BUILD/obs-studio-21.0.1/build' [ 14%] Building C object libobs/CMakeFiles/libobs.dir/util/file-serializer.c.o cd /tmp/B.Ey4Kql/BUILD/obs-studio-21.0.1/build/libobs && /usr/bin/x86_64-pld-linux-gcc -DHAVE_OBSCONFIG_H -DLIBOBS_EXPORTS -DUSE_XDG -Dlibobs_EXPORTS -I/usr/include/dbus-1.0 -I/usr/lib64/dbus-1.0/include -I/tmp/B.Ey4Kql/BUILD/obs-studio-21.0.1/libobs -I/tmp/B.Ey4Kql/BUILD/obs-studio-21.0.1/build/config -Wall -Wextra -Wno-unused-function -Werror-implicit-function-declaration -Wno-missing-braces -Wno-missing-field-initializers -std=gnu99 -fno-strict-aliasing -O2 -fwrapv -pipe -Wformat -Werror=format-security -gdwarf-4 -fno-debug-types-section -fvar-tracking-assignments -g2 -Wp,-D_FORTIFY_SOURCE=2 -fstack-protector-strong --param=ssp-buffer-size=4 -Werror=trampolines -fPIC -march=x86-64 -gdwarf-4 -fno-debug-types-section -fvar-tracking-assignments -g2 -DNDEBUG -DQT_NO_DEBUG -fPIC -mmmx -msse -msse2 -pthread -o CMakeFiles/libobs.dir/util/file-serializer.c.o -c /tmp/B.Ey4Kql/BUILD/obs-studio-21.0.1/libobs/util/file-serializer.c make[2]: Leaving directory '/tmp/B.Ey4Kql/BUILD/obs-studio-21.0.1/build' make[2]: Entering directory '/tmp/B.Ey4Kql/BUILD/obs-studio-21.0.1/build' [ 12%] Building C object libobs/CMakeFiles/libobs.dir/media-io/audio-io.c.o cd /tmp/B.Ey4Kql/BUILD/obs-studio-21.0.1/build/libobs && /usr/bin/x86_64-pld-linux-gcc -DHAVE_OBSCONFIG_H -DLIBOBS_EXPORTS -DUSE_XDG -Dlibobs_EXPORTS -I/usr/include/dbus-1.0 -I/usr/lib64/dbus-1.0/include -I/tmp/B.Ey4Kql/BUILD/obs-studio-21.0.1/libobs -I/tmp/B.Ey4Kql/BUILD/obs-studio-21.0.1/build/config -Wall -Wextra -Wno-unused-function -Werror-implicit-function-declaration -Wno-missing-braces -Wno-missing-field-initializers -std=gnu99 -fno-strict-aliasing -O2 -fwrapv -pipe -Wformat -Werror=format-security -gdwarf-4 -fno-debug-types-section -fvar-tracking-assignments -g2 -Wp,-D_FORTIFY_SOURCE=2 -fstack-protector-strong --param=ssp-buffer-size=4 -Werror=trampolines -fPIC -march=x86-64 -gdwarf-4 -fno-debug-types-section -fvar-tracking-assignments -g2 -DNDEBUG -DQT_NO_DEBUG -fPIC -mmmx -msse -msse2 -pthread -o CMakeFiles/libobs.dir/media-io/audio-io.c.o -c /tmp/B.Ey4Kql/BUILD/obs-studio-21.0.1/libobs/media-io/audio-io.c make[2]: Leaving directory '/tmp/B.Ey4Kql/BUILD/obs-studio-21.0.1/build' make[2]: Entering directory '/tmp/B.Ey4Kql/BUILD/obs-studio-21.0.1/build' [ 14%] Building C object libobs/CMakeFiles/libobs.dir/util/base.c.o cd /tmp/B.Ey4Kql/BUILD/obs-studio-21.0.1/build/libobs && /usr/bin/x86_64-pld-linux-gcc -DHAVE_OBSCONFIG_H -DLIBOBS_EXPORTS -DUSE_XDG -Dlibobs_EXPORTS -I/usr/include/dbus-1.0 -I/usr/lib64/dbus-1.0/include -I/tmp/B.Ey4Kql/BUILD/obs-studio-21.0.1/libobs -I/tmp/B.Ey4Kql/BUILD/obs-studio-21.0.1/build/config -Wall -Wextra -Wno-unused-function -Werror-implicit-function-declaration -Wno-missing-braces -Wno-missing-field-initializers -std=gnu99 -fno-strict-aliasing -O2 -fwrapv -pipe -Wformat -Werror=format-security -gdwarf-4 -fno-debug-types-section -fvar-tracking-assignments -g2 -Wp,-D_FORTIFY_SOURCE=2 -fstack-protector-strong --param=ssp-buffer-size=4 -Werror=trampolines -fPIC -march=x86-64 -gdwarf-4 -fno-debug-types-section -fvar-tracking-assignments -g2 -DNDEBUG -DQT_NO_DEBUG -fPIC -mmmx -msse -msse2 -pthread -o CMakeFiles/libobs.dir/util/base.c.o -c /tmp/B.Ey4Kql/BUILD/obs-studio-21.0.1/libobs/util/base.c make[2]: Leaving directory '/tmp/B.Ey4Kql/BUILD/obs-studio-21.0.1/build' make[2]: Entering directory '/tmp/B.Ey4Kql/BUILD/obs-studio-21.0.1/build' [ 15%] Building C object libobs/CMakeFiles/libobs.dir/util/bmem.c.o cd /tmp/B.Ey4Kql/BUILD/obs-studio-21.0.1/build/libobs && /usr/bin/x86_64-pld-linux-gcc -DHAVE_OBSCONFIG_H -DLIBOBS_EXPORTS -DUSE_XDG -Dlibobs_EXPORTS -I/usr/include/dbus-1.0 -I/usr/lib64/dbus-1.0/include -I/tmp/B.Ey4Kql/BUILD/obs-studio-21.0.1/libobs -I/tmp/B.Ey4Kql/BUILD/obs-studio-21.0.1/build/config -Wall -Wextra -Wno-unused-function -Werror-implicit-function-declaration -Wno-missing-braces -Wno-missing-field-initializers -std=gnu99 -fno-strict-aliasing -O2 -fwrapv -pipe -Wformat -Werror=format-security -gdwarf-4 -fno-debug-types-section -fvar-tracking-assignments -g2 -Wp,-D_FORTIFY_SOURCE=2 -fstack-protector-strong --param=ssp-buffer-size=4 -Werror=trampolines -fPIC -march=x86-64 -gdwarf-4 -fno-debug-types-section -fvar-tracking-assignments -g2 -DNDEBUG -DQT_NO_DEBUG -fPIC -mmmx -msse -msse2 -pthread -o CMakeFiles/libobs.dir/util/bmem.c.o -c /tmp/B.Ey4Kql/BUILD/obs-studio-21.0.1/libobs/util/bmem.c make[2]: Leaving directory '/tmp/B.Ey4Kql/BUILD/obs-studio-21.0.1/build' make[2]: Entering directory '/tmp/B.Ey4Kql/BUILD/obs-studio-21.0.1/build' [ 3%] Building C object deps/glad/CMakeFiles/glad.dir/src/glad.c.o cd /tmp/B.Ey4Kql/BUILD/obs-studio-21.0.1/build/deps/glad && /usr/bin/x86_64-pld-linux-gcc -DGLAD_GLAPI_EXPORT_BUILD -DUSE_XDG -Dglad_EXPORTS -I/tmp/B.Ey4Kql/BUILD/obs-studio-21.0.1/deps/glad/include -Wall -Wextra -Wno-unused-function -Werror-implicit-function-declaration -Wno-missing-braces -Wno-missing-field-initializers -std=gnu99 -fno-strict-aliasing -O2 -fwrapv -pipe -Wformat -Werror=format-security -gdwarf-4 -fno-debug-types-section -fvar-tracking-assignments -g2 -Wp,-D_FORTIFY_SOURCE=2 -fstack-protector-strong --param=ssp-buffer-size=4 -Werror=trampolines -fPIC -march=x86-64 -gdwarf-4 -fno-debug-types-section -fvar-tracking-assignments -g2 -DNDEBUG -DQT_NO_DEBUG -fPIC -DPIC -fvisibility=hidden -fPIC -o CMakeFiles/glad.dir/src/glad.c.o -c /tmp/B.Ey4Kql/BUILD/obs-studio-21.0.1/deps/glad/src/glad.c make[2]: Leaving directory '/tmp/B.Ey4Kql/BUILD/obs-studio-21.0.1/build' make[2]: Entering directory '/tmp/B.Ey4Kql/BUILD/obs-studio-21.0.1/build' [ 15%] Building C object libobs/CMakeFiles/libobs.dir/util/platform.c.o cd /tmp/B.Ey4Kql/BUILD/obs-studio-21.0.1/build/libobs && /usr/bin/x86_64-pld-linux-gcc -DHAVE_OBSCONFIG_H -DLIBOBS_EXPORTS -DUSE_XDG -Dlibobs_EXPORTS -I/usr/include/dbus-1.0 -I/usr/lib64/dbus-1.0/include -I/tmp/B.Ey4Kql/BUILD/obs-studio-21.0.1/libobs -I/tmp/B.Ey4Kql/BUILD/obs-studio-21.0.1/build/config -Wall -Wextra -Wno-unused-function -Werror-implicit-function-declaration -Wno-missing-braces -Wno-missing-field-initializers -std=gnu99 -fno-strict-aliasing -O2 -fwrapv -pipe -Wformat -Werror=format-security -gdwarf-4 -fno-debug-types-section -fvar-tracking-assignments -g2 -Wp,-D_FORTIFY_SOURCE=2 -fstack-protector-strong --param=ssp-buffer-size=4 -Werror=trampolines -fPIC -march=x86-64 -gdwarf-4 -fno-debug-types-section -fvar-tracking-assignments -g2 -DNDEBUG -DQT_NO_DEBUG -fPIC -mmmx -msse -msse2 -pthread -o CMakeFiles/libobs.dir/util/platform.c.o -c /tmp/B.Ey4Kql/BUILD/obs-studio-21.0.1/libobs/util/platform.c make[2]: Leaving directory '/tmp/B.Ey4Kql/BUILD/obs-studio-21.0.1/build' make[2]: Entering directory '/tmp/B.Ey4Kql/BUILD/obs-studio-21.0.1/build' [ 16%] Linking C shared library libobsglad.so cd /tmp/B.Ey4Kql/BUILD/obs-studio-21.0.1/build/deps/glad && /usr/bin/cmake -E cmake_link_script CMakeFiles/glad.dir/link.txt --verbose=1 /usr/bin/x86_64-pld-linux-gcc -fPIC -Wall -Wextra -Wno-unused-function -Werror-implicit-function-declaration -Wno-missing-braces -Wno-missing-field-initializers -std=gnu99 -fno-strict-aliasing -O2 -fwrapv -pipe -Wformat -Werror=format-security -gdwarf-4 -fno-debug-types-section -fvar-tracking-assignments -g2 -Wp,-D_FORTIFY_SOURCE=2 -fstack-protector-strong --param=ssp-buffer-size=4 -Werror=trampolines -fPIC -march=x86-64 -gdwarf-4 -fno-debug-types-section -fvar-tracking-assignments -g2 -DNDEBUG -DQT_NO_DEBUG -Wl,--as-needed -Wl,--no-copy-dt-needed-entries -Wl,-z,relro -Wl,-z,combreloc -shared -Wl,-soname,libobsglad.so.0 -o libobsglad.so.0 CMakeFiles/glad.dir/src/glad.c.o CMakeFiles/glad.dir/src/glad_glx.c.o -lX11 -ldl -lGL cd /tmp/B.Ey4Kql/BUILD/obs-studio-21.0.1/build/deps/glad && /usr/bin/cmake -E cmake_symlink_library libobsglad.so.0 libobsglad.so.0 libobsglad.so cd /tmp/B.Ey4Kql/BUILD/obs-studio-21.0.1/build/deps/glad && /usr/bin/cmake -E copy /tmp/B.Ey4Kql/BUILD/obs-studio-21.0.1/build/deps/glad/libobsglad.so.0 /tmp/B.Ey4Kql/BUILD/obs-studio-21.0.1/build/rundir/PLD/bin/64bit/libobsglad.so.0 make[2]: Leaving directory '/tmp/B.Ey4Kql/BUILD/obs-studio-21.0.1/build' make[1]: Entering directory '/tmp/B.Ey4Kql/BUILD/obs-studio-21.0.1/build' [ 16%] Built target glad make[1]: Leaving directory '/tmp/B.Ey4Kql/BUILD/obs-studio-21.0.1/build' make[2]: Entering directory '/tmp/B.Ey4Kql/BUILD/obs-studio-21.0.1/build' [ 5%] Building C object libobs/CMakeFiles/libobs.dir/graphics/effect-parser.c.o cd /tmp/B.Ey4Kql/BUILD/obs-studio-21.0.1/build/libobs && /usr/bin/x86_64-pld-linux-gcc -DHAVE_OBSCONFIG_H -DLIBOBS_EXPORTS -DUSE_XDG -Dlibobs_EXPORTS -I/usr/include/dbus-1.0 -I/usr/lib64/dbus-1.0/include -I/tmp/B.Ey4Kql/BUILD/obs-studio-21.0.1/libobs -I/tmp/B.Ey4Kql/BUILD/obs-studio-21.0.1/build/config -Wall -Wextra -Wno-unused-function -Werror-implicit-function-declaration -Wno-missing-braces -Wno-missing-field-initializers -std=gnu99 -fno-strict-aliasing -O2 -fwrapv -pipe -Wformat -Werror=format-security -gdwarf-4 -fno-debug-types-section -fvar-tracking-assignments -g2 -Wp,-D_FORTIFY_SOURCE=2 -fstack-protector-strong --param=ssp-buffer-size=4 -Werror=trampolines -fPIC -march=x86-64 -gdwarf-4 -fno-debug-types-section -fvar-tracking-assignments -g2 -DNDEBUG -DQT_NO_DEBUG -fPIC -mmmx -msse -msse2 -pthread -o CMakeFiles/libobs.dir/graphics/effect-parser.c.o -c /tmp/B.Ey4Kql/BUILD/obs-studio-21.0.1/libobs/graphics/effect-parser.c make[2]: Leaving directory '/tmp/B.Ey4Kql/BUILD/obs-studio-21.0.1/build' make[2]: Entering directory '/tmp/B.Ey4Kql/BUILD/obs-studio-21.0.1/build' [ 9%] Building C object libobs/CMakeFiles/libobs.dir/graphics/shader-parser.c.o cd /tmp/B.Ey4Kql/BUILD/obs-studio-21.0.1/build/libobs && /usr/bin/x86_64-pld-linux-gcc -DHAVE_OBSCONFIG_H -DLIBOBS_EXPORTS -DUSE_XDG -Dlibobs_EXPORTS -I/usr/include/dbus-1.0 -I/usr/lib64/dbus-1.0/include -I/tmp/B.Ey4Kql/BUILD/obs-studio-21.0.1/libobs -I/tmp/B.Ey4Kql/BUILD/obs-studio-21.0.1/build/config -Wall -Wextra -Wno-unused-function -Werror-implicit-function-declaration -Wno-missing-braces -Wno-missing-field-initializers -std=gnu99 -fno-strict-aliasing -O2 -fwrapv -pipe -Wformat -Werror=format-security -gdwarf-4 -fno-debug-types-section -fvar-tracking-assignments -g2 -Wp,-D_FORTIFY_SOURCE=2 -fstack-protector-strong --param=ssp-buffer-size=4 -Werror=trampolines -fPIC -march=x86-64 -gdwarf-4 -fno-debug-types-section -fvar-tracking-assignments -g2 -DNDEBUG -DQT_NO_DEBUG -fPIC -mmmx -msse -msse2 -pthread -o CMakeFiles/libobs.dir/graphics/shader-parser.c.o -c /tmp/B.Ey4Kql/BUILD/obs-studio-21.0.1/libobs/graphics/shader-parser.c make[2]: Leaving directory '/tmp/B.Ey4Kql/BUILD/obs-studio-21.0.1/build' make[2]: Entering directory '/tmp/B.Ey4Kql/BUILD/obs-studio-21.0.1/build' [ 16%] Building C object libobs/CMakeFiles/libobs.dir/util/lexer.c.o cd /tmp/B.Ey4Kql/BUILD/obs-studio-21.0.1/build/libobs && /usr/bin/x86_64-pld-linux-gcc -DHAVE_OBSCONFIG_H -DLIBOBS_EXPORTS -DUSE_XDG -Dlibobs_EXPORTS -I/usr/include/dbus-1.0 -I/usr/lib64/dbus-1.0/include -I/tmp/B.Ey4Kql/BUILD/obs-studio-21.0.1/libobs -I/tmp/B.Ey4Kql/BUILD/obs-studio-21.0.1/build/config -Wall -Wextra -Wno-unused-function -Werror-implicit-function-declaration -Wno-missing-braces -Wno-missing-field-initializers -std=gnu99 -fno-strict-aliasing -O2 -fwrapv -pipe -Wformat -Werror=format-security -gdwarf-4 -fno-debug-types-section -fvar-tracking-assignments -g2 -Wp,-D_FORTIFY_SOURCE=2 -fstack-protector-strong --param=ssp-buffer-size=4 -Werror=trampolines -fPIC -march=x86-64 -gdwarf-4 -fno-debug-types-section -fvar-tracking-assignments -g2 -DNDEBUG -DQT_NO_DEBUG -fPIC -mmmx -msse -msse2 -pthread -o CMakeFiles/libobs.dir/util/lexer.c.o -c /tmp/B.Ey4Kql/BUILD/obs-studio-21.0.1/libobs/util/lexer.c make[2]: Leaving directory '/tmp/B.Ey4Kql/BUILD/obs-studio-21.0.1/build' make[2]: Entering directory '/tmp/B.Ey4Kql/BUILD/obs-studio-21.0.1/build' [ 17%] Building C object libobs/CMakeFiles/libobs.dir/util/crc32.c.o cd /tmp/B.Ey4Kql/BUILD/obs-studio-21.0.1/build/libobs && /usr/bin/x86_64-pld-linux-gcc -DHAVE_OBSCONFIG_H -DLIBOBS_EXPORTS -DUSE_XDG -Dlibobs_EXPORTS -I/usr/include/dbus-1.0 -I/usr/lib64/dbus-1.0/include -I/tmp/B.Ey4Kql/BUILD/obs-studio-21.0.1/libobs -I/tmp/B.Ey4Kql/BUILD/obs-studio-21.0.1/build/config -Wall -Wextra -Wno-unused-function -Werror-implicit-function-declaration -Wno-missing-braces -Wno-missing-field-initializers -std=gnu99 -fno-strict-aliasing -O2 -fwrapv -pipe -Wformat -Werror=format-security -gdwarf-4 -fno-debug-types-section -fvar-tracking-assignments -g2 -Wp,-D_FORTIFY_SOURCE=2 -fstack-protector-strong --param=ssp-buffer-size=4 -Werror=trampolines -fPIC -march=x86-64 -gdwarf-4 -fno-debug-types-section -fvar-tracking-assignments -g2 -DNDEBUG -DQT_NO_DEBUG -fPIC -mmmx -msse -msse2 -pthread -o CMakeFiles/libobs.dir/util/crc32.c.o -c /tmp/B.Ey4Kql/BUILD/obs-studio-21.0.1/libobs/util/crc32.c make[2]: Leaving directory '/tmp/B.Ey4Kql/BUILD/obs-studio-21.0.1/build' make[2]: Entering directory '/tmp/B.Ey4Kql/BUILD/obs-studio-21.0.1/build' [ 17%] Building C object libobs/CMakeFiles/libobs.dir/util/utf8.c.o cd /tmp/B.Ey4Kql/BUILD/obs-studio-21.0.1/build/libobs && /usr/bin/x86_64-pld-linux-gcc -DHAVE_OBSCONFIG_H -DLIBOBS_EXPORTS -DUSE_XDG -Dlibobs_EXPORTS -I/usr/include/dbus-1.0 -I/usr/lib64/dbus-1.0/include -I/tmp/B.Ey4Kql/BUILD/obs-studio-21.0.1/libobs -I/tmp/B.Ey4Kql/BUILD/obs-studio-21.0.1/build/config -Wall -Wextra -Wno-unused-function -Werror-implicit-function-declaration -Wno-missing-braces -Wno-missing-field-initializers -std=gnu99 -fno-strict-aliasing -O2 -fwrapv -pipe -Wformat -Werror=format-security -gdwarf-4 -fno-debug-types-section -fvar-tracking-assignments -g2 -Wp,-D_FORTIFY_SOURCE=2 -fstack-protector-strong --param=ssp-buffer-size=4 -Werror=trampolines -fPIC -march=x86-64 -gdwarf-4 -fno-debug-types-section -fvar-tracking-assignments -g2 -DNDEBUG -DQT_NO_DEBUG -fPIC -mmmx -msse -msse2 -pthread -o CMakeFiles/libobs.dir/util/utf8.c.o -c /tmp/B.Ey4Kql/BUILD/obs-studio-21.0.1/libobs/util/utf8.c make[2]: Leaving directory '/tmp/B.Ey4Kql/BUILD/obs-studio-21.0.1/build' make[2]: Entering directory '/tmp/B.Ey4Kql/BUILD/obs-studio-21.0.1/build' [ 9%] Building C object libobs/CMakeFiles/libobs.dir/graphics/graphics.c.o cd /tmp/B.Ey4Kql/BUILD/obs-studio-21.0.1/build/libobs && /usr/bin/x86_64-pld-linux-gcc -DHAVE_OBSCONFIG_H -DLIBOBS_EXPORTS -DUSE_XDG -Dlibobs_EXPORTS -I/usr/include/dbus-1.0 -I/usr/lib64/dbus-1.0/include -I/tmp/B.Ey4Kql/BUILD/obs-studio-21.0.1/libobs -I/tmp/B.Ey4Kql/BUILD/obs-studio-21.0.1/build/config -Wall -Wextra -Wno-unused-function -Werror-implicit-function-declaration -Wno-missing-braces -Wno-missing-field-initializers -std=gnu99 -fno-strict-aliasing -O2 -fwrapv -pipe -Wformat -Werror=format-security -gdwarf-4 -fno-debug-types-section -fvar-tracking-assignments -g2 -Wp,-D_FORTIFY_SOURCE=2 -fstack-protector-strong --param=ssp-buffer-size=4 -Werror=trampolines -fPIC -march=x86-64 -gdwarf-4 -fno-debug-types-section -fvar-tracking-assignments -g2 -DNDEBUG -DQT_NO_DEBUG -fPIC -mmmx -msse -msse2 -pthread -o CMakeFiles/libobs.dir/graphics/graphics.c.o -c /tmp/B.Ey4Kql/BUILD/obs-studio-21.0.1/libobs/graphics/graphics.c make[2]: Leaving directory '/tmp/B.Ey4Kql/BUILD/obs-studio-21.0.1/build' make[2]: Entering directory '/tmp/B.Ey4Kql/BUILD/obs-studio-21.0.1/build' [ 18%] Building C object libobs/CMakeFiles/libobs.dir/util/cf-parser.c.o cd /tmp/B.Ey4Kql/BUILD/obs-studio-21.0.1/build/libobs && /usr/bin/x86_64-pld-linux-gcc -DHAVE_OBSCONFIG_H -DLIBOBS_EXPORTS -DUSE_XDG -Dlibobs_EXPORTS -I/usr/include/dbus-1.0 -I/usr/lib64/dbus-1.0/include -I/tmp/B.Ey4Kql/BUILD/obs-studio-21.0.1/libobs -I/tmp/B.Ey4Kql/BUILD/obs-studio-21.0.1/build/config -Wall -Wextra -Wno-unused-function -Werror-implicit-function-declaration -Wno-missing-braces -Wno-missing-field-initializers -std=gnu99 -fno-strict-aliasing -O2 -fwrapv -pipe -Wformat -Werror=format-security -gdwarf-4 -fno-debug-types-section -fvar-tracking-assignments -g2 -Wp,-D_FORTIFY_SOURCE=2 -fstack-protector-strong --param=ssp-buffer-size=4 -Werror=trampolines -fPIC -march=x86-64 -gdwarf-4 -fno-debug-types-section -fvar-tracking-assignments -g2 -DNDEBUG -DQT_NO_DEBUG -fPIC -mmmx -msse -msse2 -pthread -o CMakeFiles/libobs.dir/util/cf-parser.c.o -c /tmp/B.Ey4Kql/BUILD/obs-studio-21.0.1/libobs/util/cf-parser.c make[2]: Leaving directory '/tmp/B.Ey4Kql/BUILD/obs-studio-21.0.1/build' make[2]: Entering directory '/tmp/B.Ey4Kql/BUILD/obs-studio-21.0.1/build' [ 16%] Building C object libobs/CMakeFiles/libobs.dir/util/config-file.c.o cd /tmp/B.Ey4Kql/BUILD/obs-studio-21.0.1/build/libobs && /usr/bin/x86_64-pld-linux-gcc -DHAVE_OBSCONFIG_H -DLIBOBS_EXPORTS -DUSE_XDG -Dlibobs_EXPORTS -I/usr/include/dbus-1.0 -I/usr/lib64/dbus-1.0/include -I/tmp/B.Ey4Kql/BUILD/obs-studio-21.0.1/libobs -I/tmp/B.Ey4Kql/BUILD/obs-studio-21.0.1/build/config -Wall -Wextra -Wno-unused-function -Werror-implicit-function-declaration -Wno-missing-braces -Wno-missing-field-initializers -std=gnu99 -fno-strict-aliasing -O2 -fwrapv -pipe -Wformat -Werror=format-security -gdwarf-4 -fno-debug-types-section -fvar-tracking-assignments -g2 -Wp,-D_FORTIFY_SOURCE=2 -fstack-protector-strong --param=ssp-buffer-size=4 -Werror=trampolines -fPIC -march=x86-64 -gdwarf-4 -fno-debug-types-section -fvar-tracking-assignments -g2 -DNDEBUG -DQT_NO_DEBUG -fPIC -mmmx -msse -msse2 -pthread -o CMakeFiles/libobs.dir/util/config-file.c.o -c /tmp/B.Ey4Kql/BUILD/obs-studio-21.0.1/libobs/util/config-file.c make[2]: Leaving directory '/tmp/B.Ey4Kql/BUILD/obs-studio-21.0.1/build' make[2]: Entering directory '/tmp/B.Ey4Kql/BUILD/obs-studio-21.0.1/build' [ 19%] Building C object libobs/CMakeFiles/libobs.dir/util/pipe-posix.c.o cd /tmp/B.Ey4Kql/BUILD/obs-studio-21.0.1/build/libobs && /usr/bin/x86_64-pld-linux-gcc -DHAVE_OBSCONFIG_H -DLIBOBS_EXPORTS -DUSE_XDG -Dlibobs_EXPORTS -I/usr/include/dbus-1.0 -I/usr/lib64/dbus-1.0/include -I/tmp/B.Ey4Kql/BUILD/obs-studio-21.0.1/libobs -I/tmp/B.Ey4Kql/BUILD/obs-studio-21.0.1/build/config -Wall -Wextra -Wno-unused-function -Werror-implicit-function-declaration -Wno-missing-braces -Wno-missing-field-initializers -std=gnu99 -fno-strict-aliasing -O2 -fwrapv -pipe -Wformat -Werror=format-security -gdwarf-4 -fno-debug-types-section -fvar-tracking-assignments -g2 -Wp,-D_FORTIFY_SOURCE=2 -fstack-protector-strong --param=ssp-buffer-size=4 -Werror=trampolines -fPIC -march=x86-64 -gdwarf-4 -fno-debug-types-section -fvar-tracking-assignments -g2 -DNDEBUG -DQT_NO_DEBUG -fPIC -mmmx -msse -msse2 -pthread -o CMakeFiles/libobs.dir/util/pipe-posix.c.o -c /tmp/B.Ey4Kql/BUILD/obs-studio-21.0.1/libobs/util/pipe-posix.c make[2]: Leaving directory '/tmp/B.Ey4Kql/BUILD/obs-studio-21.0.1/build' make[2]: Entering directory '/tmp/B.Ey4Kql/BUILD/obs-studio-21.0.1/build' [ 17%] Building C object libobs/CMakeFiles/libobs.dir/util/text-lookup.c.o cd /tmp/B.Ey4Kql/BUILD/obs-studio-21.0.1/build/libobs && /usr/bin/x86_64-pld-linux-gcc -DHAVE_OBSCONFIG_H -DLIBOBS_EXPORTS -DUSE_XDG -Dlibobs_EXPORTS -I/usr/include/dbus-1.0 -I/usr/lib64/dbus-1.0/include -I/tmp/B.Ey4Kql/BUILD/obs-studio-21.0.1/libobs -I/tmp/B.Ey4Kql/BUILD/obs-studio-21.0.1/build/config -Wall -Wextra -Wno-unused-function -Werror-implicit-function-declaration -Wno-missing-braces -Wno-missing-field-initializers -std=gnu99 -fno-strict-aliasing -O2 -fwrapv -pipe -Wformat -Werror=format-security -gdwarf-4 -fno-debug-types-section -fvar-tracking-assignments -g2 -Wp,-D_FORTIFY_SOURCE=2 -fstack-protector-strong --param=ssp-buffer-size=4 -Werror=trampolines -fPIC -march=x86-64 -gdwarf-4 -fno-debug-types-section -fvar-tracking-assignments -g2 -DNDEBUG -DQT_NO_DEBUG -fPIC -mmmx -msse -msse2 -pthread -o CMakeFiles/libobs.dir/util/text-lookup.c.o -c /tmp/B.Ey4Kql/BUILD/obs-studio-21.0.1/libobs/util/text-lookup.c make[2]: Leaving directory '/tmp/B.Ey4Kql/BUILD/obs-studio-21.0.1/build' make[2]: Entering directory '/tmp/B.Ey4Kql/BUILD/obs-studio-21.0.1/build' [ 19%] Building C object libobs/CMakeFiles/libobs.dir/util/threading-posix.c.o cd /tmp/B.Ey4Kql/BUILD/obs-studio-21.0.1/build/libobs && /usr/bin/x86_64-pld-linux-gcc -DHAVE_OBSCONFIG_H -DLIBOBS_EXPORTS -DUSE_XDG -Dlibobs_EXPORTS -I/usr/include/dbus-1.0 -I/usr/lib64/dbus-1.0/include -I/tmp/B.Ey4Kql/BUILD/obs-studio-21.0.1/libobs -I/tmp/B.Ey4Kql/BUILD/obs-studio-21.0.1/build/config -Wall -Wextra -Wno-unused-function -Werror-implicit-function-declaration -Wno-missing-braces -Wno-missing-field-initializers -std=gnu99 -fno-strict-aliasing -O2 -fwrapv -pipe -Wformat -Werror=format-security -gdwarf-4 -fno-debug-types-section -fvar-tracking-assignments -g2 -Wp,-D_FORTIFY_SOURCE=2 -fstack-protector-strong --param=ssp-buffer-size=4 -Werror=trampolines -fPIC -march=x86-64 -gdwarf-4 -fno-debug-types-section -fvar-tracking-assignments -g2 -DNDEBUG -DQT_NO_DEBUG -fPIC -mmmx -msse -msse2 -pthread -o CMakeFiles/libobs.dir/util/threading-posix.c.o -c /tmp/B.Ey4Kql/BUILD/obs-studio-21.0.1/libobs/util/threading-posix.c make[2]: Leaving directory '/tmp/B.Ey4Kql/BUILD/obs-studio-21.0.1/build' make[2]: Entering directory '/tmp/B.Ey4Kql/BUILD/obs-studio-21.0.1/build' [ 19%] Building C object libobs/CMakeFiles/libobs.dir/util/platform-nix-dbus.c.o cd /tmp/B.Ey4Kql/BUILD/obs-studio-21.0.1/build/libobs && /usr/bin/x86_64-pld-linux-gcc -DHAVE_OBSCONFIG_H -DLIBOBS_EXPORTS -DUSE_XDG -Dlibobs_EXPORTS -I/usr/include/dbus-1.0 -I/usr/lib64/dbus-1.0/include -I/tmp/B.Ey4Kql/BUILD/obs-studio-21.0.1/libobs -I/tmp/B.Ey4Kql/BUILD/obs-studio-21.0.1/build/config -Wall -Wextra -Wno-unused-function -Werror-implicit-function-declaration -Wno-missing-braces -Wno-missing-field-initializers -std=gnu99 -fno-strict-aliasing -O2 -fwrapv -pipe -Wformat -Werror=format-security -gdwarf-4 -fno-debug-types-section -fvar-tracking-assignments -g2 -Wp,-D_FORTIFY_SOURCE=2 -fstack-protector-strong --param=ssp-buffer-size=4 -Werror=trampolines -fPIC -march=x86-64 -gdwarf-4 -fno-debug-types-section -fvar-tracking-assignments -g2 -DNDEBUG -DQT_NO_DEBUG -fPIC -mmmx -msse -msse2 -pthread -o CMakeFiles/libobs.dir/util/platform-nix-dbus.c.o -c /tmp/B.Ey4Kql/BUILD/obs-studio-21.0.1/libobs/util/platform-nix-dbus.c make[2]: Leaving directory '/tmp/B.Ey4Kql/BUILD/obs-studio-21.0.1/build' make[2]: Entering directory '/tmp/B.Ey4Kql/BUILD/obs-studio-21.0.1/build' [ 16%] Building C object libobs/CMakeFiles/libobs.dir/util/dstr.c.o cd /tmp/B.Ey4Kql/BUILD/obs-studio-21.0.1/build/libobs && /usr/bin/x86_64-pld-linux-gcc -DHAVE_OBSCONFIG_H -DLIBOBS_EXPORTS -DUSE_XDG -Dlibobs_EXPORTS -I/usr/include/dbus-1.0 -I/usr/lib64/dbus-1.0/include -I/tmp/B.Ey4Kql/BUILD/obs-studio-21.0.1/libobs -I/tmp/B.Ey4Kql/BUILD/obs-studio-21.0.1/build/config -Wall -Wextra -Wno-unused-function -Werror-implicit-function-declaration -Wno-missing-braces -Wno-missing-field-initializers -std=gnu99 -fno-strict-aliasing -O2 -fwrapv -pipe -Wformat -Werror=format-security -gdwarf-4 -fno-debug-types-section -fvar-tracking-assignments -g2 -Wp,-D_FORTIFY_SOURCE=2 -fstack-protector-strong --param=ssp-buffer-size=4 -Werror=trampolines -fPIC -march=x86-64 -gdwarf-4 -fno-debug-types-section -fvar-tracking-assignments -g2 -DNDEBUG -DQT_NO_DEBUG -fPIC -mmmx -msse -msse2 -pthread -o CMakeFiles/libobs.dir/util/dstr.c.o -c /tmp/B.Ey4Kql/BUILD/obs-studio-21.0.1/libobs/util/dstr.c make[2]: Leaving directory '/tmp/B.Ey4Kql/BUILD/obs-studio-21.0.1/build' make[2]: Entering directory '/tmp/B.Ey4Kql/BUILD/obs-studio-21.0.1/build' [ 15%] Building C object libobs/CMakeFiles/libobs.dir/util/cf-lexer.c.o cd /tmp/B.Ey4Kql/BUILD/obs-studio-21.0.1/build/libobs && /usr/bin/x86_64-pld-linux-gcc -DHAVE_OBSCONFIG_H -DLIBOBS_EXPORTS -DUSE_XDG -Dlibobs_EXPORTS -I/usr/include/dbus-1.0 -I/usr/lib64/dbus-1.0/include -I/tmp/B.Ey4Kql/BUILD/obs-studio-21.0.1/libobs -I/tmp/B.Ey4Kql/BUILD/obs-studio-21.0.1/build/config -Wall -Wextra -Wno-unused-function -Werror-implicit-function-declaration -Wno-missing-braces -Wno-missing-field-initializers -std=gnu99 -fno-strict-aliasing -O2 -fwrapv -pipe -Wformat -Werror=format-security -gdwarf-4 -fno-debug-types-section -fvar-tracking-assignments -g2 -Wp,-D_FORTIFY_SOURCE=2 -fstack-protector-strong --param=ssp-buffer-size=4 -Werror=trampolines -fPIC -march=x86-64 -gdwarf-4 -fno-debug-types-section -fvar-tracking-assignments -g2 -DNDEBUG -DQT_NO_DEBUG -fPIC -mmmx -msse -msse2 -pthread -o CMakeFiles/libobs.dir/util/cf-lexer.c.o -c /tmp/B.Ey4Kql/BUILD/obs-studio-21.0.1/libobs/util/cf-lexer.c make[2]: Leaving directory '/tmp/B.Ey4Kql/BUILD/obs-studio-21.0.1/build' make[2]: Entering directory '/tmp/B.Ey4Kql/BUILD/obs-studio-21.0.1/build' [ 19%] Building C object libobs/CMakeFiles/libobs.dir/util/platform-nix.c.o cd /tmp/B.Ey4Kql/BUILD/obs-studio-21.0.1/build/libobs && /usr/bin/x86_64-pld-linux-gcc -DHAVE_OBSCONFIG_H -DLIBOBS_EXPORTS -DUSE_XDG -Dlibobs_EXPORTS -I/usr/include/dbus-1.0 -I/usr/lib64/dbus-1.0/include -I/tmp/B.Ey4Kql/BUILD/obs-studio-21.0.1/libobs -I/tmp/B.Ey4Kql/BUILD/obs-studio-21.0.1/build/config -Wall -Wextra -Wno-unused-function -Werror-implicit-function-declaration -Wno-missing-braces -Wno-missing-field-initializers -std=gnu99 -fno-strict-aliasing -O2 -fwrapv -pipe -Wformat -Werror=format-security -gdwarf-4 -fno-debug-types-section -fvar-tracking-assignments -g2 -Wp,-D_FORTIFY_SOURCE=2 -fstack-protector-strong --param=ssp-buffer-size=4 -Werror=trampolines -fPIC -march=x86-64 -gdwarf-4 -fno-debug-types-section -fvar-tracking-assignments -g2 -DNDEBUG -DQT_NO_DEBUG -fPIC -mmmx -msse -msse2 -pthread -o CMakeFiles/libobs.dir/util/platform-nix.c.o -c /tmp/B.Ey4Kql/BUILD/obs-studio-21.0.1/libobs/util/platform-nix.c make[2]: Leaving directory '/tmp/B.Ey4Kql/BUILD/obs-studio-21.0.1/build' make[2]: Entering directory '/tmp/B.Ey4Kql/BUILD/obs-studio-21.0.1/build' [ 18%] Building C object libobs/CMakeFiles/libobs.dir/obs-nix.c.o cd /tmp/B.Ey4Kql/BUILD/obs-studio-21.0.1/build/libobs && /usr/bin/x86_64-pld-linux-gcc -DHAVE_OBSCONFIG_H -DLIBOBS_EXPORTS -DUSE_XDG -Dlibobs_EXPORTS -I/usr/include/dbus-1.0 -I/usr/lib64/dbus-1.0/include -I/tmp/B.Ey4Kql/BUILD/obs-studio-21.0.1/libobs -I/tmp/B.Ey4Kql/BUILD/obs-studio-21.0.1/build/config -Wall -Wextra -Wno-unused-function -Werror-implicit-function-declaration -Wno-missing-braces -Wno-missing-field-initializers -std=gnu99 -fno-strict-aliasing -O2 -fwrapv -pipe -Wformat -Werror=format-security -gdwarf-4 -fno-debug-types-section -fvar-tracking-assignments -g2 -Wp,-D_FORTIFY_SOURCE=2 -fstack-protector-strong --param=ssp-buffer-size=4 -Werror=trampolines -fPIC -march=x86-64 -gdwarf-4 -fno-debug-types-section -fvar-tracking-assignments -g2 -DNDEBUG -DQT_NO_DEBUG -fPIC -mmmx -msse -msse2 -pthread -o CMakeFiles/libobs.dir/obs-nix.c.o -c /tmp/B.Ey4Kql/BUILD/obs-studio-21.0.1/libobs/obs-nix.c make[2]: Leaving directory '/tmp/B.Ey4Kql/BUILD/obs-studio-21.0.1/build' make[2]: Entering directory '/tmp/B.Ey4Kql/BUILD/obs-studio-21.0.1/build' [ 20%] Building C object libobs/CMakeFiles/libobs.dir/obs-avc.c.o cd /tmp/B.Ey4Kql/BUILD/obs-studio-21.0.1/build/libobs && /usr/bin/x86_64-pld-linux-gcc -DHAVE_OBSCONFIG_H -DLIBOBS_EXPORTS -DUSE_XDG -Dlibobs_EXPORTS -I/usr/include/dbus-1.0 -I/usr/lib64/dbus-1.0/include -I/tmp/B.Ey4Kql/BUILD/obs-studio-21.0.1/libobs -I/tmp/B.Ey4Kql/BUILD/obs-studio-21.0.1/build/config -Wall -Wextra -Wno-unused-function -Werror-implicit-function-declaration -Wno-missing-braces -Wno-missing-field-initializers -std=gnu99 -fno-strict-aliasing -O2 -fwrapv -pipe -Wformat -Werror=format-security -gdwarf-4 -fno-debug-types-section -fvar-tracking-assignments -g2 -Wp,-D_FORTIFY_SOURCE=2 -fstack-protector-strong --param=ssp-buffer-size=4 -Werror=trampolines -fPIC -march=x86-64 -gdwarf-4 -fno-debug-types-section -fvar-tracking-assignments -g2 -DNDEBUG -DQT_NO_DEBUG -fPIC -mmmx -msse -msse2 -pthread -o CMakeFiles/libobs.dir/obs-avc.c.o -c /tmp/B.Ey4Kql/BUILD/obs-studio-21.0.1/libobs/obs-avc.c make[2]: Leaving directory '/tmp/B.Ey4Kql/BUILD/obs-studio-21.0.1/build' make[2]: Entering directory '/tmp/B.Ey4Kql/BUILD/obs-studio-21.0.1/build' [ 20%] Building C object libobs/CMakeFiles/libobs.dir/obs-audio-controls.c.o cd /tmp/B.Ey4Kql/BUILD/obs-studio-21.0.1/build/libobs && /usr/bin/x86_64-pld-linux-gcc -DHAVE_OBSCONFIG_H -DLIBOBS_EXPORTS -DUSE_XDG -Dlibobs_EXPORTS -I/usr/include/dbus-1.0 -I/usr/lib64/dbus-1.0/include -I/tmp/B.Ey4Kql/BUILD/obs-studio-21.0.1/libobs -I/tmp/B.Ey4Kql/BUILD/obs-studio-21.0.1/build/config -Wall -Wextra -Wno-unused-function -Werror-implicit-function-declaration -Wno-missing-braces -Wno-missing-field-initializers -std=gnu99 -fno-strict-aliasing -O2 -fwrapv -pipe -Wformat -Werror=format-security -gdwarf-4 -fno-debug-types-section -fvar-tracking-assignments -g2 -Wp,-D_FORTIFY_SOURCE=2 -fstack-protector-strong --param=ssp-buffer-size=4 -Werror=trampolines -fPIC -march=x86-64 -gdwarf-4 -fno-debug-types-section -fvar-tracking-assignments -g2 -DNDEBUG -DQT_NO_DEBUG -fPIC -mmmx -msse -msse2 -pthread -o CMakeFiles/libobs.dir/obs-audio-controls.c.o -c /tmp/B.Ey4Kql/BUILD/obs-studio-21.0.1/libobs/obs-audio-controls.c make[2]: Leaving directory '/tmp/B.Ey4Kql/BUILD/obs-studio-21.0.1/build' make[2]: Entering directory '/tmp/B.Ey4Kql/BUILD/obs-studio-21.0.1/build' [ 18%] Building C object libobs/CMakeFiles/libobs.dir/util/profiler.c.o cd /tmp/B.Ey4Kql/BUILD/obs-studio-21.0.1/build/libobs && /usr/bin/x86_64-pld-linux-gcc -DHAVE_OBSCONFIG_H -DLIBOBS_EXPORTS -DUSE_XDG -Dlibobs_EXPORTS -I/usr/include/dbus-1.0 -I/usr/lib64/dbus-1.0/include -I/tmp/B.Ey4Kql/BUILD/obs-studio-21.0.1/libobs -I/tmp/B.Ey4Kql/BUILD/obs-studio-21.0.1/build/config -Wall -Wextra -Wno-unused-function -Werror-implicit-function-declaration -Wno-missing-braces -Wno-missing-field-initializers -std=gnu99 -fno-strict-aliasing -O2 -fwrapv -pipe -Wformat -Werror=format-security -gdwarf-4 -fno-debug-types-section -fvar-tracking-assignments -g2 -Wp,-D_FORTIFY_SOURCE=2 -fstack-protector-strong --param=ssp-buffer-size=4 -Werror=trampolines -fPIC -march=x86-64 -gdwarf-4 -fno-debug-types-section -fvar-tracking-assignments -g2 -DNDEBUG -DQT_NO_DEBUG -fPIC -mmmx -msse -msse2 -pthread -o CMakeFiles/libobs.dir/util/profiler.c.o -c /tmp/B.Ey4Kql/BUILD/obs-studio-21.0.1/libobs/util/profiler.c make[2]: Leaving directory '/tmp/B.Ey4Kql/BUILD/obs-studio-21.0.1/build' make[2]: Entering directory '/tmp/B.Ey4Kql/BUILD/obs-studio-21.0.1/build' [ 21%] Building C object libobs/CMakeFiles/libobs.dir/obs-service.c.o cd /tmp/B.Ey4Kql/BUILD/obs-studio-21.0.1/build/libobs && /usr/bin/x86_64-pld-linux-gcc -DHAVE_OBSCONFIG_H -DLIBOBS_EXPORTS -DUSE_XDG -Dlibobs_EXPORTS -I/usr/include/dbus-1.0 -I/usr/lib64/dbus-1.0/include -I/tmp/B.Ey4Kql/BUILD/obs-studio-21.0.1/libobs -I/tmp/B.Ey4Kql/BUILD/obs-studio-21.0.1/build/config -Wall -Wextra -Wno-unused-function -Werror-implicit-function-declaration -Wno-missing-braces -Wno-missing-field-initializers -std=gnu99 -fno-strict-aliasing -O2 -fwrapv -pipe -Wformat -Werror=format-security -gdwarf-4 -fno-debug-types-section -fvar-tracking-assignments -g2 -Wp,-D_FORTIFY_SOURCE=2 -fstack-protector-strong --param=ssp-buffer-size=4 -Werror=trampolines -fPIC -march=x86-64 -gdwarf-4 -fno-debug-types-section -fvar-tracking-assignments -g2 -DNDEBUG -DQT_NO_DEBUG -fPIC -mmmx -msse -msse2 -pthread -o CMakeFiles/libobs.dir/obs-service.c.o -c /tmp/B.Ey4Kql/BUILD/obs-studio-21.0.1/libobs/obs-service.c make[2]: Leaving directory '/tmp/B.Ey4Kql/BUILD/obs-studio-21.0.1/build' make[2]: Entering directory '/tmp/B.Ey4Kql/BUILD/obs-studio-21.0.1/build' [ 21%] Building C object libobs/CMakeFiles/libobs.dir/obs-source-deinterlace.c.o cd /tmp/B.Ey4Kql/BUILD/obs-studio-21.0.1/build/libobs && /usr/bin/x86_64-pld-linux-gcc -DHAVE_OBSCONFIG_H -DLIBOBS_EXPORTS -DUSE_XDG -Dlibobs_EXPORTS -I/usr/include/dbus-1.0 -I/usr/lib64/dbus-1.0/include -I/tmp/B.Ey4Kql/BUILD/obs-studio-21.0.1/libobs -I/tmp/B.Ey4Kql/BUILD/obs-studio-21.0.1/build/config -Wall -Wextra -Wno-unused-function -Werror-implicit-function-declaration -Wno-missing-braces -Wno-missing-field-initializers -std=gnu99 -fno-strict-aliasing -O2 -fwrapv -pipe -Wformat -Werror=format-security -gdwarf-4 -fno-debug-types-section -fvar-tracking-assignments -g2 -Wp,-D_FORTIFY_SOURCE=2 -fstack-protector-strong --param=ssp-buffer-size=4 -Werror=trampolines -fPIC -march=x86-64 -gdwarf-4 -fno-debug-types-section -fvar-tracking-assignments -g2 -DNDEBUG -DQT_NO_DEBUG -fPIC -mmmx -msse -msse2 -pthread -o CMakeFiles/libobs.dir/obs-source-deinterlace.c.o -c /tmp/B.Ey4Kql/BUILD/obs-studio-21.0.1/libobs/obs-source-deinterlace.c make[2]: Leaving directory '/tmp/B.Ey4Kql/BUILD/obs-studio-21.0.1/build' make[2]: Entering directory '/tmp/B.Ey4Kql/BUILD/obs-studio-21.0.1/build' [ 22%] Building C object libobs/CMakeFiles/libobs.dir/obs-output-delay.c.o cd /tmp/B.Ey4Kql/BUILD/obs-studio-21.0.1/build/libobs && /usr/bin/x86_64-pld-linux-gcc -DHAVE_OBSCONFIG_H -DLIBOBS_EXPORTS -DUSE_XDG -Dlibobs_EXPORTS -I/usr/include/dbus-1.0 -I/usr/lib64/dbus-1.0/include -I/tmp/B.Ey4Kql/BUILD/obs-studio-21.0.1/libobs -I/tmp/B.Ey4Kql/BUILD/obs-studio-21.0.1/build/config -Wall -Wextra -Wno-unused-function -Werror-implicit-function-declaration -Wno-missing-braces -Wno-missing-field-initializers -std=gnu99 -fno-strict-aliasing -O2 -fwrapv -pipe -Wformat -Werror=format-security -gdwarf-4 -fno-debug-types-section -fvar-tracking-assignments -g2 -Wp,-D_FORTIFY_SOURCE=2 -fstack-protector-strong --param=ssp-buffer-size=4 -Werror=trampolines -fPIC -march=x86-64 -gdwarf-4 -fno-debug-types-section -fvar-tracking-assignments -g2 -DNDEBUG -DQT_NO_DEBUG -fPIC -mmmx -msse -msse2 -pthread -o CMakeFiles/libobs.dir/obs-output-delay.c.o -c /tmp/B.Ey4Kql/BUILD/obs-studio-21.0.1/libobs/obs-output-delay.c make[2]: Leaving directory '/tmp/B.Ey4Kql/BUILD/obs-studio-21.0.1/build' make[2]: Entering directory '/tmp/B.Ey4Kql/BUILD/obs-studio-21.0.1/build' [ 20%] Building C object libobs/CMakeFiles/libobs.dir/obs-encoder.c.o cd /tmp/B.Ey4Kql/BUILD/obs-studio-21.0.1/build/libobs && /usr/bin/x86_64-pld-linux-gcc -DHAVE_OBSCONFIG_H -DLIBOBS_EXPORTS -DUSE_XDG -Dlibobs_EXPORTS -I/usr/include/dbus-1.0 -I/usr/lib64/dbus-1.0/include -I/tmp/B.Ey4Kql/BUILD/obs-studio-21.0.1/libobs -I/tmp/B.Ey4Kql/BUILD/obs-studio-21.0.1/build/config -Wall -Wextra -Wno-unused-function -Werror-implicit-function-declaration -Wno-missing-braces -Wno-missing-field-initializers -std=gnu99 -fno-strict-aliasing -O2 -fwrapv -pipe -Wformat -Werror=format-security -gdwarf-4 -fno-debug-types-section -fvar-tracking-assignments -g2 -Wp,-D_FORTIFY_SOURCE=2 -fstack-protector-strong --param=ssp-buffer-size=4 -Werror=trampolines -fPIC -march=x86-64 -gdwarf-4 -fno-debug-types-section -fvar-tracking-assignments -g2 -DNDEBUG -DQT_NO_DEBUG -fPIC -mmmx -msse -msse2 -pthread -o CMakeFiles/libobs.dir/obs-encoder.c.o -c /tmp/B.Ey4Kql/BUILD/obs-studio-21.0.1/libobs/obs-encoder.c make[2]: Leaving directory '/tmp/B.Ey4Kql/BUILD/obs-studio-21.0.1/build' make[2]: Entering directory '/tmp/B.Ey4Kql/BUILD/obs-studio-21.0.1/build' [ 3%] Swig compile obspython.i for python cd /tmp/B.Ey4Kql/BUILD/obs-studio-21.0.1/build/deps/obs-scripting/obspython && /usr/bin/cmake -E make_directory /tmp/B.Ey4Kql/BUILD/obs-studio-21.0.1/build/deps/obs-scripting/obspython /tmp/B.Ey4Kql/BUILD/obs-studio-21.0.1/build/deps/obs-scripting/obspython/CMakeFiles/_obspython.dir cd /tmp/B.Ey4Kql/BUILD/obs-studio-21.0.1/build/deps/obs-scripting/obspython && /usr/bin/cmake -E touch /tmp/B.Ey4Kql/BUILD/obs-studio-21.0.1/build/deps/obs-scripting/obspython/CMakeFiles/_obspython.dir/obspythonPYTHON.stamp cd /tmp/B.Ey4Kql/BUILD/obs-studio-21.0.1/build/deps/obs-scripting/obspython && /usr/bin/cmake -E env SWIG_LIB=/usr/share/swig/3.0.12 /usr/bin/swig -python -py3 -outdir /tmp/B.Ey4Kql/BUILD/obs-studio-21.0.1/build/deps/obs-scripting/obspython -interface _obspython -I/tmp/B.Ey4Kql/BUILD/obs-studio-21.0.1/UI/obs-frontend-api -I/tmp/B.Ey4Kql/BUILD/obs-studio-21.0.1/libobs -I/tmp/B.Ey4Kql/BUILD/obs-studio-21.0.1/deps/obs-scripting -I/tmp/B.Ey4Kql/BUILD/obs-studio-21.0.1/build/deps/obs-scripting -I/usr/include/python3.7m -I/usr/include/luajit-2.0 -I/tmp/B.Ey4Kql/BUILD/obs-studio-21.0.1/deps/obs-scripting/obspython -o /tmp/B.Ey4Kql/BUILD/obs-studio-21.0.1/build/deps/obs-scripting/obspython/CMakeFiles/_obspython.dir/obspythonPYTHON_wrap.c /tmp/B.Ey4Kql/BUILD/obs-studio-21.0.1/deps/obs-scripting/obspython/obspython.i make[2]: Leaving directory '/tmp/B.Ey4Kql/BUILD/obs-studio-21.0.1/build' make[2]: Entering directory '/tmp/B.Ey4Kql/BUILD/obs-studio-21.0.1/build' [ 22%] Building C object libobs/CMakeFiles/libobs.dir/obs-source-transition.c.o cd /tmp/B.Ey4Kql/BUILD/obs-studio-21.0.1/build/libobs && /usr/bin/x86_64-pld-linux-gcc -DHAVE_OBSCONFIG_H -DLIBOBS_EXPORTS -DUSE_XDG -Dlibobs_EXPORTS -I/usr/include/dbus-1.0 -I/usr/lib64/dbus-1.0/include -I/tmp/B.Ey4Kql/BUILD/obs-studio-21.0.1/libobs -I/tmp/B.Ey4Kql/BUILD/obs-studio-21.0.1/build/config -Wall -Wextra -Wno-unused-function -Werror-implicit-function-declaration -Wno-missing-braces -Wno-missing-field-initializers -std=gnu99 -fno-strict-aliasing -O2 -fwrapv -pipe -Wformat -Werror=format-security -gdwarf-4 -fno-debug-types-section -fvar-tracking-assignments -g2 -Wp,-D_FORTIFY_SOURCE=2 -fstack-protector-strong --param=ssp-buffer-size=4 -Werror=trampolines -fPIC -march=x86-64 -gdwarf-4 -fno-debug-types-section -fvar-tracking-assignments -g2 -DNDEBUG -DQT_NO_DEBUG -fPIC -mmmx -msse -msse2 -pthread -o CMakeFiles/libobs.dir/obs-source-transition.c.o -c /tmp/B.Ey4Kql/BUILD/obs-studio-21.0.1/libobs/obs-source-transition.c make[2]: Leaving directory '/tmp/B.Ey4Kql/BUILD/obs-studio-21.0.1/build' make[1]: Entering directory '/tmp/B.Ey4Kql/BUILD/obs-studio-21.0.1/build' [ 24%] Built target obspython_swig_compilation make[1]: Leaving directory '/tmp/B.Ey4Kql/BUILD/obs-studio-21.0.1/build' make[2]: Entering directory '/tmp/B.Ey4Kql/BUILD/obs-studio-21.0.1/build' [ 25%] Building C object libobs/CMakeFiles/libobs.dir/obs-display.c.o cd /tmp/B.Ey4Kql/BUILD/obs-studio-21.0.1/build/libobs && /usr/bin/x86_64-pld-linux-gcc -DHAVE_OBSCONFIG_H -DLIBOBS_EXPORTS -DUSE_XDG -Dlibobs_EXPORTS -I/usr/include/dbus-1.0 -I/usr/lib64/dbus-1.0/include -I/tmp/B.Ey4Kql/BUILD/obs-studio-21.0.1/libobs -I/tmp/B.Ey4Kql/BUILD/obs-studio-21.0.1/build/config -Wall -Wextra -Wno-unused-function -Werror-implicit-function-declaration -Wno-missing-braces -Wno-missing-field-initializers -std=gnu99 -fno-strict-aliasing -O2 -fwrapv -pipe -Wformat -Werror=format-security -gdwarf-4 -fno-debug-types-section -fvar-tracking-assignments -g2 -Wp,-D_FORTIFY_SOURCE=2 -fstack-protector-strong --param=ssp-buffer-size=4 -Werror=trampolines -fPIC -march=x86-64 -gdwarf-4 -fno-debug-types-section -fvar-tracking-assignments -g2 -DNDEBUG -DQT_NO_DEBUG -fPIC -mmmx -msse -msse2 -pthread -o CMakeFiles/libobs.dir/obs-display.c.o -c /tmp/B.Ey4Kql/BUILD/obs-studio-21.0.1/libobs/obs-display.c make[2]: Leaving directory '/tmp/B.Ey4Kql/BUILD/obs-studio-21.0.1/build' make[2]: Entering directory '/tmp/B.Ey4Kql/BUILD/obs-studio-21.0.1/build' [ 23%] Building C object libobs/CMakeFiles/libobs.dir/obs-properties.c.o cd /tmp/B.Ey4Kql/BUILD/obs-studio-21.0.1/build/libobs && /usr/bin/x86_64-pld-linux-gcc -DHAVE_OBSCONFIG_H -DLIBOBS_EXPORTS -DUSE_XDG -Dlibobs_EXPORTS -I/usr/include/dbus-1.0 -I/usr/lib64/dbus-1.0/include -I/tmp/B.Ey4Kql/BUILD/obs-studio-21.0.1/libobs -I/tmp/B.Ey4Kql/BUILD/obs-studio-21.0.1/build/config -Wall -Wextra -Wno-unused-function -Werror-implicit-function-declaration -Wno-missing-braces -Wno-missing-field-initializers -std=gnu99 -fno-strict-aliasing -O2 -fwrapv -pipe -Wformat -Werror=format-security -gdwarf-4 -fno-debug-types-section -fvar-tracking-assignments -g2 -Wp,-D_FORTIFY_SOURCE=2 -fstack-protector-strong --param=ssp-buffer-size=4 -Werror=trampolines -fPIC -march=x86-64 -gdwarf-4 -fno-debug-types-section -fvar-tracking-assignments -g2 -DNDEBUG -DQT_NO_DEBUG -fPIC -mmmx -msse -msse2 -pthread -o CMakeFiles/libobs.dir/obs-properties.c.o -c /tmp/B.Ey4Kql/BUILD/obs-studio-21.0.1/libobs/obs-properties.c make[2]: Leaving directory '/tmp/B.Ey4Kql/BUILD/obs-studio-21.0.1/build' make[2]: Entering directory '/tmp/B.Ey4Kql/BUILD/obs-studio-21.0.1/build' [ 22%] Building C object libobs/CMakeFiles/libobs.dir/obs-output.c.o cd /tmp/B.Ey4Kql/BUILD/obs-studio-21.0.1/build/libobs && /usr/bin/x86_64-pld-linux-gcc -DHAVE_OBSCONFIG_H -DLIBOBS_EXPORTS -DUSE_XDG -Dlibobs_EXPORTS -I/usr/include/dbus-1.0 -I/usr/lib64/dbus-1.0/include -I/tmp/B.Ey4Kql/BUILD/obs-studio-21.0.1/libobs -I/tmp/B.Ey4Kql/BUILD/obs-studio-21.0.1/build/config -Wall -Wextra -Wno-unused-function -Werror-implicit-function-declaration -Wno-missing-braces -Wno-missing-field-initializers -std=gnu99 -fno-strict-aliasing -O2 -fwrapv -pipe -Wformat -Werror=format-security -gdwarf-4 -fno-debug-types-section -fvar-tracking-assignments -g2 -Wp,-D_FORTIFY_SOURCE=2 -fstack-protector-strong --param=ssp-buffer-size=4 -Werror=trampolines -fPIC -march=x86-64 -gdwarf-4 -fno-debug-types-section -fvar-tracking-assignments -g2 -DNDEBUG -DQT_NO_DEBUG -fPIC -mmmx -msse -msse2 -pthread -o CMakeFiles/libobs.dir/obs-output.c.o -c /tmp/B.Ey4Kql/BUILD/obs-studio-21.0.1/libobs/obs-output.c make[2]: Leaving directory '/tmp/B.Ey4Kql/BUILD/obs-studio-21.0.1/build' make[2]: Entering directory '/tmp/B.Ey4Kql/BUILD/obs-studio-21.0.1/build' [ 23%] Building C object libobs/CMakeFiles/libobs.dir/obs.c.o cd /tmp/B.Ey4Kql/BUILD/obs-studio-21.0.1/build/libobs && /usr/bin/x86_64-pld-linux-gcc -DHAVE_OBSCONFIG_H -DLIBOBS_EXPORTS -DUSE_XDG -Dlibobs_EXPORTS -I/usr/include/dbus-1.0 -I/usr/lib64/dbus-1.0/include -I/tmp/B.Ey4Kql/BUILD/obs-studio-21.0.1/libobs -I/tmp/B.Ey4Kql/BUILD/obs-studio-21.0.1/build/config -Wall -Wextra -Wno-unused-function -Werror-implicit-function-declaration -Wno-missing-braces -Wno-missing-field-initializers -std=gnu99 -fno-strict-aliasing -O2 -fwrapv -pipe -Wformat -Werror=format-security -gdwarf-4 -fno-debug-types-section -fvar-tracking-assignments -g2 -Wp,-D_FORTIFY_SOURCE=2 -fstack-protector-strong --param=ssp-buffer-size=4 -Werror=trampolines -fPIC -march=x86-64 -gdwarf-4 -fno-debug-types-section -fvar-tracking-assignments -g2 -DNDEBUG -DQT_NO_DEBUG -fPIC -mmmx -msse -msse2 -pthread -o CMakeFiles/libobs.dir/obs.c.o -c /tmp/B.Ey4Kql/BUILD/obs-studio-21.0.1/libobs/obs.c make[2]: Leaving directory '/tmp/B.Ey4Kql/BUILD/obs-studio-21.0.1/build' make[2]: Entering directory '/tmp/B.Ey4Kql/BUILD/obs-studio-21.0.1/build' [ 25%] Building C object libobs/CMakeFiles/libobs.dir/obs-view.c.o cd /tmp/B.Ey4Kql/BUILD/obs-studio-21.0.1/build/libobs && /usr/bin/x86_64-pld-linux-gcc -DHAVE_OBSCONFIG_H -DLIBOBS_EXPORTS -DUSE_XDG -Dlibobs_EXPORTS -I/usr/include/dbus-1.0 -I/usr/lib64/dbus-1.0/include -I/tmp/B.Ey4Kql/BUILD/obs-studio-21.0.1/libobs -I/tmp/B.Ey4Kql/BUILD/obs-studio-21.0.1/build/config -Wall -Wextra -Wno-unused-function -Werror-implicit-function-declaration -Wno-missing-braces -Wno-missing-field-initializers -std=gnu99 -fno-strict-aliasing -O2 -fwrapv -pipe -Wformat -Werror=format-security -gdwarf-4 -fno-debug-types-section -fvar-tracking-assignments -g2 -Wp,-D_FORTIFY_SOURCE=2 -fstack-protector-strong --param=ssp-buffer-size=4 -Werror=trampolines -fPIC -march=x86-64 -gdwarf-4 -fno-debug-types-section -fvar-tracking-assignments -g2 -DNDEBUG -DQT_NO_DEBUG -fPIC -mmmx -msse -msse2 -pthread -o CMakeFiles/libobs.dir/obs-view.c.o -c /tmp/B.Ey4Kql/BUILD/obs-studio-21.0.1/libobs/obs-view.c make[2]: Leaving directory '/tmp/B.Ey4Kql/BUILD/obs-studio-21.0.1/build' make[2]: Entering directory '/tmp/B.Ey4Kql/BUILD/obs-studio-21.0.1/build' [ 25%] Building C object libobs/CMakeFiles/libobs.dir/obs-video.c.o cd /tmp/B.Ey4Kql/BUILD/obs-studio-21.0.1/build/libobs && /usr/bin/x86_64-pld-linux-gcc -DHAVE_OBSCONFIG_H -DLIBOBS_EXPORTS -DUSE_XDG -Dlibobs_EXPORTS -I/usr/include/dbus-1.0 -I/usr/lib64/dbus-1.0/include -I/tmp/B.Ey4Kql/BUILD/obs-studio-21.0.1/libobs -I/tmp/B.Ey4Kql/BUILD/obs-studio-21.0.1/build/config -Wall -Wextra -Wno-unused-function -Werror-implicit-function-declaration -Wno-missing-braces -Wno-missing-field-initializers -std=gnu99 -fno-strict-aliasing -O2 -fwrapv -pipe -Wformat -Werror=format-security -gdwarf-4 -fno-debug-types-section -fvar-tracking-assignments -g2 -Wp,-D_FORTIFY_SOURCE=2 -fstack-protector-strong --param=ssp-buffer-size=4 -Werror=trampolines -fPIC -march=x86-64 -gdwarf-4 -fno-debug-types-section -fvar-tracking-assignments -g2 -DNDEBUG -DQT_NO_DEBUG -fPIC -mmmx -msse -msse2 -pthread -o CMakeFiles/libobs.dir/obs-video.c.o -c /tmp/B.Ey4Kql/BUILD/obs-studio-21.0.1/libobs/obs-video.c make[2]: Leaving directory '/tmp/B.Ey4Kql/BUILD/obs-studio-21.0.1/build' make[2]: Entering directory '/tmp/B.Ey4Kql/BUILD/obs-studio-21.0.1/build' [ 25%] Building C object libobs/CMakeFiles/libobs.dir/obs-module.c.o cd /tmp/B.Ey4Kql/BUILD/obs-studio-21.0.1/build/libobs && /usr/bin/x86_64-pld-linux-gcc -DHAVE_OBSCONFIG_H -DLIBOBS_EXPORTS -DUSE_XDG -Dlibobs_EXPORTS -I/usr/include/dbus-1.0 -I/usr/lib64/dbus-1.0/include -I/tmp/B.Ey4Kql/BUILD/obs-studio-21.0.1/libobs -I/tmp/B.Ey4Kql/BUILD/obs-studio-21.0.1/build/config -Wall -Wextra -Wno-unused-function -Werror-implicit-function-declaration -Wno-missing-braces -Wno-missing-field-initializers -std=gnu99 -fno-strict-aliasing -O2 -fwrapv -pipe -Wformat -Werror=format-security -gdwarf-4 -fno-debug-types-section -fvar-tracking-assignments -g2 -Wp,-D_FORTIFY_SOURCE=2 -fstack-protector-strong --param=ssp-buffer-size=4 -Werror=trampolines -fPIC -march=x86-64 -gdwarf-4 -fno-debug-types-section -fvar-tracking-assignments -g2 -DNDEBUG -DQT_NO_DEBUG -fPIC -mmmx -msse -msse2 -pthread -o CMakeFiles/libobs.dir/obs-module.c.o -c /tmp/B.Ey4Kql/BUILD/obs-studio-21.0.1/libobs/obs-module.c make[2]: Leaving directory '/tmp/B.Ey4Kql/BUILD/obs-studio-21.0.1/build' make[2]: Entering directory '/tmp/B.Ey4Kql/BUILD/obs-studio-21.0.1/build' [ 26%] Building C object libobs/CMakeFiles/libobs.dir/audio-monitoring/pulse/pulseaudio-wrapper.c.o cd /tmp/B.Ey4Kql/BUILD/obs-studio-21.0.1/build/libobs && /usr/bin/x86_64-pld-linux-gcc -DHAVE_OBSCONFIG_H -DLIBOBS_EXPORTS -DUSE_XDG -Dlibobs_EXPORTS -I/usr/include/dbus-1.0 -I/usr/lib64/dbus-1.0/include -I/tmp/B.Ey4Kql/BUILD/obs-studio-21.0.1/libobs -I/tmp/B.Ey4Kql/BUILD/obs-studio-21.0.1/build/config -Wall -Wextra -Wno-unused-function -Werror-implicit-function-declaration -Wno-missing-braces -Wno-missing-field-initializers -std=gnu99 -fno-strict-aliasing -O2 -fwrapv -pipe -Wformat -Werror=format-security -gdwarf-4 -fno-debug-types-section -fvar-tracking-assignments -g2 -Wp,-D_FORTIFY_SOURCE=2 -fstack-protector-strong --param=ssp-buffer-size=4 -Werror=trampolines -fPIC -march=x86-64 -gdwarf-4 -fno-debug-types-section -fvar-tracking-assignments -g2 -DNDEBUG -DQT_NO_DEBUG -fPIC -mmmx -msse -msse2 -pthread -o CMakeFiles/libobs.dir/audio-monitoring/pulse/pulseaudio-wrapper.c.o -c /tmp/B.Ey4Kql/BUILD/obs-studio-21.0.1/libobs/audio-monitoring/pulse/pulseaudio-wrapper.c make[2]: Leaving directory '/tmp/B.Ey4Kql/BUILD/obs-studio-21.0.1/build' make[2]: Entering directory '/tmp/B.Ey4Kql/BUILD/obs-studio-21.0.1/build' [ 23%] Building C object libobs/CMakeFiles/libobs.dir/obs-data.c.o cd /tmp/B.Ey4Kql/BUILD/obs-studio-21.0.1/build/libobs && /usr/bin/x86_64-pld-linux-gcc -DHAVE_OBSCONFIG_H -DLIBOBS_EXPORTS -DUSE_XDG -Dlibobs_EXPORTS -I/usr/include/dbus-1.0 -I/usr/lib64/dbus-1.0/include -I/tmp/B.Ey4Kql/BUILD/obs-studio-21.0.1/libobs -I/tmp/B.Ey4Kql/BUILD/obs-studio-21.0.1/build/config -Wall -Wextra -Wno-unused-function -Werror-implicit-function-declaration -Wno-missing-braces -Wno-missing-field-initializers -std=gnu99 -fno-strict-aliasing -O2 -fwrapv -pipe -Wformat -Werror=format-security -gdwarf-4 -fno-debug-types-section -fvar-tracking-assignments -g2 -Wp,-D_FORTIFY_SOURCE=2 -fstack-protector-strong --param=ssp-buffer-size=4 -Werror=trampolines -fPIC -march=x86-64 -gdwarf-4 -fno-debug-types-section -fvar-tracking-assignments -g2 -DNDEBUG -DQT_NO_DEBUG -fPIC -mmmx -msse -msse2 -pthread -o CMakeFiles/libobs.dir/obs-data.c.o -c /tmp/B.Ey4Kql/BUILD/obs-studio-21.0.1/libobs/obs-data.c make[2]: Leaving directory '/tmp/B.Ey4Kql/BUILD/obs-studio-21.0.1/build' make[2]: Entering directory '/tmp/B.Ey4Kql/BUILD/obs-studio-21.0.1/build' [ 24%] Building C object libobs/CMakeFiles/libobs.dir/obs-hotkey-name-map.c.o cd /tmp/B.Ey4Kql/BUILD/obs-studio-21.0.1/build/libobs && /usr/bin/x86_64-pld-linux-gcc -DHAVE_OBSCONFIG_H -DLIBOBS_EXPORTS -DUSE_XDG -Dlibobs_EXPORTS -I/usr/include/dbus-1.0 -I/usr/lib64/dbus-1.0/include -I/tmp/B.Ey4Kql/BUILD/obs-studio-21.0.1/libobs -I/tmp/B.Ey4Kql/BUILD/obs-studio-21.0.1/build/config -Wall -Wextra -Wno-unused-function -Werror-implicit-function-declaration -Wno-missing-braces -Wno-missing-field-initializers -std=gnu99 -fno-strict-aliasing -O2 -fwrapv -pipe -Wformat -Werror=format-security -gdwarf-4 -fno-debug-types-section -fvar-tracking-assignments -g2 -Wp,-D_FORTIFY_SOURCE=2 -fstack-protector-strong --param=ssp-buffer-size=4 -Werror=trampolines -fPIC -march=x86-64 -gdwarf-4 -fno-debug-types-section -fvar-tracking-assignments -g2 -DNDEBUG -DQT_NO_DEBUG -fPIC -mmmx -msse -msse2 -pthread -o CMakeFiles/libobs.dir/obs-hotkey-name-map.c.o -c /tmp/B.Ey4Kql/BUILD/obs-studio-21.0.1/libobs/obs-hotkey-name-map.c make[2]: Leaving directory '/tmp/B.Ey4Kql/BUILD/obs-studio-21.0.1/build' make[2]: Entering directory '/tmp/B.Ey4Kql/BUILD/obs-studio-21.0.1/build' [ 26%] Building C object libobs/CMakeFiles/libobs.dir/obs-audio.c.o cd /tmp/B.Ey4Kql/BUILD/obs-studio-21.0.1/build/libobs && /usr/bin/x86_64-pld-linux-gcc -DHAVE_OBSCONFIG_H -DLIBOBS_EXPORTS -DUSE_XDG -Dlibobs_EXPORTS -I/usr/include/dbus-1.0 -I/usr/lib64/dbus-1.0/include -I/tmp/B.Ey4Kql/BUILD/obs-studio-21.0.1/libobs -I/tmp/B.Ey4Kql/BUILD/obs-studio-21.0.1/build/config -Wall -Wextra -Wno-unused-function -Werror-implicit-function-declaration -Wno-missing-braces -Wno-missing-field-initializers -std=gnu99 -fno-strict-aliasing -O2 -fwrapv -pipe -Wformat -Werror=format-security -gdwarf-4 -fno-debug-types-section -fvar-tracking-assignments -g2 -Wp,-D_FORTIFY_SOURCE=2 -fstack-protector-strong --param=ssp-buffer-size=4 -Werror=trampolines -fPIC -march=x86-64 -gdwarf-4 -fno-debug-types-section -fvar-tracking-assignments -g2 -DNDEBUG -DQT_NO_DEBUG -fPIC -mmmx -msse -msse2 -pthread -o CMakeFiles/libobs.dir/obs-audio.c.o -c /tmp/B.Ey4Kql/BUILD/obs-studio-21.0.1/libobs/obs-audio.c make[2]: Leaving directory '/tmp/B.Ey4Kql/BUILD/obs-studio-21.0.1/build' make[2]: Entering directory '/tmp/B.Ey4Kql/BUILD/obs-studio-21.0.1/build' [ 27%] Building C object libobs/CMakeFiles/libobs.dir/audio-monitoring/pulse/pulseaudio-enum-devices.c.o cd /tmp/B.Ey4Kql/BUILD/obs-studio-21.0.1/build/libobs && /usr/bin/x86_64-pld-linux-gcc -DHAVE_OBSCONFIG_H -DLIBOBS_EXPORTS -DUSE_XDG -Dlibobs_EXPORTS -I/usr/include/dbus-1.0 -I/usr/lib64/dbus-1.0/include -I/tmp/B.Ey4Kql/BUILD/obs-studio-21.0.1/libobs -I/tmp/B.Ey4Kql/BUILD/obs-studio-21.0.1/build/config -Wall -Wextra -Wno-unused-function -Werror-implicit-function-declaration -Wno-missing-braces -Wno-missing-field-initializers -std=gnu99 -fno-strict-aliasing -O2 -fwrapv -pipe -Wformat -Werror=format-security -gdwarf-4 -fno-debug-types-section -fvar-tracking-assignments -g2 -Wp,-D_FORTIFY_SOURCE=2 -fstack-protector-strong --param=ssp-buffer-size=4 -Werror=trampolines -fPIC -march=x86-64 -gdwarf-4 -fno-debug-types-section -fvar-tracking-assignments -g2 -DNDEBUG -DQT_NO_DEBUG -fPIC -mmmx -msse -msse2 -pthread -o CMakeFiles/libobs.dir/audio-monitoring/pulse/pulseaudio-enum-devices.c.o -c /tmp/B.Ey4Kql/BUILD/obs-studio-21.0.1/libobs/audio-monitoring/pulse/pulseaudio-enum-devices.c make[2]: Leaving directory '/tmp/B.Ey4Kql/BUILD/obs-studio-21.0.1/build' make[2]: Entering directory '/tmp/B.Ey4Kql/BUILD/obs-studio-21.0.1/build' [ 27%] Building C object libobs/CMakeFiles/libobs.dir/audio-monitoring/pulse/pulseaudio-output.c.o cd /tmp/B.Ey4Kql/BUILD/obs-studio-21.0.1/build/libobs && /usr/bin/x86_64-pld-linux-gcc -DHAVE_OBSCONFIG_H -DLIBOBS_EXPORTS -DUSE_XDG -Dlibobs_EXPORTS -I/usr/include/dbus-1.0 -I/usr/lib64/dbus-1.0/include -I/tmp/B.Ey4Kql/BUILD/obs-studio-21.0.1/libobs -I/tmp/B.Ey4Kql/BUILD/obs-studio-21.0.1/build/config -Wall -Wextra -Wno-unused-function -Werror-implicit-function-declaration -Wno-missing-braces -Wno-missing-field-initializers -std=gnu99 -fno-strict-aliasing -O2 -fwrapv -pipe -Wformat -Werror=format-security -gdwarf-4 -fno-debug-types-section -fvar-tracking-assignments -g2 -Wp,-D_FORTIFY_SOURCE=2 -fstack-protector-strong --param=ssp-buffer-size=4 -Werror=trampolines -fPIC -march=x86-64 -gdwarf-4 -fno-debug-types-section -fvar-tracking-assignments -g2 -DNDEBUG -DQT_NO_DEBUG -fPIC -mmmx -msse -msse2 -pthread -o CMakeFiles/libobs.dir/audio-monitoring/pulse/pulseaudio-output.c.o -c /tmp/B.Ey4Kql/BUILD/obs-studio-21.0.1/libobs/audio-monitoring/pulse/pulseaudio-output.c make[2]: Leaving directory '/tmp/B.Ey4Kql/BUILD/obs-studio-21.0.1/build' make[2]: Entering directory '/tmp/B.Ey4Kql/BUILD/obs-studio-21.0.1/build' [ 21%] Building C object libobs/CMakeFiles/libobs.dir/obs-source.c.o cd /tmp/B.Ey4Kql/BUILD/obs-studio-21.0.1/build/libobs && /usr/bin/x86_64-pld-linux-gcc -DHAVE_OBSCONFIG_H -DLIBOBS_EXPORTS -DUSE_XDG -Dlibobs_EXPORTS -I/usr/include/dbus-1.0 -I/usr/lib64/dbus-1.0/include -I/tmp/B.Ey4Kql/BUILD/obs-studio-21.0.1/libobs -I/tmp/B.Ey4Kql/BUILD/obs-studio-21.0.1/build/config -Wall -Wextra -Wno-unused-function -Werror-implicit-function-declaration -Wno-missing-braces -Wno-missing-field-initializers -std=gnu99 -fno-strict-aliasing -O2 -fwrapv -pipe -Wformat -Werror=format-security -gdwarf-4 -fno-debug-types-section -fvar-tracking-assignments -g2 -Wp,-D_FORTIFY_SOURCE=2 -fstack-protector-strong --param=ssp-buffer-size=4 -Werror=trampolines -fPIC -march=x86-64 -gdwarf-4 -fno-debug-types-section -fvar-tracking-assignments -g2 -DNDEBUG -DQT_NO_DEBUG -fPIC -mmmx -msse -msse2 -pthread -o CMakeFiles/libobs.dir/obs-source.c.o -c /tmp/B.Ey4Kql/BUILD/obs-studio-21.0.1/libobs/obs-source.c make[2]: Leaving directory '/tmp/B.Ey4Kql/BUILD/obs-studio-21.0.1/build' make[2]: Entering directory '/tmp/B.Ey4Kql/BUILD/obs-studio-21.0.1/build' [ 25%] Building C object libobs/CMakeFiles/libobs.dir/obs-scene.c.o cd /tmp/B.Ey4Kql/BUILD/obs-studio-21.0.1/build/libobs && /usr/bin/x86_64-pld-linux-gcc -DHAVE_OBSCONFIG_H -DLIBOBS_EXPORTS -DUSE_XDG -Dlibobs_EXPORTS -I/usr/include/dbus-1.0 -I/usr/lib64/dbus-1.0/include -I/tmp/B.Ey4Kql/BUILD/obs-studio-21.0.1/libobs -I/tmp/B.Ey4Kql/BUILD/obs-studio-21.0.1/build/config -Wall -Wextra -Wno-unused-function -Werror-implicit-function-declaration -Wno-missing-braces -Wno-missing-field-initializers -std=gnu99 -fno-strict-aliasing -O2 -fwrapv -pipe -Wformat -Werror=format-security -gdwarf-4 -fno-debug-types-section -fvar-tracking-assignments -g2 -Wp,-D_FORTIFY_SOURCE=2 -fstack-protector-strong --param=ssp-buffer-size=4 -Werror=trampolines -fPIC -march=x86-64 -gdwarf-4 -fno-debug-types-section -fvar-tracking-assignments -g2 -DNDEBUG -DQT_NO_DEBUG -fPIC -mmmx -msse -msse2 -pthread -o CMakeFiles/libobs.dir/obs-scene.c.o -c /tmp/B.Ey4Kql/BUILD/obs-studio-21.0.1/libobs/obs-scene.c make[2]: Leaving directory '/tmp/B.Ey4Kql/BUILD/obs-studio-21.0.1/build' make[2]: Entering directory '/tmp/B.Ey4Kql/BUILD/obs-studio-21.0.1/build' [ 24%] Building C object libobs/CMakeFiles/libobs.dir/obs-hotkey.c.o cd /tmp/B.Ey4Kql/BUILD/obs-studio-21.0.1/build/libobs && /usr/bin/x86_64-pld-linux-gcc -DHAVE_OBSCONFIG_H -DLIBOBS_EXPORTS -DUSE_XDG -Dlibobs_EXPORTS -I/usr/include/dbus-1.0 -I/usr/lib64/dbus-1.0/include -I/tmp/B.Ey4Kql/BUILD/obs-studio-21.0.1/libobs -I/tmp/B.Ey4Kql/BUILD/obs-studio-21.0.1/build/config -Wall -Wextra -Wno-unused-function -Werror-implicit-function-declaration -Wno-missing-braces -Wno-missing-field-initializers -std=gnu99 -fno-strict-aliasing -O2 -fwrapv -pipe -Wformat -Werror=format-security -gdwarf-4 -fno-debug-types-section -fvar-tracking-assignments -g2 -Wp,-D_FORTIFY_SOURCE=2 -fstack-protector-strong --param=ssp-buffer-size=4 -Werror=trampolines -fPIC -march=x86-64 -gdwarf-4 -fno-debug-types-section -fvar-tracking-assignments -g2 -DNDEBUG -DQT_NO_DEBUG -fPIC -mmmx -msse -msse2 -pthread -o CMakeFiles/libobs.dir/obs-hotkey.c.o -c /tmp/B.Ey4Kql/BUILD/obs-studio-21.0.1/libobs/obs-hotkey.c make[2]: Leaving directory '/tmp/B.Ey4Kql/BUILD/obs-studio-21.0.1/build' make[2]: Entering directory '/tmp/B.Ey4Kql/BUILD/obs-studio-21.0.1/build' [ 27%] Linking C shared library libobs.so cd /tmp/B.Ey4Kql/BUILD/obs-studio-21.0.1/build/libobs && /usr/bin/cmake -E cmake_link_script CMakeFiles/libobs.dir/link.txt --verbose=1 /usr/bin/x86_64-pld-linux-gcc -fPIC -Wall -Wextra -Wno-unused-function -Werror-implicit-function-declaration -Wno-missing-braces -Wno-missing-field-initializers -std=gnu99 -fno-strict-aliasing -O2 -fwrapv -pipe -Wformat -Werror=format-security -gdwarf-4 -fno-debug-types-section -fvar-tracking-assignments -g2 -Wp,-D_FORTIFY_SOURCE=2 -fstack-protector-strong --param=ssp-buffer-size=4 -Werror=trampolines -fPIC -march=x86-64 -gdwarf-4 -fno-debug-types-section -fvar-tracking-assignments -g2 -DNDEBUG -DQT_NO_DEBUG -Wl,--as-needed -Wl,--no-copy-dt-needed-entries -Wl,-z,relro -Wl,-z,combreloc -shared -Wl,-soname,libobs.so.0 -o libobs.so.0 CMakeFiles/libobs.dir/callback/calldata.c.o CMakeFiles/libobs.dir/callback/decl.c.o CMakeFiles/libobs.dir/callback/signal.c.o CMakeFiles/libobs.dir/callback/proc.c.o CMakeFiles/libobs.dir/graphics/graphics-ffmpeg.c.o CMakeFiles/libobs.dir/graphics/quat.c.o CMakeFiles/libobs.dir/graphics/effect-parser.c.o CMakeFiles/libobs.dir/graphics/axisang.c.o CMakeFiles/libobs.dir/graphics/vec4.c.o CMakeFiles/libobs.dir/graphics/vec2.c.o CMakeFiles/libobs.dir/graphics/libnsgif/libnsgif.c.o CMakeFiles/libobs.dir/graphics/texture-render.c.o CMakeFiles/libobs.dir/graphics/image-file.c.o CMakeFiles/libobs.dir/graphics/bounds.c.o CMakeFiles/libobs.dir/graphics/matrix3.c.o CMakeFiles/libobs.dir/graphics/matrix4.c.o CMakeFiles/libobs.dir/graphics/vec3.c.o CMakeFiles/libobs.dir/graphics/graphics.c.o CMakeFiles/libobs.dir/graphics/shader-parser.c.o CMakeFiles/libobs.dir/graphics/plane.c.o CMakeFiles/libobs.dir/graphics/effect.c.o CMakeFiles/libobs.dir/graphics/math-extra.c.o CMakeFiles/libobs.dir/graphics/graphics-imports.c.o CMakeFiles/libobs.dir/media-io/video-io.c.o CMakeFiles/libobs.dir/media-io/video-fourcc.c.o CMakeFiles/libobs.dir/media-io/video-matrices.c.o CMakeFiles/libobs.dir/media-io/audio-io.c.o CMakeFiles/libobs.dir/media-io/video-frame.c.o CMakeFiles/libobs.dir/media-io/format-conversion.c.o CMakeFiles/libobs.dir/media-io/audio-resampler-ffmpeg.c.o CMakeFiles/libobs.dir/media-io/video-scaler-ffmpeg.c.o CMakeFiles/libobs.dir/media-io/media-remux.c.o CMakeFiles/libobs.dir/util/array-serializer.c.o CMakeFiles/libobs.dir/util/file-serializer.c.o CMakeFiles/libobs.dir/util/base.c.o CMakeFiles/libobs.dir/util/platform.c.o CMakeFiles/libobs.dir/util/cf-lexer.c.o CMakeFiles/libobs.dir/util/bmem.c.o CMakeFiles/libobs.dir/util/config-file.c.o CMakeFiles/libobs.dir/util/lexer.c.o CMakeFiles/libobs.dir/util/dstr.c.o CMakeFiles/libobs.dir/util/utf8.c.o CMakeFiles/libobs.dir/util/crc32.c.o CMakeFiles/libobs.dir/util/text-lookup.c.o CMakeFiles/libobs.dir/util/cf-parser.c.o CMakeFiles/libobs.dir/util/profiler.c.o CMakeFiles/libobs.dir/obs-nix.c.o CMakeFiles/libobs.dir/util/threading-posix.c.o CMakeFiles/libobs.dir/util/pipe-posix.c.o CMakeFiles/libobs.dir/util/platform-nix.c.o CMakeFiles/libobs.dir/util/platform-nix-dbus.c.o CMakeFiles/libobs.dir/obs-audio-controls.c.o CMakeFiles/libobs.dir/obs-avc.c.o CMakeFiles/libobs.dir/obs-encoder.c.o CMakeFiles/libobs.dir/obs-service.c.o CMakeFiles/libobs.dir/obs-source.c.o CMakeFiles/libobs.dir/obs-source-deinterlace.c.o CMakeFiles/libobs.dir/obs-source-transition.c.o CMakeFiles/libobs.dir/obs-output.c.o CMakeFiles/libobs.dir/obs-output-delay.c.o CMakeFiles/libobs.dir/obs.c.o CMakeFiles/libobs.dir/obs-properties.c.o CMakeFiles/libobs.dir/obs-data.c.o CMakeFiles/libobs.dir/obs-hotkey.c.o CMakeFiles/libobs.dir/obs-hotkey-name-map.c.o CMakeFiles/libobs.dir/obs-module.c.o CMakeFiles/libobs.dir/obs-display.c.o CMakeFiles/libobs.dir/obs-view.c.o CMakeFiles/libobs.dir/obs-scene.c.o CMakeFiles/libobs.dir/obs-audio.c.o CMakeFiles/libobs.dir/obs-video.c.o CMakeFiles/libobs.dir/audio-monitoring/pulse/pulseaudio-wrapper.c.o CMakeFiles/libobs.dir/audio-monitoring/pulse/pulseaudio-enum-devices.c.o CMakeFiles/libobs.dir/audio-monitoring/pulse/pulseaudio-output.c.o -ldbus-1 -lX11-xcb -lpulse /usr/bin/../lib64/libavcodec.so /usr/bin/../lib64/libjansson.so /usr/bin/../lib64/libavformat.so /usr/bin/../lib64/libavutil.so /usr/bin/../lib64/libswscale.so /usr/bin/../lib64/libswresample.so /usr/bin/../lib64/libz.so -lX11-xcb -lX11 -lxcb -ldl -lm -pthread cd /tmp/B.Ey4Kql/BUILD/obs-studio-21.0.1/build/libobs && /usr/bin/cmake -E cmake_symlink_library libobs.so.0 libobs.so.0 libobs.so cd /tmp/B.Ey4Kql/BUILD/obs-studio-21.0.1/build/libobs && /usr/bin/cmake -E copy /tmp/B.Ey4Kql/BUILD/obs-studio-21.0.1/build/libobs/libobs.so.0 /tmp/B.Ey4Kql/BUILD/obs-studio-21.0.1/build/rundir/PLD/bin/64bit/libobs.so.0 cd /tmp/B.Ey4Kql/BUILD/obs-studio-21.0.1/build/libobs && /usr/bin/cmake -E copy_directory /tmp/B.Ey4Kql/BUILD/obs-studio-21.0.1/libobs/data /tmp/B.Ey4Kql/BUILD/obs-studio-21.0.1/build/rundir/PLD/data/libobs cd /tmp/B.Ey4Kql/BUILD/obs-studio-21.0.1/build/libobs && /usr/bin/cmake -DCONFIG=PLD -DTARGET_CONFIGS=ALL -DINPUT=/tmp/B.Ey4Kql/BUILD/obs-studio-21.0.1/additional_install_files/misc/ -DOUTPUT=/tmp/B.Ey4Kql/BUILD/obs-studio-21.0.1/build/rundir/PLD/ -P /tmp/B.Ey4Kql/BUILD/obs-studio-21.0.1/cmake/copy_helper.cmake cd /tmp/B.Ey4Kql/BUILD/obs-studio-21.0.1/build/libobs && /usr/bin/cmake -DCONFIG=PLD -DTARGET_CONFIGS=ALL -DINPUT=/tmp/B.Ey4Kql/BUILD/obs-studio-21.0.1/additional_install_files/data/ -DOUTPUT=/tmp/B.Ey4Kql/BUILD/obs-studio-21.0.1/build/rundir/PLD/share/obs/ -P /tmp/B.Ey4Kql/BUILD/obs-studio-21.0.1/cmake/copy_helper.cmake cd /tmp/B.Ey4Kql/BUILD/obs-studio-21.0.1/build/libobs && /usr/bin/cmake -DCONFIG=PLD -DTARGET_CONFIGS=ALL -DINPUT=/tmp/B.Ey4Kql/BUILD/obs-studio-21.0.1/additional_install_files/libs64/ -DOUTPUT=/tmp/B.Ey4Kql/BUILD/obs-studio-21.0.1/build/rundir/PLD/lib64/ -P /tmp/B.Ey4Kql/BUILD/obs-studio-21.0.1/cmake/copy_helper.cmake cd /tmp/B.Ey4Kql/BUILD/obs-studio-21.0.1/build/libobs && /usr/bin/cmake -DCONFIG=PLD -DTARGET_CONFIGS=ALL -DINPUT=/tmp/B.Ey4Kql/BUILD/obs-studio-21.0.1/additional_install_files/exec64/ -DOUTPUT=/tmp/B.Ey4Kql/BUILD/obs-studio-21.0.1/build/rundir/PLD/bin/ -P /tmp/B.Ey4Kql/BUILD/obs-studio-21.0.1/cmake/copy_helper.cmake cd /tmp/B.Ey4Kql/BUILD/obs-studio-21.0.1/build/libobs && /usr/bin/cmake -DCONFIG=PLD "-DTARGET_CONFIGS=Release;MinSizeRel;RelWithDebInfo" -DINPUT=/tmp/B.Ey4Kql/BUILD/obs-studio-21.0.1/additional_install_files/exec64r/ -DOUTPUT=/tmp/B.Ey4Kql/BUILD/obs-studio-21.0.1/build/rundir/PLD/bin/ -P /tmp/B.Ey4Kql/BUILD/obs-studio-21.0.1/cmake/copy_helper.cmake cd /tmp/B.Ey4Kql/BUILD/obs-studio-21.0.1/build/libobs && /usr/bin/cmake -DCONFIG=PLD -DTARGET_CONFIGS=Debug -DINPUT=/tmp/B.Ey4Kql/BUILD/obs-studio-21.0.1/additional_install_files/exec64d/ -DOUTPUT=/tmp/B.Ey4Kql/BUILD/obs-studio-21.0.1/build/rundir/PLD/bin/ -P /tmp/B.Ey4Kql/BUILD/obs-studio-21.0.1/cmake/copy_helper.cmake cd /tmp/B.Ey4Kql/BUILD/obs-studio-21.0.1/build/libobs && /usr/bin/cmake -DCONFIG=PLD "-DTARGET_CONFIGS=Release;MinSizeRel;RelWithDebInfo" -DINPUT=/tmp/B.Ey4Kql/BUILD/obs-studio-21.0.1/additional_install_files/libs64r/ -DOUTPUT=/tmp/B.Ey4Kql/BUILD/obs-studio-21.0.1/build/rundir/PLD/lib64/ -P /tmp/B.Ey4Kql/BUILD/obs-studio-21.0.1/cmake/copy_helper.cmake cd /tmp/B.Ey4Kql/BUILD/obs-studio-21.0.1/build/libobs && /usr/bin/cmake -DCONFIG=PLD -DTARGET_CONFIGS=Debug -DINPUT=/tmp/B.Ey4Kql/BUILD/obs-studio-21.0.1/additional_install_files/libs64d/ -DOUTPUT=/tmp/B.Ey4Kql/BUILD/obs-studio-21.0.1/build/rundir/PLD/lib64/ -P /tmp/B.Ey4Kql/BUILD/obs-studio-21.0.1/cmake/copy_helper.cmake make[2]: Leaving directory '/tmp/B.Ey4Kql/BUILD/obs-studio-21.0.1/build' make[1]: Entering directory '/tmp/B.Ey4Kql/BUILD/obs-studio-21.0.1/build' [ 27%] Built target libobs make[1]: Leaving directory '/tmp/B.Ey4Kql/BUILD/obs-studio-21.0.1/build' /usr/bin/make -f deps/file-updater/CMakeFiles/file-updater.dir/build.make deps/file-updater/CMakeFiles/file-updater.dir/depend /usr/bin/make -f UI/obs-frontend-api/CMakeFiles/obs-frontend-api.dir/build.make UI/obs-frontend-api/CMakeFiles/obs-frontend-api.dir/depend /usr/bin/make -f libobs-opengl/CMakeFiles/libobs-opengl.dir/build.make libobs-opengl/CMakeFiles/libobs-opengl.dir/depend /usr/bin/make -f plugins/linux-capture/CMakeFiles/linux-capture.dir/build.make plugins/linux-capture/CMakeFiles/linux-capture.dir/depend /usr/bin/make -f plugins/linux-pulseaudio/CMakeFiles/linux-pulseaudio.dir/build.make plugins/linux-pulseaudio/CMakeFiles/linux-pulseaudio.dir/depend /usr/bin/make -f plugins/linux-v4l2/CMakeFiles/linux-v4l2.dir/build.make plugins/linux-v4l2/CMakeFiles/linux-v4l2.dir/depend /usr/bin/make -f plugins/linux-jack/CMakeFiles/linux-jack.dir/build.make plugins/linux-jack/CMakeFiles/linux-jack.dir/depend /usr/bin/make -f plugins/linux-alsa/CMakeFiles/linux-alsa.dir/build.make plugins/linux-alsa/CMakeFiles/linux-alsa.dir/depend /usr/bin/make -f plugins/decklink/linux/CMakeFiles/linux-decklink.dir/build.make plugins/decklink/linux/CMakeFiles/linux-decklink.dir/depend make[2]: Entering directory '/tmp/B.Ey4Kql/BUILD/obs-studio-21.0.1/build' cd /tmp/B.Ey4Kql/BUILD/obs-studio-21.0.1/build && /usr/bin/cmake -E cmake_depends "Unix Makefiles" /tmp/B.Ey4Kql/BUILD/obs-studio-21.0.1 /tmp/B.Ey4Kql/BUILD/obs-studio-21.0.1/UI/obs-frontend-api /tmp/B.Ey4Kql/BUILD/obs-studio-21.0.1/build /tmp/B.Ey4Kql/BUILD/obs-studio-21.0.1/build/UI/obs-frontend-api /tmp/B.Ey4Kql/BUILD/obs-studio-21.0.1/build/UI/obs-frontend-api/CMakeFiles/obs-frontend-api.dir/DependInfo.cmake --color= Scanning dependencies of target obs-frontend-api make[2]: Leaving directory '/tmp/B.Ey4Kql/BUILD/obs-studio-21.0.1/build' /usr/bin/make -f UI/obs-frontend-api/CMakeFiles/obs-frontend-api.dir/build.make UI/obs-frontend-api/CMakeFiles/obs-frontend-api.dir/build make[2]: Entering directory '/tmp/B.Ey4Kql/BUILD/obs-studio-21.0.1/build' cd /tmp/B.Ey4Kql/BUILD/obs-studio-21.0.1/build && /usr/bin/cmake -E cmake_depends "Unix Makefiles" /tmp/B.Ey4Kql/BUILD/obs-studio-21.0.1 /tmp/B.Ey4Kql/BUILD/obs-studio-21.0.1/plugins/linux-pulseaudio /tmp/B.Ey4Kql/BUILD/obs-studio-21.0.1/build /tmp/B.Ey4Kql/BUILD/obs-studio-21.0.1/build/plugins/linux-pulseaudio /tmp/B.Ey4Kql/BUILD/obs-studio-21.0.1/build/plugins/linux-pulseaudio/CMakeFiles/linux-pulseaudio.dir/DependInfo.cmake --color= Scanning dependencies of target linux-pulseaudio make[2]: Leaving directory '/tmp/B.Ey4Kql/BUILD/obs-studio-21.0.1/build' /usr/bin/make -f plugins/linux-pulseaudio/CMakeFiles/linux-pulseaudio.dir/build.make plugins/linux-pulseaudio/CMakeFiles/linux-pulseaudio.dir/build make[2]: Entering directory '/tmp/B.Ey4Kql/BUILD/obs-studio-21.0.1/build' cd /tmp/B.Ey4Kql/BUILD/obs-studio-21.0.1/build && /usr/bin/cmake -E cmake_depends "Unix Makefiles" /tmp/B.Ey4Kql/BUILD/obs-studio-21.0.1 /tmp/B.Ey4Kql/BUILD/obs-studio-21.0.1/plugins/linux-capture /tmp/B.Ey4Kql/BUILD/obs-studio-21.0.1/build /tmp/B.Ey4Kql/BUILD/obs-studio-21.0.1/build/plugins/linux-capture /tmp/B.Ey4Kql/BUILD/obs-studio-21.0.1/build/plugins/linux-capture/CMakeFiles/linux-capture.dir/DependInfo.cmake --color= Scanning dependencies of target linux-capture make[2]: Leaving directory '/tmp/B.Ey4Kql/BUILD/obs-studio-21.0.1/build' make[2]: Entering directory '/tmp/B.Ey4Kql/BUILD/obs-studio-21.0.1/build' cd /tmp/B.Ey4Kql/BUILD/obs-studio-21.0.1/build && /usr/bin/cmake -E cmake_depends "Unix Makefiles" /tmp/B.Ey4Kql/BUILD/obs-studio-21.0.1 /tmp/B.Ey4Kql/BUILD/obs-studio-21.0.1/libobs-opengl /tmp/B.Ey4Kql/BUILD/obs-studio-21.0.1/build /tmp/B.Ey4Kql/BUILD/obs-studio-21.0.1/build/libobs-opengl /tmp/B.Ey4Kql/BUILD/obs-studio-21.0.1/build/libobs-opengl/CMakeFiles/libobs-opengl.dir/DependInfo.cmake --color= Scanning dependencies of target libobs-opengl make[2]: Leaving directory '/tmp/B.Ey4Kql/BUILD/obs-studio-21.0.1/build' /usr/bin/make -f plugins/linux-capture/CMakeFiles/linux-capture.dir/build.make plugins/linux-capture/CMakeFiles/linux-capture.dir/build /usr/bin/make -f libobs-opengl/CMakeFiles/libobs-opengl.dir/build.make libobs-opengl/CMakeFiles/libobs-opengl.dir/build make[2]: Entering directory '/tmp/B.Ey4Kql/BUILD/obs-studio-21.0.1/build' cd /tmp/B.Ey4Kql/BUILD/obs-studio-21.0.1/build && /usr/bin/cmake -E cmake_depends "Unix Makefiles" /tmp/B.Ey4Kql/BUILD/obs-studio-21.0.1 /tmp/B.Ey4Kql/BUILD/obs-studio-21.0.1/plugins/linux-jack /tmp/B.Ey4Kql/BUILD/obs-studio-21.0.1/build /tmp/B.Ey4Kql/BUILD/obs-studio-21.0.1/build/plugins/linux-jack /tmp/B.Ey4Kql/BUILD/obs-studio-21.0.1/build/plugins/linux-jack/CMakeFiles/linux-jack.dir/DependInfo.cmake --color= Scanning dependencies of target linux-jack make[2]: Leaving directory '/tmp/B.Ey4Kql/BUILD/obs-studio-21.0.1/build' make[2]: Entering directory '/tmp/B.Ey4Kql/BUILD/obs-studio-21.0.1/build' cd /tmp/B.Ey4Kql/BUILD/obs-studio-21.0.1/build && /usr/bin/cmake -E cmake_depends "Unix Makefiles" /tmp/B.Ey4Kql/BUILD/obs-studio-21.0.1 /tmp/B.Ey4Kql/BUILD/obs-studio-21.0.1/deps/file-updater /tmp/B.Ey4Kql/BUILD/obs-studio-21.0.1/build /tmp/B.Ey4Kql/BUILD/obs-studio-21.0.1/build/deps/file-updater /tmp/B.Ey4Kql/BUILD/obs-studio-21.0.1/build/deps/file-updater/CMakeFiles/file-updater.dir/DependInfo.cmake --color= Scanning dependencies of target file-updater make[2]: Leaving directory '/tmp/B.Ey4Kql/BUILD/obs-studio-21.0.1/build' /usr/bin/make -f deps/file-updater/CMakeFiles/file-updater.dir/build.make deps/file-updater/CMakeFiles/file-updater.dir/build /usr/bin/make -f plugins/linux-jack/CMakeFiles/linux-jack.dir/build.make plugins/linux-jack/CMakeFiles/linux-jack.dir/build make[2]: Entering directory '/tmp/B.Ey4Kql/BUILD/obs-studio-21.0.1/build' cd /tmp/B.Ey4Kql/BUILD/obs-studio-21.0.1/build && /usr/bin/cmake -E cmake_depends "Unix Makefiles" /tmp/B.Ey4Kql/BUILD/obs-studio-21.0.1 /tmp/B.Ey4Kql/BUILD/obs-studio-21.0.1/plugins/linux-alsa /tmp/B.Ey4Kql/BUILD/obs-studio-21.0.1/build /tmp/B.Ey4Kql/BUILD/obs-studio-21.0.1/build/plugins/linux-alsa /tmp/B.Ey4Kql/BUILD/obs-studio-21.0.1/build/plugins/linux-alsa/CMakeFiles/linux-alsa.dir/DependInfo.cmake --color= Scanning dependencies of target linux-alsa make[2]: Leaving directory '/tmp/B.Ey4Kql/BUILD/obs-studio-21.0.1/build' /usr/bin/make -f plugins/linux-alsa/CMakeFiles/linux-alsa.dir/build.make plugins/linux-alsa/CMakeFiles/linux-alsa.dir/build make[2]: Entering directory '/tmp/B.Ey4Kql/BUILD/obs-studio-21.0.1/build' cd /tmp/B.Ey4Kql/BUILD/obs-studio-21.0.1/build && /usr/bin/cmake -E cmake_depends "Unix Makefiles" /tmp/B.Ey4Kql/BUILD/obs-studio-21.0.1 /tmp/B.Ey4Kql/BUILD/obs-studio-21.0.1/plugins/linux-v4l2 /tmp/B.Ey4Kql/BUILD/obs-studio-21.0.1/build /tmp/B.Ey4Kql/BUILD/obs-studio-21.0.1/build/plugins/linux-v4l2 /tmp/B.Ey4Kql/BUILD/obs-studio-21.0.1/build/plugins/linux-v4l2/CMakeFiles/linux-v4l2.dir/DependInfo.cmake --color= Scanning dependencies of target linux-v4l2 make[2]: Leaving directory '/tmp/B.Ey4Kql/BUILD/obs-studio-21.0.1/build' /usr/bin/make -f plugins/linux-v4l2/CMakeFiles/linux-v4l2.dir/build.make plugins/linux-v4l2/CMakeFiles/linux-v4l2.dir/build make[2]: Entering directory '/tmp/B.Ey4Kql/BUILD/obs-studio-21.0.1/build' cd /tmp/B.Ey4Kql/BUILD/obs-studio-21.0.1/build && /usr/bin/cmake -E cmake_depends "Unix Makefiles" /tmp/B.Ey4Kql/BUILD/obs-studio-21.0.1 /tmp/B.Ey4Kql/BUILD/obs-studio-21.0.1/plugins/decklink/linux /tmp/B.Ey4Kql/BUILD/obs-studio-21.0.1/build /tmp/B.Ey4Kql/BUILD/obs-studio-21.0.1/build/plugins/decklink/linux /tmp/B.Ey4Kql/BUILD/obs-studio-21.0.1/build/plugins/decklink/linux/CMakeFiles/linux-decklink.dir/DependInfo.cmake --color= Scanning dependencies of target linux-decklink make[2]: Leaving directory '/tmp/B.Ey4Kql/BUILD/obs-studio-21.0.1/build' /usr/bin/make -f plugins/decklink/linux/CMakeFiles/linux-decklink.dir/build.make plugins/decklink/linux/CMakeFiles/linux-decklink.dir/build make[2]: Entering directory '/tmp/B.Ey4Kql/BUILD/obs-studio-21.0.1/build' [ 28%] Building C object plugins/linux-pulseaudio/CMakeFiles/linux-pulseaudio.dir/linux-pulseaudio.c.o cd /tmp/B.Ey4Kql/BUILD/obs-studio-21.0.1/build/plugins/linux-pulseaudio && /usr/bin/x86_64-pld-linux-gcc -DHAVE_OBSCONFIG_H -DUSE_XDG -Dlinux_pulseaudio_EXPORTS -I/tmp/B.Ey4Kql/BUILD/obs-studio-21.0.1/build/config -isystem /tmp/B.Ey4Kql/BUILD/obs-studio-21.0.1/libobs -Wall -Wextra -Wno-unused-function -Werror-implicit-function-declaration -Wno-missing-braces -Wno-missing-field-initializers -std=gnu99 -fno-strict-aliasing -O2 -fwrapv -pipe -Wformat -Werror=format-security -gdwarf-4 -fno-debug-types-section -fvar-tracking-assignments -g2 -Wp,-D_FORTIFY_SOURCE=2 -fstack-protector-strong --param=ssp-buffer-size=4 -Werror=trampolines -fPIC -march=x86-64 -gdwarf-4 -fno-debug-types-section -fvar-tracking-assignments -g2 -DNDEBUG -DQT_NO_DEBUG -fPIC -mmmx -msse -msse2 -pthread -o CMakeFiles/linux-pulseaudio.dir/linux-pulseaudio.c.o -c /tmp/B.Ey4Kql/BUILD/obs-studio-21.0.1/plugins/linux-pulseaudio/linux-pulseaudio.c make[2]: Leaving directory '/tmp/B.Ey4Kql/BUILD/obs-studio-21.0.1/build' make[2]: Entering directory '/tmp/B.Ey4Kql/BUILD/obs-studio-21.0.1/build' [ 30%] Building C object plugins/linux-capture/CMakeFiles/linux-capture.dir/linux-capture.c.o cd /tmp/B.Ey4Kql/BUILD/obs-studio-21.0.1/build/plugins/linux-capture && /usr/bin/x86_64-pld-linux-gcc -DHAVE_OBSCONFIG_H -DUSE_XDG -Dlinux_capture_EXPORTS -I/tmp/B.Ey4Kql/BUILD/obs-studio-21.0.1/build/config -I/tmp/B.Ey4Kql/BUILD/obs-studio-21.0.1/deps/glad/include -isystem /tmp/B.Ey4Kql/BUILD/obs-studio-21.0.1/libobs -Wall -Wextra -Wno-unused-function -Werror-implicit-function-declaration -Wno-missing-braces -Wno-missing-field-initializers -std=gnu99 -fno-strict-aliasing -O2 -fwrapv -pipe -Wformat -Werror=format-security -gdwarf-4 -fno-debug-types-section -fvar-tracking-assignments -g2 -Wp,-D_FORTIFY_SOURCE=2 -fstack-protector-strong --param=ssp-buffer-size=4 -Werror=trampolines -fPIC -march=x86-64 -gdwarf-4 -fno-debug-types-section -fvar-tracking-assignments -g2 -DNDEBUG -DQT_NO_DEBUG -fPIC -mmmx -msse -msse2 -pthread -o CMakeFiles/linux-capture.dir/linux-capture.c.o -c /tmp/B.Ey4Kql/BUILD/obs-studio-21.0.1/plugins/linux-capture/linux-capture.c make[2]: Leaving directory '/tmp/B.Ey4Kql/BUILD/obs-studio-21.0.1/build' make[2]: Entering directory '/tmp/B.Ey4Kql/BUILD/obs-studio-21.0.1/build' [ 32%] Building C object plugins/linux-v4l2/CMakeFiles/linux-v4l2.dir/linux-v4l2.c.o cd /tmp/B.Ey4Kql/BUILD/obs-studio-21.0.1/build/plugins/linux-v4l2 && /usr/bin/x86_64-pld-linux-gcc -DHAVE_OBSCONFIG_H -DHAVE_UDEV -DUSE_XDG -Dlinux_v4l2_EXPORTS -I/tmp/B.Ey4Kql/BUILD/obs-studio-21.0.1/build/config -isystem /tmp/B.Ey4Kql/BUILD/obs-studio-21.0.1/libobs -Wall -Wextra -Wno-unused-function -Werror-implicit-function-declaration -Wno-missing-braces -Wno-missing-field-initializers -std=gnu99 -fno-strict-aliasing -O2 -fwrapv -pipe -Wformat -Werror=format-security -gdwarf-4 -fno-debug-types-section -fvar-tracking-assignments -g2 -Wp,-D_FORTIFY_SOURCE=2 -fstack-protector-strong --param=ssp-buffer-size=4 -Werror=trampolines -fPIC -march=x86-64 -gdwarf-4 -fno-debug-types-section -fvar-tracking-assignments -g2 -DNDEBUG -DQT_NO_DEBUG -fPIC -mmmx -msse -msse2 -pthread -o CMakeFiles/linux-v4l2.dir/linux-v4l2.c.o -c /tmp/B.Ey4Kql/BUILD/obs-studio-21.0.1/plugins/linux-v4l2/linux-v4l2.c make[2]: Leaving directory '/tmp/B.Ey4Kql/BUILD/obs-studio-21.0.1/build' make[2]: Entering directory '/tmp/B.Ey4Kql/BUILD/obs-studio-21.0.1/build' [ 32%] Building C object plugins/linux-jack/CMakeFiles/linux-jack.dir/linux-jack.c.o cd /tmp/B.Ey4Kql/BUILD/obs-studio-21.0.1/build/plugins/linux-jack && /usr/bin/x86_64-pld-linux-gcc -DHAVE_OBSCONFIG_H -DUSE_XDG -Dlinux_jack_EXPORTS -I/tmp/B.Ey4Kql/BUILD/obs-studio-21.0.1/build/config -isystem /tmp/B.Ey4Kql/BUILD/obs-studio-21.0.1/libobs -Wall -Wextra -Wno-unused-function -Werror-implicit-function-declaration -Wno-missing-braces -Wno-missing-field-initializers -std=gnu99 -fno-strict-aliasing -O2 -fwrapv -pipe -Wformat -Werror=format-security -gdwarf-4 -fno-debug-types-section -fvar-tracking-assignments -g2 -Wp,-D_FORTIFY_SOURCE=2 -fstack-protector-strong --param=ssp-buffer-size=4 -Werror=trampolines -fPIC -march=x86-64 -gdwarf-4 -fno-debug-types-section -fvar-tracking-assignments -g2 -DNDEBUG -DQT_NO_DEBUG -fPIC -mmmx -msse -msse2 -pthread -o CMakeFiles/linux-jack.dir/linux-jack.c.o -c /tmp/B.Ey4Kql/BUILD/obs-studio-21.0.1/plugins/linux-jack/linux-jack.c make[2]: Leaving directory '/tmp/B.Ey4Kql/BUILD/obs-studio-21.0.1/build' make[2]: Entering directory '/tmp/B.Ey4Kql/BUILD/obs-studio-21.0.1/build' [ 31%] Building C object plugins/linux-alsa/CMakeFiles/linux-alsa.dir/linux-alsa.c.o cd /tmp/B.Ey4Kql/BUILD/obs-studio-21.0.1/build/plugins/linux-alsa && /usr/bin/x86_64-pld-linux-gcc -DHAVE_OBSCONFIG_H -DUSE_XDG -Dlinux_alsa_EXPORTS -I/tmp/B.Ey4Kql/BUILD/obs-studio-21.0.1/build/config -isystem /tmp/B.Ey4Kql/BUILD/obs-studio-21.0.1/libobs -Wall -Wextra -Wno-unused-function -Werror-implicit-function-declaration -Wno-missing-braces -Wno-missing-field-initializers -std=gnu99 -fno-strict-aliasing -O2 -fwrapv -pipe -Wformat -Werror=format-security -gdwarf-4 -fno-debug-types-section -fvar-tracking-assignments -g2 -Wp,-D_FORTIFY_SOURCE=2 -fstack-protector-strong --param=ssp-buffer-size=4 -Werror=trampolines -fPIC -march=x86-64 -gdwarf-4 -fno-debug-types-section -fvar-tracking-assignments -g2 -DNDEBUG -DQT_NO_DEBUG -fPIC -mmmx -msse -msse2 -pthread -o CMakeFiles/linux-alsa.dir/linux-alsa.c.o -c /tmp/B.Ey4Kql/BUILD/obs-studio-21.0.1/plugins/linux-alsa/linux-alsa.c make[2]: Leaving directory '/tmp/B.Ey4Kql/BUILD/obs-studio-21.0.1/build' make[2]: Entering directory '/tmp/B.Ey4Kql/BUILD/obs-studio-21.0.1/build' [ 34%] Building C object plugins/linux-capture/CMakeFiles/linux-capture.dir/xcursor.c.o cd /tmp/B.Ey4Kql/BUILD/obs-studio-21.0.1/build/plugins/linux-capture && /usr/bin/x86_64-pld-linux-gcc -DHAVE_OBSCONFIG_H -DUSE_XDG -Dlinux_capture_EXPORTS -I/tmp/B.Ey4Kql/BUILD/obs-studio-21.0.1/build/config -I/tmp/B.Ey4Kql/BUILD/obs-studio-21.0.1/deps/glad/include -isystem /tmp/B.Ey4Kql/BUILD/obs-studio-21.0.1/libobs -Wall -Wextra -Wno-unused-function -Werror-implicit-function-declaration -Wno-missing-braces -Wno-missing-field-initializers -std=gnu99 -fno-strict-aliasing -O2 -fwrapv -pipe -Wformat -Werror=format-security -gdwarf-4 -fno-debug-types-section -fvar-tracking-assignments -g2 -Wp,-D_FORTIFY_SOURCE=2 -fstack-protector-strong --param=ssp-buffer-size=4 -Werror=trampolines -fPIC -march=x86-64 -gdwarf-4 -fno-debug-types-section -fvar-tracking-assignments -g2 -DNDEBUG -DQT_NO_DEBUG -fPIC -mmmx -msse -msse2 -pthread -o CMakeFiles/linux-capture.dir/xcursor.c.o -c /tmp/B.Ey4Kql/BUILD/obs-studio-21.0.1/plugins/linux-capture/xcursor.c make[2]: Leaving directory '/tmp/B.Ey4Kql/BUILD/obs-studio-21.0.1/build' make[2]: Entering directory '/tmp/B.Ey4Kql/BUILD/obs-studio-21.0.1/build' [ 34%] Building C object plugins/linux-jack/CMakeFiles/linux-jack.dir/jack-wrapper.c.o cd /tmp/B.Ey4Kql/BUILD/obs-studio-21.0.1/build/plugins/linux-jack && /usr/bin/x86_64-pld-linux-gcc -DHAVE_OBSCONFIG_H -DUSE_XDG -Dlinux_jack_EXPORTS -I/tmp/B.Ey4Kql/BUILD/obs-studio-21.0.1/build/config -isystem /tmp/B.Ey4Kql/BUILD/obs-studio-21.0.1/libobs -Wall -Wextra -Wno-unused-function -Werror-implicit-function-declaration -Wno-missing-braces -Wno-missing-field-initializers -std=gnu99 -fno-strict-aliasing -O2 -fwrapv -pipe -Wformat -Werror=format-security -gdwarf-4 -fno-debug-types-section -fvar-tracking-assignments -g2 -Wp,-D_FORTIFY_SOURCE=2 -fstack-protector-strong --param=ssp-buffer-size=4 -Werror=trampolines -fPIC -march=x86-64 -gdwarf-4 -fno-debug-types-section -fvar-tracking-assignments -g2 -DNDEBUG -DQT_NO_DEBUG -fPIC -mmmx -msse -msse2 -pthread -o CMakeFiles/linux-jack.dir/jack-wrapper.c.o -c /tmp/B.Ey4Kql/BUILD/obs-studio-21.0.1/plugins/linux-jack/jack-wrapper.c make[2]: Leaving directory '/tmp/B.Ey4Kql/BUILD/obs-studio-21.0.1/build' make[2]: Entering directory '/tmp/B.Ey4Kql/BUILD/obs-studio-21.0.1/build' [ 30%] Building C object deps/file-updater/CMakeFiles/file-updater.dir/file-updater/file-updater.c.o cd /tmp/B.Ey4Kql/BUILD/obs-studio-21.0.1/build/deps/file-updater && /usr/bin/x86_64-pld-linux-gcc -DHAVE_OBSCONFIG_H -DUSE_XDG -I/tmp/B.Ey4Kql/BUILD/obs-studio-21.0.1/deps/file-updater/. -I/tmp/B.Ey4Kql/BUILD/obs-studio-21.0.1/libobs -I/tmp/B.Ey4Kql/BUILD/obs-studio-21.0.1/build/config -Wall -Wextra -Wno-unused-function -Werror-implicit-function-declaration -Wno-missing-braces -Wno-missing-field-initializers -std=gnu99 -fno-strict-aliasing -O2 -fwrapv -pipe -Wformat -Werror=format-security -gdwarf-4 -fno-debug-types-section -fvar-tracking-assignments -g2 -Wp,-D_FORTIFY_SOURCE=2 -fstack-protector-strong --param=ssp-buffer-size=4 -Werror=trampolines -fPIC -march=x86-64 -gdwarf-4 -fno-debug-types-section -fvar-tracking-assignments -g2 -DNDEBUG -DQT_NO_DEBUG -fPIC -mmmx -msse -msse2 -pthread -o CMakeFiles/file-updater.dir/file-updater/file-updater.c.o -c /tmp/B.Ey4Kql/BUILD/obs-studio-21.0.1/deps/file-updater/file-updater/file-updater.c make[2]: Leaving directory '/tmp/B.Ey4Kql/BUILD/obs-studio-21.0.1/build' make[2]: Entering directory '/tmp/B.Ey4Kql/BUILD/obs-studio-21.0.1/build' [ 34%] Building C object plugins/linux-pulseaudio/CMakeFiles/linux-pulseaudio.dir/pulse-wrapper.c.o cd /tmp/B.Ey4Kql/BUILD/obs-studio-21.0.1/build/plugins/linux-pulseaudio && /usr/bin/x86_64-pld-linux-gcc -DHAVE_OBSCONFIG_H -DUSE_XDG -Dlinux_pulseaudio_EXPORTS -I/tmp/B.Ey4Kql/BUILD/obs-studio-21.0.1/build/config -isystem /tmp/B.Ey4Kql/BUILD/obs-studio-21.0.1/libobs -Wall -Wextra -Wno-unused-function -Werror-implicit-function-declaration -Wno-missing-braces -Wno-missing-field-initializers -std=gnu99 -fno-strict-aliasing -O2 -fwrapv -pipe -Wformat -Werror=format-security -gdwarf-4 -fno-debug-types-section -fvar-tracking-assignments -g2 -Wp,-D_FORTIFY_SOURCE=2 -fstack-protector-strong --param=ssp-buffer-size=4 -Werror=trampolines -fPIC -march=x86-64 -gdwarf-4 -fno-debug-types-section -fvar-tracking-assignments -g2 -DNDEBUG -DQT_NO_DEBUG -fPIC -mmmx -msse -msse2 -pthread -o CMakeFiles/linux-pulseaudio.dir/pulse-wrapper.c.o -c /tmp/B.Ey4Kql/BUILD/obs-studio-21.0.1/plugins/linux-pulseaudio/pulse-wrapper.c make[2]: Leaving directory '/tmp/B.Ey4Kql/BUILD/obs-studio-21.0.1/build' make[2]: Entering directory '/tmp/B.Ey4Kql/BUILD/obs-studio-21.0.1/build' [ 29%] Building C object libobs-opengl/CMakeFiles/libobs-opengl.dir/gl-x11.c.o cd /tmp/B.Ey4Kql/BUILD/obs-studio-21.0.1/build/libobs-opengl && /usr/bin/x86_64-pld-linux-gcc -DHAVE_OBSCONFIG_H -DLIBOBS_EXPORTS -DUSE_XDG -Dlibobs_opengl_EXPORTS -I/tmp/B.Ey4Kql/BUILD/obs-studio-21.0.1/libobs -I/tmp/B.Ey4Kql/BUILD/obs-studio-21.0.1/build/config -I/tmp/B.Ey4Kql/BUILD/obs-studio-21.0.1/deps/glad/include -Wall -Wextra -Wno-unused-function -Werror-implicit-function-declaration -Wno-missing-braces -Wno-missing-field-initializers -std=gnu99 -fno-strict-aliasing -O2 -fwrapv -pipe -Wformat -Werror=format-security -gdwarf-4 -fno-debug-types-section -fvar-tracking-assignments -g2 -Wp,-D_FORTIFY_SOURCE=2 -fstack-protector-strong --param=ssp-buffer-size=4 -Werror=trampolines -fPIC -march=x86-64 -gdwarf-4 -fno-debug-types-section -fvar-tracking-assignments -g2 -DNDEBUG -DQT_NO_DEBUG -fPIC -mmmx -msse -msse2 -pthread -o CMakeFiles/libobs-opengl.dir/gl-x11.c.o -c /tmp/B.Ey4Kql/BUILD/obs-studio-21.0.1/libobs-opengl/gl-x11.c make[2]: Leaving directory '/tmp/B.Ey4Kql/BUILD/obs-studio-21.0.1/build' make[2]: Entering directory '/tmp/B.Ey4Kql/BUILD/obs-studio-21.0.1/build' [ 36%] Linking C static library libfile-updater.a cd /tmp/B.Ey4Kql/BUILD/obs-studio-21.0.1/build/deps/file-updater && /usr/bin/cmake -P CMakeFiles/file-updater.dir/cmake_clean_target.cmake cd /tmp/B.Ey4Kql/BUILD/obs-studio-21.0.1/build/deps/file-updater && /usr/bin/cmake -E cmake_link_script CMakeFiles/file-updater.dir/link.txt --verbose=1 /usr/bin/ar qc libfile-updater.a CMakeFiles/file-updater.dir/file-updater/file-updater.c.o /usr/bin/ranlib libfile-updater.a make[2]: Leaving directory '/tmp/B.Ey4Kql/BUILD/obs-studio-21.0.1/build' make[1]: Entering directory '/tmp/B.Ey4Kql/BUILD/obs-studio-21.0.1/build' [ 36%] Built target file-updater make[1]: Leaving directory '/tmp/B.Ey4Kql/BUILD/obs-studio-21.0.1/build' /usr/bin/make -f plugins/vlc-video/CMakeFiles/vlc-video.dir/build.make plugins/vlc-video/CMakeFiles/vlc-video.dir/depend make[2]: Entering directory '/tmp/B.Ey4Kql/BUILD/obs-studio-21.0.1/build' [ 34%] Building C object plugins/linux-alsa/CMakeFiles/linux-alsa.dir/alsa-input.c.o cd /tmp/B.Ey4Kql/BUILD/obs-studio-21.0.1/build/plugins/linux-alsa && /usr/bin/x86_64-pld-linux-gcc -DHAVE_OBSCONFIG_H -DUSE_XDG -Dlinux_alsa_EXPORTS -I/tmp/B.Ey4Kql/BUILD/obs-studio-21.0.1/build/config -isystem /tmp/B.Ey4Kql/BUILD/obs-studio-21.0.1/libobs -Wall -Wextra -Wno-unused-function -Werror-implicit-function-declaration -Wno-missing-braces -Wno-missing-field-initializers -std=gnu99 -fno-strict-aliasing -O2 -fwrapv -pipe -Wformat -Werror=format-security -gdwarf-4 -fno-debug-types-section -fvar-tracking-assignments -g2 -Wp,-D_FORTIFY_SOURCE=2 -fstack-protector-strong --param=ssp-buffer-size=4 -Werror=trampolines -fPIC -march=x86-64 -gdwarf-4 -fno-debug-types-section -fvar-tracking-assignments -g2 -DNDEBUG -DQT_NO_DEBUG -fPIC -mmmx -msse -msse2 -pthread -o CMakeFiles/linux-alsa.dir/alsa-input.c.o -c /tmp/B.Ey4Kql/BUILD/obs-studio-21.0.1/plugins/linux-alsa/alsa-input.c make[2]: Leaving directory '/tmp/B.Ey4Kql/BUILD/obs-studio-21.0.1/build' make[2]: Entering directory '/tmp/B.Ey4Kql/BUILD/obs-studio-21.0.1/build' [ 35%] Building C object plugins/linux-jack/CMakeFiles/linux-jack.dir/jack-input.c.o cd /tmp/B.Ey4Kql/BUILD/obs-studio-21.0.1/build/plugins/linux-jack && /usr/bin/x86_64-pld-linux-gcc -DHAVE_OBSCONFIG_H -DUSE_XDG -Dlinux_jack_EXPORTS -I/tmp/B.Ey4Kql/BUILD/obs-studio-21.0.1/build/config -isystem /tmp/B.Ey4Kql/BUILD/obs-studio-21.0.1/libobs -Wall -Wextra -Wno-unused-function -Werror-implicit-function-declaration -Wno-missing-braces -Wno-missing-field-initializers -std=gnu99 -fno-strict-aliasing -O2 -fwrapv -pipe -Wformat -Werror=format-security -gdwarf-4 -fno-debug-types-section -fvar-tracking-assignments -g2 -Wp,-D_FORTIFY_SOURCE=2 -fstack-protector-strong --param=ssp-buffer-size=4 -Werror=trampolines -fPIC -march=x86-64 -gdwarf-4 -fno-debug-types-section -fvar-tracking-assignments -g2 -DNDEBUG -DQT_NO_DEBUG -fPIC -mmmx -msse -msse2 -pthread -o CMakeFiles/linux-jack.dir/jack-input.c.o -c /tmp/B.Ey4Kql/BUILD/obs-studio-21.0.1/plugins/linux-jack/jack-input.c make[2]: Leaving directory '/tmp/B.Ey4Kql/BUILD/obs-studio-21.0.1/build' make[2]: Entering directory '/tmp/B.Ey4Kql/BUILD/obs-studio-21.0.1/build' cd /tmp/B.Ey4Kql/BUILD/obs-studio-21.0.1/build && /usr/bin/cmake -E cmake_depends "Unix Makefiles" /tmp/B.Ey4Kql/BUILD/obs-studio-21.0.1 /tmp/B.Ey4Kql/BUILD/obs-studio-21.0.1/plugins/vlc-video /tmp/B.Ey4Kql/BUILD/obs-studio-21.0.1/build /tmp/B.Ey4Kql/BUILD/obs-studio-21.0.1/build/plugins/vlc-video /tmp/B.Ey4Kql/BUILD/obs-studio-21.0.1/build/plugins/vlc-video/CMakeFiles/vlc-video.dir/DependInfo.cmake --color= Scanning dependencies of target vlc-video make[2]: Leaving directory '/tmp/B.Ey4Kql/BUILD/obs-studio-21.0.1/build' /usr/bin/make -f plugins/vlc-video/CMakeFiles/vlc-video.dir/build.make plugins/vlc-video/CMakeFiles/vlc-video.dir/build make[2]: Entering directory '/tmp/B.Ey4Kql/BUILD/obs-studio-21.0.1/build' [ 36%] Linking C shared module linux-jack.so cd /tmp/B.Ey4Kql/BUILD/obs-studio-21.0.1/build/plugins/linux-jack && /usr/bin/cmake -E cmake_link_script CMakeFiles/linux-jack.dir/link.txt --verbose=1 /usr/bin/x86_64-pld-linux-gcc -fPIC -Wall -Wextra -Wno-unused-function -Werror-implicit-function-declaration -Wno-missing-braces -Wno-missing-field-initializers -std=gnu99 -fno-strict-aliasing -O2 -fwrapv -pipe -Wformat -Werror=format-security -gdwarf-4 -fno-debug-types-section -fvar-tracking-assignments -g2 -Wp,-D_FORTIFY_SOURCE=2 -fstack-protector-strong --param=ssp-buffer-size=4 -Werror=trampolines -fPIC -march=x86-64 -gdwarf-4 -fno-debug-types-section -fvar-tracking-assignments -g2 -DNDEBUG -DQT_NO_DEBUG -Wl,--as-needed -Wl,--no-copy-dt-needed-entries -Wl,-z,relro -Wl,-z,combreloc -shared -o linux-jack.so CMakeFiles/linux-jack.dir/linux-jack.c.o CMakeFiles/linux-jack.dir/jack-wrapper.c.o CMakeFiles/linux-jack.dir/jack-input.c.o -Wl,-rpath,/tmp/B.Ey4Kql/BUILD/obs-studio-21.0.1/build/libobs: ../../libobs/libobs.so.0 -ljack -pthread cd /tmp/B.Ey4Kql/BUILD/obs-studio-21.0.1/build/plugins/linux-jack && /usr/bin/cmake -E copy /tmp/B.Ey4Kql/BUILD/obs-studio-21.0.1/build/plugins/linux-jack/linux-jack.so /tmp/B.Ey4Kql/BUILD/obs-studio-21.0.1/build/rundir/PLD/obs-plugins/64bit/linux-jack.so cd /tmp/B.Ey4Kql/BUILD/obs-studio-21.0.1/build/plugins/linux-jack && /usr/bin/cmake -E copy_directory /tmp/B.Ey4Kql/BUILD/obs-studio-21.0.1/plugins/linux-jack/data /tmp/B.Ey4Kql/BUILD/obs-studio-21.0.1/build/rundir/PLD/data/obs-plugins/linux-jack make[2]: Leaving directory '/tmp/B.Ey4Kql/BUILD/obs-studio-21.0.1/build' make[2]: Entering directory '/tmp/B.Ey4Kql/BUILD/obs-studio-21.0.1/build' [ 36%] Linking C shared module linux-alsa.so cd /tmp/B.Ey4Kql/BUILD/obs-studio-21.0.1/build/plugins/linux-alsa && /usr/bin/cmake -E cmake_link_script CMakeFiles/linux-alsa.dir/link.txt --verbose=1 /usr/bin/x86_64-pld-linux-gcc -fPIC -Wall -Wextra -Wno-unused-function -Werror-implicit-function-declaration -Wno-missing-braces -Wno-missing-field-initializers -std=gnu99 -fno-strict-aliasing -O2 -fwrapv -pipe -Wformat -Werror=format-security -gdwarf-4 -fno-debug-types-section -fvar-tracking-assignments -g2 -Wp,-D_FORTIFY_SOURCE=2 -fstack-protector-strong --param=ssp-buffer-size=4 -Werror=trampolines -fPIC -march=x86-64 -gdwarf-4 -fno-debug-types-section -fvar-tracking-assignments -g2 -DNDEBUG -DQT_NO_DEBUG -Wl,--as-needed -Wl,--no-copy-dt-needed-entries -Wl,-z,relro -Wl,-z,combreloc -shared -o linux-alsa.so CMakeFiles/linux-alsa.dir/linux-alsa.c.o CMakeFiles/linux-alsa.dir/alsa-input.c.o -Wl,-rpath,/tmp/B.Ey4Kql/BUILD/obs-studio-21.0.1/build/libobs: ../../libobs/libobs.so.0 -lasound -pthread cd /tmp/B.Ey4Kql/BUILD/obs-studio-21.0.1/build/plugins/linux-alsa && /usr/bin/cmake -E copy /tmp/B.Ey4Kql/BUILD/obs-studio-21.0.1/build/plugins/linux-alsa/linux-alsa.so /tmp/B.Ey4Kql/BUILD/obs-studio-21.0.1/build/rundir/PLD/obs-plugins/64bit/linux-alsa.so cd /tmp/B.Ey4Kql/BUILD/obs-studio-21.0.1/build/plugins/linux-alsa && /usr/bin/cmake -E copy_directory /tmp/B.Ey4Kql/BUILD/obs-studio-21.0.1/plugins/linux-alsa/data /tmp/B.Ey4Kql/BUILD/obs-studio-21.0.1/build/rundir/PLD/data/obs-plugins/linux-alsa make[2]: Leaving directory '/tmp/B.Ey4Kql/BUILD/obs-studio-21.0.1/build' make[1]: Entering directory '/tmp/B.Ey4Kql/BUILD/obs-studio-21.0.1/build' [ 36%] Built target linux-jack make[1]: Leaving directory '/tmp/B.Ey4Kql/BUILD/obs-studio-21.0.1/build' /usr/bin/make -f plugins/image-source/CMakeFiles/image-source.dir/build.make plugins/image-source/CMakeFiles/image-source.dir/depend make[1]: Entering directory '/tmp/B.Ey4Kql/BUILD/obs-studio-21.0.1/build' [ 36%] Built target linux-alsa make[1]: Leaving directory '/tmp/B.Ey4Kql/BUILD/obs-studio-21.0.1/build' make[2]: Entering directory '/tmp/B.Ey4Kql/BUILD/obs-studio-21.0.1/build' [ 34%] Building C object plugins/linux-capture/CMakeFiles/linux-capture.dir/xcursor-xcb.c.o cd /tmp/B.Ey4Kql/BUILD/obs-studio-21.0.1/build/plugins/linux-capture && /usr/bin/x86_64-pld-linux-gcc -DHAVE_OBSCONFIG_H -DUSE_XDG -Dlinux_capture_EXPORTS -I/tmp/B.Ey4Kql/BUILD/obs-studio-21.0.1/build/config -I/tmp/B.Ey4Kql/BUILD/obs-studio-21.0.1/deps/glad/include -isystem /tmp/B.Ey4Kql/BUILD/obs-studio-21.0.1/libobs -Wall -Wextra -Wno-unused-function -Werror-implicit-function-declaration -Wno-missing-braces -Wno-missing-field-initializers -std=gnu99 -fno-strict-aliasing -O2 -fwrapv -pipe -Wformat -Werror=format-security -gdwarf-4 -fno-debug-types-section -fvar-tracking-assignments -g2 -Wp,-D_FORTIFY_SOURCE=2 -fstack-protector-strong --param=ssp-buffer-size=4 -Werror=trampolines -fPIC -march=x86-64 -gdwarf-4 -fno-debug-types-section -fvar-tracking-assignments -g2 -DNDEBUG -DQT_NO_DEBUG -fPIC -mmmx -msse -msse2 -pthread -o CMakeFiles/linux-capture.dir/xcursor-xcb.c.o -c /tmp/B.Ey4Kql/BUILD/obs-studio-21.0.1/plugins/linux-capture/xcursor-xcb.c make[2]: Leaving directory '/tmp/B.Ey4Kql/BUILD/obs-studio-21.0.1/build' make[2]: Entering directory '/tmp/B.Ey4Kql/BUILD/obs-studio-21.0.1/build' cd /tmp/B.Ey4Kql/BUILD/obs-studio-21.0.1/build && /usr/bin/cmake -E cmake_depends "Unix Makefiles" /tmp/B.Ey4Kql/BUILD/obs-studio-21.0.1 /tmp/B.Ey4Kql/BUILD/obs-studio-21.0.1/plugins/image-source /tmp/B.Ey4Kql/BUILD/obs-studio-21.0.1/build /tmp/B.Ey4Kql/BUILD/obs-studio-21.0.1/build/plugins/image-source /tmp/B.Ey4Kql/BUILD/obs-studio-21.0.1/build/plugins/image-source/CMakeFiles/image-source.dir/DependInfo.cmake --color= Scanning dependencies of target image-source make[2]: Leaving directory '/tmp/B.Ey4Kql/BUILD/obs-studio-21.0.1/build' make[2]: Entering directory '/tmp/B.Ey4Kql/BUILD/obs-studio-21.0.1/build' [ 34%] Building C object plugins/linux-v4l2/CMakeFiles/linux-v4l2.dir/v4l2-input.c.o cd /tmp/B.Ey4Kql/BUILD/obs-studio-21.0.1/build/plugins/linux-v4l2 && /usr/bin/x86_64-pld-linux-gcc -DHAVE_OBSCONFIG_H -DHAVE_UDEV -DUSE_XDG -Dlinux_v4l2_EXPORTS -I/tmp/B.Ey4Kql/BUILD/obs-studio-21.0.1/build/config -isystem /tmp/B.Ey4Kql/BUILD/obs-studio-21.0.1/libobs -Wall -Wextra -Wno-unused-function -Werror-implicit-function-declaration -Wno-missing-braces -Wno-missing-field-initializers -std=gnu99 -fno-strict-aliasing -O2 -fwrapv -pipe -Wformat -Werror=format-security -gdwarf-4 -fno-debug-types-section -fvar-tracking-assignments -g2 -Wp,-D_FORTIFY_SOURCE=2 -fstack-protector-strong --param=ssp-buffer-size=4 -Werror=trampolines -fPIC -march=x86-64 -gdwarf-4 -fno-debug-types-section -fvar-tracking-assignments -g2 -DNDEBUG -DQT_NO_DEBUG -fPIC -mmmx -msse -msse2 -pthread -o CMakeFiles/linux-v4l2.dir/v4l2-input.c.o -c /tmp/B.Ey4Kql/BUILD/obs-studio-21.0.1/plugins/linux-v4l2/v4l2-input.c make[2]: Leaving directory '/tmp/B.Ey4Kql/BUILD/obs-studio-21.0.1/build' make[2]: Entering directory '/tmp/B.Ey4Kql/BUILD/obs-studio-21.0.1/build' [ 36%] Building C object plugins/linux-pulseaudio/CMakeFiles/linux-pulseaudio.dir/pulse-input.c.o cd /tmp/B.Ey4Kql/BUILD/obs-studio-21.0.1/build/plugins/linux-pulseaudio && /usr/bin/x86_64-pld-linux-gcc -DHAVE_OBSCONFIG_H -DUSE_XDG -Dlinux_pulseaudio_EXPORTS -I/tmp/B.Ey4Kql/BUILD/obs-studio-21.0.1/build/config -isystem /tmp/B.Ey4Kql/BUILD/obs-studio-21.0.1/libobs -Wall -Wextra -Wno-unused-function -Werror-implicit-function-declaration -Wno-missing-braces -Wno-missing-field-initializers -std=gnu99 -fno-strict-aliasing -O2 -fwrapv -pipe -Wformat -Werror=format-security -gdwarf-4 -fno-debug-types-section -fvar-tracking-assignments -g2 -Wp,-D_FORTIFY_SOURCE=2 -fstack-protector-strong --param=ssp-buffer-size=4 -Werror=trampolines -fPIC -march=x86-64 -gdwarf-4 -fno-debug-types-section -fvar-tracking-assignments -g2 -DNDEBUG -DQT_NO_DEBUG -fPIC -mmmx -msse -msse2 -pthread -o CMakeFiles/linux-pulseaudio.dir/pulse-input.c.o -c /tmp/B.Ey4Kql/BUILD/obs-studio-21.0.1/plugins/linux-pulseaudio/pulse-input.c make[2]: Leaving directory '/tmp/B.Ey4Kql/BUILD/obs-studio-21.0.1/build' make[2]: Entering directory '/tmp/B.Ey4Kql/BUILD/obs-studio-21.0.1/build' [ 36%] Building C object plugins/vlc-video/CMakeFiles/vlc-video.dir/vlc-video-plugin.c.o cd /tmp/B.Ey4Kql/BUILD/obs-studio-21.0.1/build/plugins/vlc-video && /usr/bin/x86_64-pld-linux-gcc -DHAVE_OBSCONFIG_H -DUSE_XDG -Dvlc_video_EXPORTS -I/usr/include/vlc -I/tmp/B.Ey4Kql/BUILD/obs-studio-21.0.1/libobs -I/tmp/B.Ey4Kql/BUILD/obs-studio-21.0.1/build/config -Wall -Wextra -Wno-unused-function -Werror-implicit-function-declaration -Wno-missing-braces -Wno-missing-field-initializers -std=gnu99 -fno-strict-aliasing -O2 -fwrapv -pipe -Wformat -Werror=format-security -gdwarf-4 -fno-debug-types-section -fvar-tracking-assignments -g2 -Wp,-D_FORTIFY_SOURCE=2 -fstack-protector-strong --param=ssp-buffer-size=4 -Werror=trampolines -fPIC -march=x86-64 -gdwarf-4 -fno-debug-types-section -fvar-tracking-assignments -g2 -DNDEBUG -DQT_NO_DEBUG -fPIC -mmmx -msse -msse2 -pthread -o CMakeFiles/vlc-video.dir/vlc-video-plugin.c.o -c /tmp/B.Ey4Kql/BUILD/obs-studio-21.0.1/plugins/vlc-video/vlc-video-plugin.c make[2]: Leaving directory '/tmp/B.Ey4Kql/BUILD/obs-studio-21.0.1/build' make[2]: Entering directory '/tmp/B.Ey4Kql/BUILD/obs-studio-21.0.1/build' [ 36%] Building C object libobs-opengl/CMakeFiles/libobs-opengl.dir/gl-helpers.c.o cd /tmp/B.Ey4Kql/BUILD/obs-studio-21.0.1/build/libobs-opengl && /usr/bin/x86_64-pld-linux-gcc -DHAVE_OBSCONFIG_H -DLIBOBS_EXPORTS -DUSE_XDG -Dlibobs_opengl_EXPORTS -I/tmp/B.Ey4Kql/BUILD/obs-studio-21.0.1/libobs -I/tmp/B.Ey4Kql/BUILD/obs-studio-21.0.1/build/config -I/tmp/B.Ey4Kql/BUILD/obs-studio-21.0.1/deps/glad/include -Wall -Wextra -Wno-unused-function -Werror-implicit-function-declaration -Wno-missing-braces -Wno-missing-field-initializers -std=gnu99 -fno-strict-aliasing -O2 -fwrapv -pipe -Wformat -Werror=format-security -gdwarf-4 -fno-debug-types-section -fvar-tracking-assignments -g2 -Wp,-D_FORTIFY_SOURCE=2 -fstack-protector-strong --param=ssp-buffer-size=4 -Werror=trampolines -fPIC -march=x86-64 -gdwarf-4 -fno-debug-types-section -fvar-tracking-assignments -g2 -DNDEBUG -DQT_NO_DEBUG -fPIC -mmmx -msse -msse2 -pthread -o CMakeFiles/libobs-opengl.dir/gl-helpers.c.o -c /tmp/B.Ey4Kql/BUILD/obs-studio-21.0.1/libobs-opengl/gl-helpers.c make[2]: Leaving directory '/tmp/B.Ey4Kql/BUILD/obs-studio-21.0.1/build' make[2]: Entering directory '/tmp/B.Ey4Kql/BUILD/obs-studio-21.0.1/build' [ 37%] Linking C shared module linux-pulseaudio.so cd /tmp/B.Ey4Kql/BUILD/obs-studio-21.0.1/build/plugins/linux-pulseaudio && /usr/bin/cmake -E cmake_link_script CMakeFiles/linux-pulseaudio.dir/link.txt --verbose=1 /usr/bin/x86_64-pld-linux-gcc -fPIC -Wall -Wextra -Wno-unused-function -Werror-implicit-function-declaration -Wno-missing-braces -Wno-missing-field-initializers -std=gnu99 -fno-strict-aliasing -O2 -fwrapv -pipe -Wformat -Werror=format-security -gdwarf-4 -fno-debug-types-section -fvar-tracking-assignments -g2 -Wp,-D_FORTIFY_SOURCE=2 -fstack-protector-strong --param=ssp-buffer-size=4 -Werror=trampolines -fPIC -march=x86-64 -gdwarf-4 -fno-debug-types-section -fvar-tracking-assignments -g2 -DNDEBUG -DQT_NO_DEBUG -Wl,--as-needed -Wl,--no-copy-dt-needed-entries -Wl,-z,relro -Wl,-z,combreloc -shared -o linux-pulseaudio.so CMakeFiles/linux-pulseaudio.dir/linux-pulseaudio.c.o CMakeFiles/linux-pulseaudio.dir/pulse-wrapper.c.o CMakeFiles/linux-pulseaudio.dir/pulse-input.c.o -Wl,-rpath,/tmp/B.Ey4Kql/BUILD/obs-studio-21.0.1/build/libobs: ../../libobs/libobs.so.0 -lpulse -pthread cd /tmp/B.Ey4Kql/BUILD/obs-studio-21.0.1/build/plugins/linux-pulseaudio && /usr/bin/cmake -E copy /tmp/B.Ey4Kql/BUILD/obs-studio-21.0.1/build/plugins/linux-pulseaudio/linux-pulseaudio.so /tmp/B.Ey4Kql/BUILD/obs-studio-21.0.1/build/rundir/PLD/obs-plugins/64bit/linux-pulseaudio.so cd /tmp/B.Ey4Kql/BUILD/obs-studio-21.0.1/build/plugins/linux-pulseaudio && /usr/bin/cmake -E copy_directory /tmp/B.Ey4Kql/BUILD/obs-studio-21.0.1/plugins/linux-pulseaudio/data /tmp/B.Ey4Kql/BUILD/obs-studio-21.0.1/build/rundir/PLD/data/obs-plugins/linux-pulseaudio make[2]: Leaving directory '/tmp/B.Ey4Kql/BUILD/obs-studio-21.0.1/build' make[2]: Entering directory '/tmp/B.Ey4Kql/BUILD/obs-studio-21.0.1/build' [ 37%] Building C object plugins/linux-capture/CMakeFiles/linux-capture.dir/xhelpers.c.o cd /tmp/B.Ey4Kql/BUILD/obs-studio-21.0.1/build/plugins/linux-capture && /usr/bin/x86_64-pld-linux-gcc -DHAVE_OBSCONFIG_H -DUSE_XDG -Dlinux_capture_EXPORTS -I/tmp/B.Ey4Kql/BUILD/obs-studio-21.0.1/build/config -I/tmp/B.Ey4Kql/BUILD/obs-studio-21.0.1/deps/glad/include -isystem /tmp/B.Ey4Kql/BUILD/obs-studio-21.0.1/libobs -Wall -Wextra -Wno-unused-function -Werror-implicit-function-declaration -Wno-missing-braces -Wno-missing-field-initializers -std=gnu99 -fno-strict-aliasing -O2 -fwrapv -pipe -Wformat -Werror=format-security -gdwarf-4 -fno-debug-types-section -fvar-tracking-assignments -g2 -Wp,-D_FORTIFY_SOURCE=2 -fstack-protector-strong --param=ssp-buffer-size=4 -Werror=trampolines -fPIC -march=x86-64 -gdwarf-4 -fno-debug-types-section -fvar-tracking-assignments -g2 -DNDEBUG -DQT_NO_DEBUG -fPIC -mmmx -msse -msse2 -pthread -o CMakeFiles/linux-capture.dir/xhelpers.c.o -c /tmp/B.Ey4Kql/BUILD/obs-studio-21.0.1/plugins/linux-capture/xhelpers.c make[2]: Leaving directory '/tmp/B.Ey4Kql/BUILD/obs-studio-21.0.1/build' make[2]: Entering directory '/tmp/B.Ey4Kql/BUILD/obs-studio-21.0.1/build' [ 37%] Building C object libobs-opengl/CMakeFiles/libobs-opengl.dir/gl-indexbuffer.c.o cd /tmp/B.Ey4Kql/BUILD/obs-studio-21.0.1/build/libobs-opengl && /usr/bin/x86_64-pld-linux-gcc -DHAVE_OBSCONFIG_H -DLIBOBS_EXPORTS -DUSE_XDG -Dlibobs_opengl_EXPORTS -I/tmp/B.Ey4Kql/BUILD/obs-studio-21.0.1/libobs -I/tmp/B.Ey4Kql/BUILD/obs-studio-21.0.1/build/config -I/tmp/B.Ey4Kql/BUILD/obs-studio-21.0.1/deps/glad/include -Wall -Wextra -Wno-unused-function -Werror-implicit-function-declaration -Wno-missing-braces -Wno-missing-field-initializers -std=gnu99 -fno-strict-aliasing -O2 -fwrapv -pipe -Wformat -Werror=format-security -gdwarf-4 -fno-debug-types-section -fvar-tracking-assignments -g2 -Wp,-D_FORTIFY_SOURCE=2 -fstack-protector-strong --param=ssp-buffer-size=4 -Werror=trampolines -fPIC -march=x86-64 -gdwarf-4 -fno-debug-types-section -fvar-tracking-assignments -g2 -DNDEBUG -DQT_NO_DEBUG -fPIC -mmmx -msse -msse2 -pthread -o CMakeFiles/libobs-opengl.dir/gl-indexbuffer.c.o -c /tmp/B.Ey4Kql/BUILD/obs-studio-21.0.1/libobs-opengl/gl-indexbuffer.c make[2]: Leaving directory '/tmp/B.Ey4Kql/BUILD/obs-studio-21.0.1/build' make[2]: Entering directory '/tmp/B.Ey4Kql/BUILD/obs-studio-21.0.1/build' [ 37%] Building C object plugins/linux-v4l2/CMakeFiles/linux-v4l2.dir/v4l2-helpers.c.o cd /tmp/B.Ey4Kql/BUILD/obs-studio-21.0.1/build/plugins/linux-v4l2 && /usr/bin/x86_64-pld-linux-gcc -DHAVE_OBSCONFIG_H -DHAVE_UDEV -DUSE_XDG -Dlinux_v4l2_EXPORTS -I/tmp/B.Ey4Kql/BUILD/obs-studio-21.0.1/build/config -isystem /tmp/B.Ey4Kql/BUILD/obs-studio-21.0.1/libobs -Wall -Wextra -Wno-unused-function -Werror-implicit-function-declaration -Wno-missing-braces -Wno-missing-field-initializers -std=gnu99 -fno-strict-aliasing -O2 -fwrapv -pipe -Wformat -Werror=format-security -gdwarf-4 -fno-debug-types-section -fvar-tracking-assignments -g2 -Wp,-D_FORTIFY_SOURCE=2 -fstack-protector-strong --param=ssp-buffer-size=4 -Werror=trampolines -fPIC -march=x86-64 -gdwarf-4 -fno-debug-types-section -fvar-tracking-assignments -g2 -DNDEBUG -DQT_NO_DEBUG -fPIC -mmmx -msse -msse2 -pthread -o CMakeFiles/linux-v4l2.dir/v4l2-helpers.c.o -c /tmp/B.Ey4Kql/BUILD/obs-studio-21.0.1/plugins/linux-v4l2/v4l2-helpers.c make[2]: Leaving directory '/tmp/B.Ey4Kql/BUILD/obs-studio-21.0.1/build' /usr/bin/make -f plugins/obs-x264/CMakeFiles/obs-x264.dir/build.make plugins/obs-x264/CMakeFiles/obs-x264.dir/depend /usr/bin/make -f plugins/image-source/CMakeFiles/image-source.dir/build.make plugins/image-source/CMakeFiles/image-source.dir/build make[2]: Entering directory '/tmp/B.Ey4Kql/BUILD/obs-studio-21.0.1/build' [ 33%] Building CXX object plugins/decklink/linux/CMakeFiles/linux-decklink.dir/__/plugin-main.cpp.o cd /tmp/B.Ey4Kql/BUILD/obs-studio-21.0.1/build/plugins/decklink/linux && /usr/bin/x86_64-pld-linux-g++ -DHAVE_OBSCONFIG_H -DUSE_XDG -Dlinux_decklink_EXPORTS -I/tmp/B.Ey4Kql/BUILD/obs-studio-21.0.1/libobs -I/tmp/B.Ey4Kql/BUILD/obs-studio-21.0.1/build/config -Wall -Wextra -Wno-unused-function -Werror-implicit-function-declaration -Wno-missing-field-initializers -std=gnu++11 -fno-strict-aliasing -O2 -fwrapv -pipe -Wformat -Werror=format-security -gdwarf-4 -fno-debug-types-section -fvar-tracking-assignments -g2 -Wp,-D_FORTIFY_SOURCE=2 -fstack-protector-strong --param=ssp-buffer-size=4 -Werror=trampolines -fPIC -march=x86-64 -gdwarf-4 -fno-debug-types-section -fvar-tracking-assignments -g2 -DNDEBUG -DQT_NO_DEBUG -fPIC -mmmx -msse -msse2 -pthread -o CMakeFiles/linux-decklink.dir/__/plugin-main.cpp.o -c /tmp/B.Ey4Kql/BUILD/obs-studio-21.0.1/plugins/decklink/plugin-main.cpp make[2]: Leaving directory '/tmp/B.Ey4Kql/BUILD/obs-studio-21.0.1/build' make[1]: Entering directory '/tmp/B.Ey4Kql/BUILD/obs-studio-21.0.1/build' [ 39%] Built target linux-pulseaudio make[1]: Leaving directory '/tmp/B.Ey4Kql/BUILD/obs-studio-21.0.1/build' /usr/bin/make -f plugins/obs-libfdk/CMakeFiles/obs-libfdk.dir/build.make plugins/obs-libfdk/CMakeFiles/obs-libfdk.dir/depend make[2]: Entering directory '/tmp/B.Ey4Kql/BUILD/obs-studio-21.0.1/build' cd /tmp/B.Ey4Kql/BUILD/obs-studio-21.0.1/build && /usr/bin/cmake -E cmake_depends "Unix Makefiles" /tmp/B.Ey4Kql/BUILD/obs-studio-21.0.1 /tmp/B.Ey4Kql/BUILD/obs-studio-21.0.1/plugins/obs-x264 /tmp/B.Ey4Kql/BUILD/obs-studio-21.0.1/build /tmp/B.Ey4Kql/BUILD/obs-studio-21.0.1/build/plugins/obs-x264 /tmp/B.Ey4Kql/BUILD/obs-studio-21.0.1/build/plugins/obs-x264/CMakeFiles/obs-x264.dir/DependInfo.cmake --color= Scanning dependencies of target obs-x264 make[2]: Leaving directory '/tmp/B.Ey4Kql/BUILD/obs-studio-21.0.1/build' /usr/bin/make -f plugins/obs-x264/CMakeFiles/obs-x264.dir/build.make plugins/obs-x264/CMakeFiles/obs-x264.dir/build make[2]: Entering directory '/tmp/B.Ey4Kql/BUILD/obs-studio-21.0.1/build' cd /tmp/B.Ey4Kql/BUILD/obs-studio-21.0.1/build && /usr/bin/cmake -E cmake_depends "Unix Makefiles" /tmp/B.Ey4Kql/BUILD/obs-studio-21.0.1 /tmp/B.Ey4Kql/BUILD/obs-studio-21.0.1/plugins/obs-libfdk /tmp/B.Ey4Kql/BUILD/obs-studio-21.0.1/build /tmp/B.Ey4Kql/BUILD/obs-studio-21.0.1/build/plugins/obs-libfdk /tmp/B.Ey4Kql/BUILD/obs-studio-21.0.1/build/plugins/obs-libfdk/CMakeFiles/obs-libfdk.dir/DependInfo.cmake --color= Scanning dependencies of target obs-libfdk make[2]: Leaving directory '/tmp/B.Ey4Kql/BUILD/obs-studio-21.0.1/build' /usr/bin/make -f plugins/obs-libfdk/CMakeFiles/obs-libfdk.dir/build.make plugins/obs-libfdk/CMakeFiles/obs-libfdk.dir/build make[2]: Entering directory '/tmp/B.Ey4Kql/BUILD/obs-studio-21.0.1/build' [ 39%] Building C object plugins/linux-v4l2/CMakeFiles/linux-v4l2.dir/v4l2-udev.c.o cd /tmp/B.Ey4Kql/BUILD/obs-studio-21.0.1/build/plugins/linux-v4l2 && /usr/bin/x86_64-pld-linux-gcc -DHAVE_OBSCONFIG_H -DHAVE_UDEV -DUSE_XDG -Dlinux_v4l2_EXPORTS -I/tmp/B.Ey4Kql/BUILD/obs-studio-21.0.1/build/config -isystem /tmp/B.Ey4Kql/BUILD/obs-studio-21.0.1/libobs -Wall -Wextra -Wno-unused-function -Werror-implicit-function-declaration -Wno-missing-braces -Wno-missing-field-initializers -std=gnu99 -fno-strict-aliasing -O2 -fwrapv -pipe -Wformat -Werror=format-security -gdwarf-4 -fno-debug-types-section -fvar-tracking-assignments -g2 -Wp,-D_FORTIFY_SOURCE=2 -fstack-protector-strong --param=ssp-buffer-size=4 -Werror=trampolines -fPIC -march=x86-64 -gdwarf-4 -fno-debug-types-section -fvar-tracking-assignments -g2 -DNDEBUG -DQT_NO_DEBUG -fPIC -mmmx -msse -msse2 -pthread -o CMakeFiles/linux-v4l2.dir/v4l2-udev.c.o -c /tmp/B.Ey4Kql/BUILD/obs-studio-21.0.1/plugins/linux-v4l2/v4l2-udev.c make[2]: Leaving directory '/tmp/B.Ey4Kql/BUILD/obs-studio-21.0.1/build' make[2]: Entering directory '/tmp/B.Ey4Kql/BUILD/obs-studio-21.0.1/build' [ 28%] Building CXX object UI/obs-frontend-api/CMakeFiles/obs-frontend-api.dir/obs-frontend-api.cpp.o cd /tmp/B.Ey4Kql/BUILD/obs-studio-21.0.1/build/UI/obs-frontend-api && /usr/bin/x86_64-pld-linux-g++ -DHAVE_OBSCONFIG_H -DLIBOBS_EXPORTS -DUSE_XDG -Dobs_frontend_api_EXPORTS -I/tmp/B.Ey4Kql/BUILD/obs-studio-21.0.1/build/config -isystem /tmp/B.Ey4Kql/BUILD/obs-studio-21.0.1/libobs -Wall -Wextra -Wno-unused-function -Werror-implicit-function-declaration -Wno-missing-field-initializers -std=gnu++11 -fno-strict-aliasing -O2 -fwrapv -pipe -Wformat -Werror=format-security -gdwarf-4 -fno-debug-types-section -fvar-tracking-assignments -g2 -Wp,-D_FORTIFY_SOURCE=2 -fstack-protector-strong --param=ssp-buffer-size=4 -Werror=trampolines -fPIC -march=x86-64 -gdwarf-4 -fno-debug-types-section -fvar-tracking-assignments -g2 -DNDEBUG -DQT_NO_DEBUG -fPIC -mmmx -msse -msse2 -pthread -o CMakeFiles/obs-frontend-api.dir/obs-frontend-api.cpp.o -c /tmp/B.Ey4Kql/BUILD/obs-studio-21.0.1/UI/obs-frontend-api/obs-frontend-api.cpp make[2]: Leaving directory '/tmp/B.Ey4Kql/BUILD/obs-studio-21.0.1/build' make[2]: Entering directory '/tmp/B.Ey4Kql/BUILD/obs-studio-21.0.1/build' [ 41%] Building C object plugins/obs-libfdk/CMakeFiles/obs-libfdk.dir/obs-libfdk.c.o cd /tmp/B.Ey4Kql/BUILD/obs-studio-21.0.1/build/plugins/obs-libfdk && /usr/bin/x86_64-pld-linux-gcc -DHAVE_OBSCONFIG_H -DUSE_XDG -Dobs_libfdk_EXPORTS -I/tmp/B.Ey4Kql/BUILD/obs-studio-21.0.1/libobs -I/tmp/B.Ey4Kql/BUILD/obs-studio-21.0.1/build/config -Wall -Wextra -Wno-unused-function -Werror-implicit-function-declaration -Wno-missing-braces -Wno-missing-field-initializers -std=gnu99 -fno-strict-aliasing -O2 -fwrapv -pipe -Wformat -Werror=format-security -gdwarf-4 -fno-debug-types-section -fvar-tracking-assignments -g2 -Wp,-D_FORTIFY_SOURCE=2 -fstack-protector-strong --param=ssp-buffer-size=4 -Werror=trampolines -fPIC -march=x86-64 -gdwarf-4 -fno-debug-types-section -fvar-tracking-assignments -g2 -DNDEBUG -DQT_NO_DEBUG -fPIC -mmmx -msse -msse2 -pthread -o CMakeFiles/obs-libfdk.dir/obs-libfdk.c.o -c /tmp/B.Ey4Kql/BUILD/obs-studio-21.0.1/plugins/obs-libfdk/obs-libfdk.c /tmp/B.Ey4Kql/BUILD/obs-studio-21.0.1/plugins/obs-libfdk/obs-libfdk.c: In function 'libfdk_encode': /tmp/B.Ey4Kql/BUILD/obs-studio-21.0.1/plugins/obs-libfdk/obs-libfdk.c:266:27: error: 'AACENC_InfoStruct' {aka 'struct <anonymous>'} has no member named 'encoderDelay'; did you mean 'nDelay'? enc->info.encoderDelay; // TODO: Just a guess, find out if that's actualy right ^~~~~~~~~~~~ nDelay /tmp/B.Ey4Kql/BUILD/obs-studio-21.0.1/plugins/obs-libfdk/obs-libfdk.c:267:48: error: 'AACENC_InfoStruct' {aka 'struct <anonymous>'} has no member named 'encoderDelay'; did you mean 'nDelay'? packet->dts = enc->total_samples - enc->info.encoderDelay; ^~~~~~~~~~~~ nDelay make[2]: *** [plugins/obs-libfdk/CMakeFiles/obs-libfdk.dir/build.make:66: plugins/obs-libfdk/CMakeFiles/obs-libfdk.dir/obs-libfdk.c.o] Error 1 make[2]: Leaving directory '/tmp/B.Ey4Kql/BUILD/obs-studio-21.0.1/build' make[1]: *** [CMakeFiles/Makefile2:1304: plugins/obs-libfdk/CMakeFiles/obs-libfdk.dir/all] Error 2 make[1]: *** Waiting for unfinished jobs.... make[2]: Entering directory '/tmp/B.Ey4Kql/BUILD/obs-studio-21.0.1/build' [ 38%] Building C object plugins/linux-capture/CMakeFiles/linux-capture.dir/xshm-input.c.o cd /tmp/B.Ey4Kql/BUILD/obs-studio-21.0.1/build/plugins/linux-capture && /usr/bin/x86_64-pld-linux-gcc -DHAVE_OBSCONFIG_H -DUSE_XDG -Dlinux_capture_EXPORTS -I/tmp/B.Ey4Kql/BUILD/obs-studio-21.0.1/build/config -I/tmp/B.Ey4Kql/BUILD/obs-studio-21.0.1/deps/glad/include -isystem /tmp/B.Ey4Kql/BUILD/obs-studio-21.0.1/libobs -Wall -Wextra -Wno-unused-function -Werror-implicit-function-declaration -Wno-missing-braces -Wno-missing-field-initializers -std=gnu99 -fno-strict-aliasing -O2 -fwrapv -pipe -Wformat -Werror=format-security -gdwarf-4 -fno-debug-types-section -fvar-tracking-assignments -g2 -Wp,-D_FORTIFY_SOURCE=2 -fstack-protector-strong --param=ssp-buffer-size=4 -Werror=trampolines -fPIC -march=x86-64 -gdwarf-4 -fno-debug-types-section -fvar-tracking-assignments -g2 -DNDEBUG -DQT_NO_DEBUG -fPIC -mmmx -msse -msse2 -pthread -o CMakeFiles/linux-capture.dir/xshm-input.c.o -c /tmp/B.Ey4Kql/BUILD/obs-studio-21.0.1/plugins/linux-capture/xshm-input.c make[2]: Leaving directory '/tmp/B.Ey4Kql/BUILD/obs-studio-21.0.1/build' make[2]: Entering directory '/tmp/B.Ey4Kql/BUILD/obs-studio-21.0.1/build' [ 41%] Linking C shared module linux-v4l2.so cd /tmp/B.Ey4Kql/BUILD/obs-studio-21.0.1/build/plugins/linux-v4l2 && /usr/bin/cmake -E cmake_link_script CMakeFiles/linux-v4l2.dir/link.txt --verbose=1 /usr/bin/x86_64-pld-linux-gcc -fPIC -Wall -Wextra -Wno-unused-function -Werror-implicit-function-declaration -Wno-missing-braces -Wno-missing-field-initializers -std=gnu99 -fno-strict-aliasing -O2 -fwrapv -pipe -Wformat -Werror=format-security -gdwarf-4 -fno-debug-types-section -fvar-tracking-assignments -g2 -Wp,-D_FORTIFY_SOURCE=2 -fstack-protector-strong --param=ssp-buffer-size=4 -Werror=trampolines -fPIC -march=x86-64 -gdwarf-4 -fno-debug-types-section -fvar-tracking-assignments -g2 -DNDEBUG -DQT_NO_DEBUG -Wl,--as-needed -Wl,--no-copy-dt-needed-entries -Wl,-z,relro -Wl,-z,combreloc -shared -o linux-v4l2.so CMakeFiles/linux-v4l2.dir/linux-v4l2.c.o CMakeFiles/linux-v4l2.dir/v4l2-input.c.o CMakeFiles/linux-v4l2.dir/v4l2-helpers.c.o CMakeFiles/linux-v4l2.dir/v4l2-udev.c.o -Wl,-rpath,/tmp/B.Ey4Kql/BUILD/obs-studio-21.0.1/build/libobs: ../../libobs/libobs.so.0 -lv4l2 -ludev -pthread cd /tmp/B.Ey4Kql/BUILD/obs-studio-21.0.1/build/plugins/linux-v4l2 && /usr/bin/cmake -E copy /tmp/B.Ey4Kql/BUILD/obs-studio-21.0.1/build/plugins/linux-v4l2/linux-v4l2.so /tmp/B.Ey4Kql/BUILD/obs-studio-21.0.1/build/rundir/PLD/obs-plugins/64bit/linux-v4l2.so cd /tmp/B.Ey4Kql/BUILD/obs-studio-21.0.1/build/plugins/linux-v4l2 && /usr/bin/cmake -E copy_directory /tmp/B.Ey4Kql/BUILD/obs-studio-21.0.1/plugins/linux-v4l2/data /tmp/B.Ey4Kql/BUILD/obs-studio-21.0.1/build/rundir/PLD/data/obs-plugins/linux-v4l2 make[2]: Leaving directory '/tmp/B.Ey4Kql/BUILD/obs-studio-21.0.1/build' make[2]: Entering directory '/tmp/B.Ey4Kql/BUILD/obs-studio-21.0.1/build' [ 37%] Building C object plugins/vlc-video/CMakeFiles/vlc-video.dir/vlc-video-source.c.o cd /tmp/B.Ey4Kql/BUILD/obs-studio-21.0.1/build/plugins/vlc-video && /usr/bin/x86_64-pld-linux-gcc -DHAVE_OBSCONFIG_H -DUSE_XDG -Dvlc_video_EXPORTS -I/usr/include/vlc -I/tmp/B.Ey4Kql/BUILD/obs-studio-21.0.1/libobs -I/tmp/B.Ey4Kql/BUILD/obs-studio-21.0.1/build/config -Wall -Wextra -Wno-unused-function -Werror-implicit-function-declaration -Wno-missing-braces -Wno-missing-field-initializers -std=gnu99 -fno-strict-aliasing -O2 -fwrapv -pipe -Wformat -Werror=format-security -gdwarf-4 -fno-debug-types-section -fvar-tracking-assignments -g2 -Wp,-D_FORTIFY_SOURCE=2 -fstack-protector-strong --param=ssp-buffer-size=4 -Werror=trampolines -fPIC -march=x86-64 -gdwarf-4 -fno-debug-types-section -fvar-tracking-assignments -g2 -DNDEBUG -DQT_NO_DEBUG -fPIC -mmmx -msse -msse2 -pthread -o CMakeFiles/vlc-video.dir/vlc-video-source.c.o -c /tmp/B.Ey4Kql/BUILD/obs-studio-21.0.1/plugins/vlc-video/vlc-video-source.c make[2]: Leaving directory '/tmp/B.Ey4Kql/BUILD/obs-studio-21.0.1/build' make[1]: Entering directory '/tmp/B.Ey4Kql/BUILD/obs-studio-21.0.1/build' [ 41%] Built target linux-v4l2 make[1]: Leaving directory '/tmp/B.Ey4Kql/BUILD/obs-studio-21.0.1/build' make[2]: Entering directory '/tmp/B.Ey4Kql/BUILD/obs-studio-21.0.1/build' [ 42%] Linking C shared module vlc-video.so cd /tmp/B.Ey4Kql/BUILD/obs-studio-21.0.1/build/plugins/vlc-video && /usr/bin/cmake -E cmake_link_script CMakeFiles/vlc-video.dir/link.txt --verbose=1 /usr/bin/x86_64-pld-linux-gcc -fPIC -Wall -Wextra -Wno-unused-function -Werror-implicit-function-declaration -Wno-missing-braces -Wno-missing-field-initializers -std=gnu99 -fno-strict-aliasing -O2 -fwrapv -pipe -Wformat -Werror=format-security -gdwarf-4 -fno-debug-types-section -fvar-tracking-assignments -g2 -Wp,-D_FORTIFY_SOURCE=2 -fstack-protector-strong --param=ssp-buffer-size=4 -Werror=trampolines -fPIC -march=x86-64 -gdwarf-4 -fno-debug-types-section -fvar-tracking-assignments -g2 -DNDEBUG -DQT_NO_DEBUG -Wl,--as-needed -Wl,--no-copy-dt-needed-entries -Wl,-z,relro -Wl,-z,combreloc -shared -o vlc-video.so CMakeFiles/vlc-video.dir/vlc-video-plugin.c.o CMakeFiles/vlc-video.dir/vlc-video-source.c.o -Wl,-rpath,/tmp/B.Ey4Kql/BUILD/obs-studio-21.0.1/build/libobs: ../../libobs/libobs.so.0 -pthread cd /tmp/B.Ey4Kql/BUILD/obs-studio-21.0.1/build/plugins/vlc-video && /usr/bin/cmake -E copy /tmp/B.Ey4Kql/BUILD/obs-studio-21.0.1/build/plugins/vlc-video/vlc-video.so /tmp/B.Ey4Kql/BUILD/obs-studio-21.0.1/build/rundir/PLD/obs-plugins/64bit/vlc-video.so cd /tmp/B.Ey4Kql/BUILD/obs-studio-21.0.1/build/plugins/vlc-video && /usr/bin/cmake -E copy_directory /tmp/B.Ey4Kql/BUILD/obs-studio-21.0.1/plugins/vlc-video/data /tmp/B.Ey4Kql/BUILD/obs-studio-21.0.1/build/rundir/PLD/data/obs-plugins/vlc-video make[2]: Leaving directory '/tmp/B.Ey4Kql/BUILD/obs-studio-21.0.1/build' make[2]: Entering directory '/tmp/B.Ey4Kql/BUILD/obs-studio-21.0.1/build' [ 41%] Linking CXX shared library libobs-frontend-api.so cd /tmp/B.Ey4Kql/BUILD/obs-studio-21.0.1/build/UI/obs-frontend-api && /usr/bin/cmake -E cmake_link_script CMakeFiles/obs-frontend-api.dir/link.txt --verbose=1 /usr/bin/x86_64-pld-linux-g++ -fPIC -Wall -Wextra -Wno-unused-function -Werror-implicit-function-declaration -Wno-missing-field-initializers -std=gnu++11 -fno-strict-aliasing -O2 -fwrapv -pipe -Wformat -Werror=format-security -gdwarf-4 -fno-debug-types-section -fvar-tracking-assignments -g2 -Wp,-D_FORTIFY_SOURCE=2 -fstack-protector-strong --param=ssp-buffer-size=4 -Werror=trampolines -fPIC -march=x86-64 -gdwarf-4 -fno-debug-types-section -fvar-tracking-assignments -g2 -DNDEBUG -DQT_NO_DEBUG -Wl,--as-needed -Wl,--no-copy-dt-needed-entries -Wl,-z,relro -Wl,-z,combreloc -shared -Wl,-soname,libobs-frontend-api.so.0 -o libobs-frontend-api.so.0.0 CMakeFiles/obs-frontend-api.dir/obs-frontend-api.cpp.o -Wl,-rpath,/tmp/B.Ey4Kql/BUILD/obs-studio-21.0.1/build/libobs: ../../libobs/libobs.so.0 -pthread cd /tmp/B.Ey4Kql/BUILD/obs-studio-21.0.1/build/UI/obs-frontend-api && /usr/bin/cmake -E cmake_symlink_library libobs-frontend-api.so.0.0 libobs-frontend-api.so.0 libobs-frontend-api.so cd /tmp/B.Ey4Kql/BUILD/obs-studio-21.0.1/build/UI/obs-frontend-api && /usr/bin/cmake -E copy /tmp/B.Ey4Kql/BUILD/obs-studio-21.0.1/build/UI/obs-frontend-api/libobs-frontend-api.so.0.0 /tmp/B.Ey4Kql/BUILD/obs-studio-21.0.1/build/rundir/PLD/bin/64bit/libobs-frontend-api.so.0.0 make[2]: Leaving directory '/tmp/B.Ey4Kql/BUILD/obs-studio-21.0.1/build' make[1]: Entering directory '/tmp/B.Ey4Kql/BUILD/obs-studio-21.0.1/build' [ 42%] Built target vlc-video make[1]: Leaving directory '/tmp/B.Ey4Kql/BUILD/obs-studio-21.0.1/build' make[2]: Entering directory '/tmp/B.Ey4Kql/BUILD/obs-studio-21.0.1/build' [ 41%] Building C object plugins/obs-x264/CMakeFiles/obs-x264.dir/obs-x264.c.o cd /tmp/B.Ey4Kql/BUILD/obs-studio-21.0.1/build/plugins/obs-x264 && /usr/bin/x86_64-pld-linux-gcc -DHAVE_OBSCONFIG_H -DUSE_XDG -Dobs_x264_EXPORTS -I/tmp/B.Ey4Kql/BUILD/obs-studio-21.0.1/libobs -I/tmp/B.Ey4Kql/BUILD/obs-studio-21.0.1/build/config -Wall -Wextra -Wno-unused-function -Werror-implicit-function-declaration -Wno-missing-braces -Wno-missing-field-initializers -std=gnu99 -fno-strict-aliasing -O2 -fwrapv -pipe -Wformat -Werror=format-security -gdwarf-4 -fno-debug-types-section -fvar-tracking-assignments -g2 -Wp,-D_FORTIFY_SOURCE=2 -fstack-protector-strong --param=ssp-buffer-size=4 -Werror=trampolines -fPIC -march=x86-64 -gdwarf-4 -fno-debug-types-section -fvar-tracking-assignments -g2 -DNDEBUG -DQT_NO_DEBUG -fPIC -mmmx -msse -msse2 -pthread -o CMakeFiles/obs-x264.dir/obs-x264.c.o -c /tmp/B.Ey4Kql/BUILD/obs-studio-21.0.1/plugins/obs-x264/obs-x264.c make[2]: Leaving directory '/tmp/B.Ey4Kql/BUILD/obs-studio-21.0.1/build' make[1]: Entering directory '/tmp/B.Ey4Kql/BUILD/obs-studio-21.0.1/build' [ 43%] Built target obs-frontend-api make[1]: Leaving directory '/tmp/B.Ey4Kql/BUILD/obs-studio-21.0.1/build' make[2]: Entering directory '/tmp/B.Ey4Kql/BUILD/obs-studio-21.0.1/build' [ 41%] Building CXX object plugins/linux-capture/CMakeFiles/linux-capture.dir/xcomposite-main.cpp.o cd /tmp/B.Ey4Kql/BUILD/obs-studio-21.0.1/build/plugins/linux-capture && /usr/bin/x86_64-pld-linux-g++ -DHAVE_OBSCONFIG_H -DUSE_XDG -Dlinux_capture_EXPORTS -I/tmp/B.Ey4Kql/BUILD/obs-studio-21.0.1/build/config -I/tmp/B.Ey4Kql/BUILD/obs-studio-21.0.1/deps/glad/include -isystem /tmp/B.Ey4Kql/BUILD/obs-studio-21.0.1/libobs -Wall -Wextra -Wno-unused-function -Werror-implicit-function-declaration -Wno-missing-field-initializers -std=gnu++11 -fno-strict-aliasing -O2 -fwrapv -pipe -Wformat -Werror=format-security -gdwarf-4 -fno-debug-types-section -fvar-tracking-assignments -g2 -Wp,-D_FORTIFY_SOURCE=2 -fstack-protector-strong --param=ssp-buffer-size=4 -Werror=trampolines -fPIC -march=x86-64 -gdwarf-4 -fno-debug-types-section -fvar-tracking-assignments -g2 -DNDEBUG -DQT_NO_DEBUG -fPIC -mmmx -msse -msse2 -pthread -o CMakeFiles/linux-capture.dir/xcomposite-main.cpp.o -c /tmp/B.Ey4Kql/BUILD/obs-studio-21.0.1/plugins/linux-capture/xcomposite-main.cpp make[2]: Leaving directory '/tmp/B.Ey4Kql/BUILD/obs-studio-21.0.1/build' make[2]: Entering directory '/tmp/B.Ey4Kql/BUILD/obs-studio-21.0.1/build' [ 42%] Building C object plugins/image-source/CMakeFiles/image-source.dir/color-source.c.o cd /tmp/B.Ey4Kql/BUILD/obs-studio-21.0.1/build/plugins/image-source && /usr/bin/x86_64-pld-linux-gcc -DHAVE_OBSCONFIG_H -DUSE_XDG -Dimage_source_EXPORTS -I/tmp/B.Ey4Kql/BUILD/obs-studio-21.0.1/libobs -I/tmp/B.Ey4Kql/BUILD/obs-studio-21.0.1/build/config -Wall -Wextra -Wno-unused-function -Werror-implicit-function-declaration -Wno-missing-braces -Wno-missing-field-initializers -std=gnu99 -fno-strict-aliasing -O2 -fwrapv -pipe -Wformat -Werror=format-security -gdwarf-4 -fno-debug-types-section -fvar-tracking-assignments -g2 -Wp,-D_FORTIFY_SOURCE=2 -fstack-protector-strong --param=ssp-buffer-size=4 -Werror=trampolines -fPIC -march=x86-64 -gdwarf-4 -fno-debug-types-section -fvar-tracking-assignments -g2 -DNDEBUG -DQT_NO_DEBUG -fPIC -mmmx -msse -msse2 -pthread -o CMakeFiles/image-source.dir/color-source.c.o -c /tmp/B.Ey4Kql/BUILD/obs-studio-21.0.1/plugins/image-source/color-source.c make[2]: Leaving directory '/tmp/B.Ey4Kql/BUILD/obs-studio-21.0.1/build' make[2]: Entering directory '/tmp/B.Ey4Kql/BUILD/obs-studio-21.0.1/build' [ 40%] Building C object plugins/image-source/CMakeFiles/image-source.dir/image-source.c.o cd /tmp/B.Ey4Kql/BUILD/obs-studio-21.0.1/build/plugins/image-source && /usr/bin/x86_64-pld-linux-gcc -DHAVE_OBSCONFIG_H -DUSE_XDG -Dimage_source_EXPORTS -I/tmp/B.Ey4Kql/BUILD/obs-studio-21.0.1/libobs -I/tmp/B.Ey4Kql/BUILD/obs-studio-21.0.1/build/config -Wall -Wextra -Wno-unused-function -Werror-implicit-function-declaration -Wno-missing-braces -Wno-missing-field-initializers -std=gnu99 -fno-strict-aliasing -O2 -fwrapv -pipe -Wformat -Werror=format-security -gdwarf-4 -fno-debug-types-section -fvar-tracking-assignments -g2 -Wp,-D_FORTIFY_SOURCE=2 -fstack-protector-strong --param=ssp-buffer-size=4 -Werror=trampolines -fPIC -march=x86-64 -gdwarf-4 -fno-debug-types-section -fvar-tracking-assignments -g2 -DNDEBUG -DQT_NO_DEBUG -fPIC -mmmx -msse -msse2 -pthread -o CMakeFiles/image-source.dir/image-source.c.o -c /tmp/B.Ey4Kql/BUILD/obs-studio-21.0.1/plugins/image-source/image-source.c make[2]: Leaving directory '/tmp/B.Ey4Kql/BUILD/obs-studio-21.0.1/build' make[2]: Entering directory '/tmp/B.Ey4Kql/BUILD/obs-studio-21.0.1/build' [ 43%] Building C object plugins/obs-x264/CMakeFiles/obs-x264.dir/obs-x264-plugin-main.c.o cd /tmp/B.Ey4Kql/BUILD/obs-studio-21.0.1/build/plugins/obs-x264 && /usr/bin/x86_64-pld-linux-gcc -DHAVE_OBSCONFIG_H -DUSE_XDG -Dobs_x264_EXPORTS -I/tmp/B.Ey4Kql/BUILD/obs-studio-21.0.1/libobs -I/tmp/B.Ey4Kql/BUILD/obs-studio-21.0.1/build/config -Wall -Wextra -Wno-unused-function -Werror-implicit-function-declaration -Wno-missing-braces -Wno-missing-field-initializers -std=gnu99 -fno-strict-aliasing -O2 -fwrapv -pipe -Wformat -Werror=format-security -gdwarf-4 -fno-debug-types-section -fvar-tracking-assignments -g2 -Wp,-D_FORTIFY_SOURCE=2 -fstack-protector-strong --param=ssp-buffer-size=4 -Werror=trampolines -fPIC -march=x86-64 -gdwarf-4 -fno-debug-types-section -fvar-tracking-assignments -g2 -DNDEBUG -DQT_NO_DEBUG -fPIC -mmmx -msse -msse2 -pthread -o CMakeFiles/obs-x264.dir/obs-x264-plugin-main.c.o -c /tmp/B.Ey4Kql/BUILD/obs-studio-21.0.1/plugins/obs-x264/obs-x264-plugin-main.c make[2]: Leaving directory '/tmp/B.Ey4Kql/BUILD/obs-studio-21.0.1/build' make[2]: Entering directory '/tmp/B.Ey4Kql/BUILD/obs-studio-21.0.1/build' [ 38%] Building C object libobs-opengl/CMakeFiles/libobs-opengl.dir/gl-shader.c.o cd /tmp/B.Ey4Kql/BUILD/obs-studio-21.0.1/build/libobs-opengl && /usr/bin/x86_64-pld-linux-gcc -DHAVE_OBSCONFIG_H -DLIBOBS_EXPORTS -DUSE_XDG -Dlibobs_opengl_EXPORTS -I/tmp/B.Ey4Kql/BUILD/obs-studio-21.0.1/libobs -I/tmp/B.Ey4Kql/BUILD/obs-studio-21.0.1/build/config -I/tmp/B.Ey4Kql/BUILD/obs-studio-21.0.1/deps/glad/include -Wall -Wextra -Wno-unused-function -Werror-implicit-function-declaration -Wno-missing-braces -Wno-missing-field-initializers -std=gnu99 -fno-strict-aliasing -O2 -fwrapv -pipe -Wformat -Werror=format-security -gdwarf-4 -fno-debug-types-section -fvar-tracking-assignments -g2 -Wp,-D_FORTIFY_SOURCE=2 -fstack-protector-strong --param=ssp-buffer-size=4 -Werror=trampolines -fPIC -march=x86-64 -gdwarf-4 -fno-debug-types-section -fvar-tracking-assignments -g2 -DNDEBUG -DQT_NO_DEBUG -fPIC -mmmx -msse -msse2 -pthread -o CMakeFiles/libobs-opengl.dir/gl-shader.c.o -c /tmp/B.Ey4Kql/BUILD/obs-studio-21.0.1/libobs-opengl/gl-shader.c make[2]: Leaving directory '/tmp/B.Ey4Kql/BUILD/obs-studio-21.0.1/build' make[2]: Entering directory '/tmp/B.Ey4Kql/BUILD/obs-studio-21.0.1/build' [ 44%] Linking C shared module obs-x264.so cd /tmp/B.Ey4Kql/BUILD/obs-studio-21.0.1/build/plugins/obs-x264 && /usr/bin/cmake -E cmake_link_script CMakeFiles/obs-x264.dir/link.txt --verbose=1 /usr/bin/x86_64-pld-linux-gcc -fPIC -Wall -Wextra -Wno-unused-function -Werror-implicit-function-declaration -Wno-missing-braces -Wno-missing-field-initializers -std=gnu99 -fno-strict-aliasing -O2 -fwrapv -pipe -Wformat -Werror=format-security -gdwarf-4 -fno-debug-types-section -fvar-tracking-assignments -g2 -Wp,-D_FORTIFY_SOURCE=2 -fstack-protector-strong --param=ssp-buffer-size=4 -Werror=trampolines -fPIC -march=x86-64 -gdwarf-4 -fno-debug-types-section -fvar-tracking-assignments -g2 -DNDEBUG -DQT_NO_DEBUG -Wl,--as-needed -Wl,--no-copy-dt-needed-entries -Wl,-z,relro -Wl,-z,combreloc -shared -o obs-x264.so CMakeFiles/obs-x264.dir/obs-x264.c.o CMakeFiles/obs-x264.dir/obs-x264-plugin-main.c.o -Wl,-rpath,/tmp/B.Ey4Kql/BUILD/obs-studio-21.0.1/build/libobs: ../../libobs/libobs.so.0 /usr/bin/../lib64/libx264.so -pthread cd /tmp/B.Ey4Kql/BUILD/obs-studio-21.0.1/build/plugins/obs-x264 && /usr/bin/cmake -E copy /tmp/B.Ey4Kql/BUILD/obs-studio-21.0.1/build/plugins/obs-x264/obs-x264.so /tmp/B.Ey4Kql/BUILD/obs-studio-21.0.1/build/rundir/PLD/obs-plugins/64bit/obs-x264.so cd /tmp/B.Ey4Kql/BUILD/obs-studio-21.0.1/build/plugins/obs-x264 && /usr/bin/cmake -E copy_directory /tmp/B.Ey4Kql/BUILD/obs-studio-21.0.1/plugins/obs-x264/data /tmp/B.Ey4Kql/BUILD/obs-studio-21.0.1/build/rundir/PLD/data/obs-plugins/obs-x264 make[2]: Leaving directory '/tmp/B.Ey4Kql/BUILD/obs-studio-21.0.1/build' make[2]: Entering directory '/tmp/B.Ey4Kql/BUILD/obs-studio-21.0.1/build' [ 44%] Building C object plugins/image-source/CMakeFiles/image-source.dir/obs-slideshow.c.o cd /tmp/B.Ey4Kql/BUILD/obs-studio-21.0.1/build/plugins/image-source && /usr/bin/x86_64-pld-linux-gcc -DHAVE_OBSCONFIG_H -DUSE_XDG -Dimage_source_EXPORTS -I/tmp/B.Ey4Kql/BUILD/obs-studio-21.0.1/libobs -I/tmp/B.Ey4Kql/BUILD/obs-studio-21.0.1/build/config -Wall -Wextra -Wno-unused-function -Werror-implicit-function-declaration -Wno-missing-braces -Wno-missing-field-initializers -std=gnu99 -fno-strict-aliasing -O2 -fwrapv -pipe -Wformat -Werror=format-security -gdwarf-4 -fno-debug-types-section -fvar-tracking-assignments -g2 -Wp,-D_FORTIFY_SOURCE=2 -fstack-protector-strong --param=ssp-buffer-size=4 -Werror=trampolines -fPIC -march=x86-64 -gdwarf-4 -fno-debug-types-section -fvar-tracking-assignments -g2 -DNDEBUG -DQT_NO_DEBUG -fPIC -mmmx -msse -msse2 -pthread -o CMakeFiles/image-source.dir/obs-slideshow.c.o -c /tmp/B.Ey4Kql/BUILD/obs-studio-21.0.1/plugins/image-source/obs-slideshow.c make[2]: Leaving directory '/tmp/B.Ey4Kql/BUILD/obs-studio-21.0.1/build' make[2]: Entering directory '/tmp/B.Ey4Kql/BUILD/obs-studio-21.0.1/build' [ 40%] Building CXX object plugins/decklink/linux/CMakeFiles/linux-decklink.dir/__/decklink.cpp.o cd /tmp/B.Ey4Kql/BUILD/obs-studio-21.0.1/build/plugins/decklink/linux && /usr/bin/x86_64-pld-linux-g++ -DHAVE_OBSCONFIG_H -DUSE_XDG -Dlinux_decklink_EXPORTS -I/tmp/B.Ey4Kql/BUILD/obs-studio-21.0.1/libobs -I/tmp/B.Ey4Kql/BUILD/obs-studio-21.0.1/build/config -Wall -Wextra -Wno-unused-function -Werror-implicit-function-declaration -Wno-missing-field-initializers -std=gnu++11 -fno-strict-aliasing -O2 -fwrapv -pipe -Wformat -Werror=format-security -gdwarf-4 -fno-debug-types-section -fvar-tracking-assignments -g2 -Wp,-D_FORTIFY_SOURCE=2 -fstack-protector-strong --param=ssp-buffer-size=4 -Werror=trampolines -fPIC -march=x86-64 -gdwarf-4 -fno-debug-types-section -fvar-tracking-assignments -g2 -DNDEBUG -DQT_NO_DEBUG -fPIC -mmmx -msse -msse2 -pthread -o CMakeFiles/linux-decklink.dir/__/decklink.cpp.o -c /tmp/B.Ey4Kql/BUILD/obs-studio-21.0.1/plugins/decklink/decklink.cpp make[2]: Leaving directory '/tmp/B.Ey4Kql/BUILD/obs-studio-21.0.1/build' make[1]: Entering directory '/tmp/B.Ey4Kql/BUILD/obs-studio-21.0.1/build' [ 44%] Built target obs-x264 make[1]: Leaving directory '/tmp/B.Ey4Kql/BUILD/obs-studio-21.0.1/build' make[2]: Entering directory '/tmp/B.Ey4Kql/BUILD/obs-studio-21.0.1/build' [ 45%] Linking C shared module image-source.so cd /tmp/B.Ey4Kql/BUILD/obs-studio-21.0.1/build/plugins/image-source && /usr/bin/cmake -E cmake_link_script CMakeFiles/image-source.dir/link.txt --verbose=1 /usr/bin/x86_64-pld-linux-gcc -fPIC -Wall -Wextra -Wno-unused-function -Werror-implicit-function-declaration -Wno-missing-braces -Wno-missing-field-initializers -std=gnu99 -fno-strict-aliasing -O2 -fwrapv -pipe -Wformat -Werror=format-security -gdwarf-4 -fno-debug-types-section -fvar-tracking-assignments -g2 -Wp,-D_FORTIFY_SOURCE=2 -fstack-protector-strong --param=ssp-buffer-size=4 -Werror=trampolines -fPIC -march=x86-64 -gdwarf-4 -fno-debug-types-section -fvar-tracking-assignments -g2 -DNDEBUG -DQT_NO_DEBUG -Wl,--as-needed -Wl,--no-copy-dt-needed-entries -Wl,-z,relro -Wl,-z,combreloc -shared -o image-source.so CMakeFiles/image-source.dir/image-source.c.o CMakeFiles/image-source.dir/color-source.c.o CMakeFiles/image-source.dir/obs-slideshow.c.o -Wl,-rpath,/tmp/B.Ey4Kql/BUILD/obs-studio-21.0.1/build/libobs: ../../libobs/libobs.so.0 -pthread cd /tmp/B.Ey4Kql/BUILD/obs-studio-21.0.1/build/plugins/image-source && /usr/bin/cmake -E copy /tmp/B.Ey4Kql/BUILD/obs-studio-21.0.1/build/plugins/image-source/image-source.so /tmp/B.Ey4Kql/BUILD/obs-studio-21.0.1/build/rundir/PLD/obs-plugins/64bit/image-source.so cd /tmp/B.Ey4Kql/BUILD/obs-studio-21.0.1/build/plugins/image-source && /usr/bin/cmake -E copy_directory /tmp/B.Ey4Kql/BUILD/obs-studio-21.0.1/plugins/image-source/data /tmp/B.Ey4Kql/BUILD/obs-studio-21.0.1/build/rundir/PLD/data/obs-plugins/image-source make[2]: Leaving directory '/tmp/B.Ey4Kql/BUILD/obs-studio-21.0.1/build' make[2]: Entering directory '/tmp/B.Ey4Kql/BUILD/obs-studio-21.0.1/build' [ 44%] Building CXX object plugins/decklink/linux/CMakeFiles/linux-decklink.dir/__/decklink-device-mode.cpp.o cd /tmp/B.Ey4Kql/BUILD/obs-studio-21.0.1/build/plugins/decklink/linux && /usr/bin/x86_64-pld-linux-g++ -DHAVE_OBSCONFIG_H -DUSE_XDG -Dlinux_decklink_EXPORTS -I/tmp/B.Ey4Kql/BUILD/obs-studio-21.0.1/libobs -I/tmp/B.Ey4Kql/BUILD/obs-studio-21.0.1/build/config -Wall -Wextra -Wno-unused-function -Werror-implicit-function-declaration -Wno-missing-field-initializers -std=gnu++11 -fno-strict-aliasing -O2 -fwrapv -pipe -Wformat -Werror=format-security -gdwarf-4 -fno-debug-types-section -fvar-tracking-assignments -g2 -Wp,-D_FORTIFY_SOURCE=2 -fstack-protector-strong --param=ssp-buffer-size=4 -Werror=trampolines -fPIC -march=x86-64 -gdwarf-4 -fno-debug-types-section -fvar-tracking-assignments -g2 -DNDEBUG -DQT_NO_DEBUG -fPIC -mmmx -msse -msse2 -pthread -o CMakeFiles/linux-decklink.dir/__/decklink-device-mode.cpp.o -c /tmp/B.Ey4Kql/BUILD/obs-studio-21.0.1/plugins/decklink/decklink-device-mode.cpp make[2]: Leaving directory '/tmp/B.Ey4Kql/BUILD/obs-studio-21.0.1/build' make[2]: Entering directory '/tmp/B.Ey4Kql/BUILD/obs-studio-21.0.1/build' [ 41%] Building CXX object plugins/decklink/linux/CMakeFiles/linux-decklink.dir/__/decklink-device-instance.cpp.o cd /tmp/B.Ey4Kql/BUILD/obs-studio-21.0.1/build/plugins/decklink/linux && /usr/bin/x86_64-pld-linux-g++ -DHAVE_OBSCONFIG_H -DUSE_XDG -Dlinux_decklink_EXPORTS -I/tmp/B.Ey4Kql/BUILD/obs-studio-21.0.1/libobs -I/tmp/B.Ey4Kql/BUILD/obs-studio-21.0.1/build/config -Wall -Wextra -Wno-unused-function -Werror-implicit-function-declaration -Wno-missing-field-initializers -std=gnu++11 -fno-strict-aliasing -O2 -fwrapv -pipe -Wformat -Werror=format-security -gdwarf-4 -fno-debug-types-section -fvar-tracking-assignments -g2 -Wp,-D_FORTIFY_SOURCE=2 -fstack-protector-strong --param=ssp-buffer-size=4 -Werror=trampolines -fPIC -march=x86-64 -gdwarf-4 -fno-debug-types-section -fvar-tracking-assignments -g2 -DNDEBUG -DQT_NO_DEBUG -fPIC -mmmx -msse -msse2 -pthread -o CMakeFiles/linux-decklink.dir/__/decklink-device-instance.cpp.o -c /tmp/B.Ey4Kql/BUILD/obs-studio-21.0.1/plugins/decklink/decklink-device-instance.cpp make[2]: Leaving directory '/tmp/B.Ey4Kql/BUILD/obs-studio-21.0.1/build' make[1]: Entering directory '/tmp/B.Ey4Kql/BUILD/obs-studio-21.0.1/build' [ 46%] Built target image-source make[1]: Leaving directory '/tmp/B.Ey4Kql/BUILD/obs-studio-21.0.1/build' make[2]: Entering directory '/tmp/B.Ey4Kql/BUILD/obs-studio-21.0.1/build' [ 46%] Building C object plugins/decklink/linux/CMakeFiles/linux-decklink.dir/__/audio-repack.c.o cd /tmp/B.Ey4Kql/BUILD/obs-studio-21.0.1/build/plugins/decklink/linux && /usr/bin/x86_64-pld-linux-gcc -DHAVE_OBSCONFIG_H -DUSE_XDG -Dlinux_decklink_EXPORTS -I/tmp/B.Ey4Kql/BUILD/obs-studio-21.0.1/libobs -I/tmp/B.Ey4Kql/BUILD/obs-studio-21.0.1/build/config -Wall -Wextra -Wno-unused-function -Werror-implicit-function-declaration -Wno-missing-braces -Wno-missing-field-initializers -std=gnu99 -fno-strict-aliasing -O2 -fwrapv -pipe -Wformat -Werror=format-security -gdwarf-4 -fno-debug-types-section -fvar-tracking-assignments -g2 -Wp,-D_FORTIFY_SOURCE=2 -fstack-protector-strong --param=ssp-buffer-size=4 -Werror=trampolines -fPIC -march=x86-64 -gdwarf-4 -fno-debug-types-section -fvar-tracking-assignments -g2 -DNDEBUG -DQT_NO_DEBUG -fPIC -mmmx -msse -msse2 -pthread -o CMakeFiles/linux-decklink.dir/__/audio-repack.c.o -c /tmp/B.Ey4Kql/BUILD/obs-studio-21.0.1/plugins/decklink/audio-repack.c make[2]: Leaving directory '/tmp/B.Ey4Kql/BUILD/obs-studio-21.0.1/build' make[2]: Entering directory '/tmp/B.Ey4Kql/BUILD/obs-studio-21.0.1/build' [ 44%] Building C object libobs-opengl/CMakeFiles/libobs-opengl.dir/gl-shaderparser.c.o cd /tmp/B.Ey4Kql/BUILD/obs-studio-21.0.1/build/libobs-opengl && /usr/bin/x86_64-pld-linux-gcc -DHAVE_OBSCONFIG_H -DLIBOBS_EXPORTS -DUSE_XDG -Dlibobs_opengl_EXPORTS -I/tmp/B.Ey4Kql/BUILD/obs-studio-21.0.1/libobs -I/tmp/B.Ey4Kql/BUILD/obs-studio-21.0.1/build/config -I/tmp/B.Ey4Kql/BUILD/obs-studio-21.0.1/deps/glad/include -Wall -Wextra -Wno-unused-function -Werror-implicit-function-declaration -Wno-missing-braces -Wno-missing-field-initializers -std=gnu99 -fno-strict-aliasing -O2 -fwrapv -pipe -Wformat -Werror=format-security -gdwarf-4 -fno-debug-types-section -fvar-tracking-assignments -g2 -Wp,-D_FORTIFY_SOURCE=2 -fstack-protector-strong --param=ssp-buffer-size=4 -Werror=trampolines -fPIC -march=x86-64 -gdwarf-4 -fno-debug-types-section -fvar-tracking-assignments -g2 -DNDEBUG -DQT_NO_DEBUG -fPIC -mmmx -msse -msse2 -pthread -o CMakeFiles/libobs-opengl.dir/gl-shaderparser.c.o -c /tmp/B.Ey4Kql/BUILD/obs-studio-21.0.1/libobs-opengl/gl-shaderparser.c make[2]: Leaving directory '/tmp/B.Ey4Kql/BUILD/obs-studio-21.0.1/build' make[2]: Entering directory '/tmp/B.Ey4Kql/BUILD/obs-studio-21.0.1/build' [ 46%] Building CXX object plugins/decklink/linux/CMakeFiles/linux-decklink.dir/decklink-sdk/DeckLinkAPIDispatch.cpp.o cd /tmp/B.Ey4Kql/BUILD/obs-studio-21.0.1/build/plugins/decklink/linux && /usr/bin/x86_64-pld-linux-g++ -DHAVE_OBSCONFIG_H -DUSE_XDG -Dlinux_decklink_EXPORTS -I/tmp/B.Ey4Kql/BUILD/obs-studio-21.0.1/libobs -I/tmp/B.Ey4Kql/BUILD/obs-studio-21.0.1/build/config -Wall -Wextra -Wno-unused-function -Werror-implicit-function-declaration -Wno-missing-field-initializers -std=gnu++11 -fno-strict-aliasing -O2 -fwrapv -pipe -Wformat -Werror=format-security -gdwarf-4 -fno-debug-types-section -fvar-tracking-assignments -g2 -Wp,-D_FORTIFY_SOURCE=2 -fstack-protector-strong --param=ssp-buffer-size=4 -Werror=trampolines -fPIC -march=x86-64 -gdwarf-4 -fno-debug-types-section -fvar-tracking-assignments -g2 -DNDEBUG -DQT_NO_DEBUG -fPIC -mmmx -msse -msse2 -pthread -o CMakeFiles/linux-decklink.dir/decklink-sdk/DeckLinkAPIDispatch.cpp.o -c /tmp/B.Ey4Kql/BUILD/obs-studio-21.0.1/plugins/decklink/linux/decklink-sdk/DeckLinkAPIDispatch.cpp make[2]: Leaving directory '/tmp/B.Ey4Kql/BUILD/obs-studio-21.0.1/build' make[2]: Entering directory '/tmp/B.Ey4Kql/BUILD/obs-studio-21.0.1/build' [ 45%] Building C object libobs-opengl/CMakeFiles/libobs-opengl.dir/gl-stagesurf.c.o cd /tmp/B.Ey4Kql/BUILD/obs-studio-21.0.1/build/libobs-opengl && /usr/bin/x86_64-pld-linux-gcc -DHAVE_OBSCONFIG_H -DLIBOBS_EXPORTS -DUSE_XDG -Dlibobs_opengl_EXPORTS -I/tmp/B.Ey4Kql/BUILD/obs-studio-21.0.1/libobs -I/tmp/B.Ey4Kql/BUILD/obs-studio-21.0.1/build/config -I/tmp/B.Ey4Kql/BUILD/obs-studio-21.0.1/deps/glad/include -Wall -Wextra -Wno-unused-function -Werror-implicit-function-declaration -Wno-missing-braces -Wno-missing-field-initializers -std=gnu99 -fno-strict-aliasing -O2 -fwrapv -pipe -Wformat -Werror=format-security -gdwarf-4 -fno-debug-types-section -fvar-tracking-assignments -g2 -Wp,-D_FORTIFY_SOURCE=2 -fstack-protector-strong --param=ssp-buffer-size=4 -Werror=trampolines -fPIC -march=x86-64 -gdwarf-4 -fno-debug-types-section -fvar-tracking-assignments -g2 -DNDEBUG -DQT_NO_DEBUG -fPIC -mmmx -msse -msse2 -pthread -o CMakeFiles/libobs-opengl.dir/gl-stagesurf.c.o -c /tmp/B.Ey4Kql/BUILD/obs-studio-21.0.1/libobs-opengl/gl-stagesurf.c make[2]: Leaving directory '/tmp/B.Ey4Kql/BUILD/obs-studio-21.0.1/build' make[2]: Entering directory '/tmp/B.Ey4Kql/BUILD/obs-studio-21.0.1/build' [ 46%] Building CXX object plugins/decklink/linux/CMakeFiles/linux-decklink.dir/platform.cpp.o cd /tmp/B.Ey4Kql/BUILD/obs-studio-21.0.1/build/plugins/decklink/linux && /usr/bin/x86_64-pld-linux-g++ -DHAVE_OBSCONFIG_H -DUSE_XDG -Dlinux_decklink_EXPORTS -I/tmp/B.Ey4Kql/BUILD/obs-studio-21.0.1/libobs -I/tmp/B.Ey4Kql/BUILD/obs-studio-21.0.1/build/config -Wall -Wextra -Wno-unused-function -Werror-implicit-function-declaration -Wno-missing-field-initializers -std=gnu++11 -fno-strict-aliasing -O2 -fwrapv -pipe -Wformat -Werror=format-security -gdwarf-4 -fno-debug-types-section -fvar-tracking-assignments -g2 -Wp,-D_FORTIFY_SOURCE=2 -fstack-protector-strong --param=ssp-buffer-size=4 -Werror=trampolines -fPIC -march=x86-64 -gdwarf-4 -fno-debug-types-section -fvar-tracking-assignments -g2 -DNDEBUG -DQT_NO_DEBUG -fPIC -mmmx -msse -msse2 -pthread -o CMakeFiles/linux-decklink.dir/platform.cpp.o -c /tmp/B.Ey4Kql/BUILD/obs-studio-21.0.1/plugins/decklink/linux/platform.cpp make[2]: Leaving directory '/tmp/B.Ey4Kql/BUILD/obs-studio-21.0.1/build' make[2]: Entering directory '/tmp/B.Ey4Kql/BUILD/obs-studio-21.0.1/build' [ 44%] Building CXX object plugins/decklink/linux/CMakeFiles/linux-decklink.dir/__/decklink-device-discovery.cpp.o cd /tmp/B.Ey4Kql/BUILD/obs-studio-21.0.1/build/plugins/decklink/linux && /usr/bin/x86_64-pld-linux-g++ -DHAVE_OBSCONFIG_H -DUSE_XDG -Dlinux_decklink_EXPORTS -I/tmp/B.Ey4Kql/BUILD/obs-studio-21.0.1/libobs -I/tmp/B.Ey4Kql/BUILD/obs-studio-21.0.1/build/config -Wall -Wextra -Wno-unused-function -Werror-implicit-function-declaration -Wno-missing-field-initializers -std=gnu++11 -fno-strict-aliasing -O2 -fwrapv -pipe -Wformat -Werror=format-security -gdwarf-4 -fno-debug-types-section -fvar-tracking-assignments -g2 -Wp,-D_FORTIFY_SOURCE=2 -fstack-protector-strong --param=ssp-buffer-size=4 -Werror=trampolines -fPIC -march=x86-64 -gdwarf-4 -fno-debug-types-section -fvar-tracking-assignments -g2 -DNDEBUG -DQT_NO_DEBUG -fPIC -mmmx -msse -msse2 -pthread -o CMakeFiles/linux-decklink.dir/__/decklink-device-discovery.cpp.o -c /tmp/B.Ey4Kql/BUILD/obs-studio-21.0.1/plugins/decklink/decklink-device-discovery.cpp make[2]: Leaving directory '/tmp/B.Ey4Kql/BUILD/obs-studio-21.0.1/build' make[2]: Entering directory '/tmp/B.Ey4Kql/BUILD/obs-studio-21.0.1/build' [ 47%] Building C object libobs-opengl/CMakeFiles/libobs-opengl.dir/gl-texturecube.c.o cd /tmp/B.Ey4Kql/BUILD/obs-studio-21.0.1/build/libobs-opengl && /usr/bin/x86_64-pld-linux-gcc -DHAVE_OBSCONFIG_H -DLIBOBS_EXPORTS -DUSE_XDG -Dlibobs_opengl_EXPORTS -I/tmp/B.Ey4Kql/BUILD/obs-studio-21.0.1/libobs -I/tmp/B.Ey4Kql/BUILD/obs-studio-21.0.1/build/config -I/tmp/B.Ey4Kql/BUILD/obs-studio-21.0.1/deps/glad/include -Wall -Wextra -Wno-unused-function -Werror-implicit-function-declaration -Wno-missing-braces -Wno-missing-field-initializers -std=gnu99 -fno-strict-aliasing -O2 -fwrapv -pipe -Wformat -Werror=format-security -gdwarf-4 -fno-debug-types-section -fvar-tracking-assignments -g2 -Wp,-D_FORTIFY_SOURCE=2 -fstack-protector-strong --param=ssp-buffer-size=4 -Werror=trampolines -fPIC -march=x86-64 -gdwarf-4 -fno-debug-types-section -fvar-tracking-assignments -g2 -DNDEBUG -DQT_NO_DEBUG -fPIC -mmmx -msse -msse2 -pthread -o CMakeFiles/libobs-opengl.dir/gl-texturecube.c.o -c /tmp/B.Ey4Kql/BUILD/obs-studio-21.0.1/libobs-opengl/gl-texturecube.c make[2]: Leaving directory '/tmp/B.Ey4Kql/BUILD/obs-studio-21.0.1/build' make[2]: Entering directory '/tmp/B.Ey4Kql/BUILD/obs-studio-21.0.1/build' [ 48%] Building C object libobs-opengl/CMakeFiles/libobs-opengl.dir/gl-vertexbuffer.c.o cd /tmp/B.Ey4Kql/BUILD/obs-studio-21.0.1/build/libobs-opengl && /usr/bin/x86_64-pld-linux-gcc -DHAVE_OBSCONFIG_H -DLIBOBS_EXPORTS -DUSE_XDG -Dlibobs_opengl_EXPORTS -I/tmp/B.Ey4Kql/BUILD/obs-studio-21.0.1/libobs -I/tmp/B.Ey4Kql/BUILD/obs-studio-21.0.1/build/config -I/tmp/B.Ey4Kql/BUILD/obs-studio-21.0.1/deps/glad/include -Wall -Wextra -Wno-unused-function -Werror-implicit-function-declaration -Wno-missing-braces -Wno-missing-field-initializers -std=gnu99 -fno-strict-aliasing -O2 -fwrapv -pipe -Wformat -Werror=format-security -gdwarf-4 -fno-debug-types-section -fvar-tracking-assignments -g2 -Wp,-D_FORTIFY_SOURCE=2 -fstack-protector-strong --param=ssp-buffer-size=4 -Werror=trampolines -fPIC -march=x86-64 -gdwarf-4 -fno-debug-types-section -fvar-tracking-assignments -g2 -DNDEBUG -DQT_NO_DEBUG -fPIC -mmmx -msse -msse2 -pthread -o CMakeFiles/libobs-opengl.dir/gl-vertexbuffer.c.o -c /tmp/B.Ey4Kql/BUILD/obs-studio-21.0.1/libobs-opengl/gl-vertexbuffer.c make[2]: Leaving directory '/tmp/B.Ey4Kql/BUILD/obs-studio-21.0.1/build' make[2]: Entering directory '/tmp/B.Ey4Kql/BUILD/obs-studio-21.0.1/build' [ 47%] Building C object libobs-opengl/CMakeFiles/libobs-opengl.dir/gl-texture2d.c.o cd /tmp/B.Ey4Kql/BUILD/obs-studio-21.0.1/build/libobs-opengl && /usr/bin/x86_64-pld-linux-gcc -DHAVE_OBSCONFIG_H -DLIBOBS_EXPORTS -DUSE_XDG -Dlibobs_opengl_EXPORTS -I/tmp/B.Ey4Kql/BUILD/obs-studio-21.0.1/libobs -I/tmp/B.Ey4Kql/BUILD/obs-studio-21.0.1/build/config -I/tmp/B.Ey4Kql/BUILD/obs-studio-21.0.1/deps/glad/include -Wall -Wextra -Wno-unused-function -Werror-implicit-function-declaration -Wno-missing-braces -Wno-missing-field-initializers -std=gnu99 -fno-strict-aliasing -O2 -fwrapv -pipe -Wformat -Werror=format-security -gdwarf-4 -fno-debug-types-section -fvar-tracking-assignments -g2 -Wp,-D_FORTIFY_SOURCE=2 -fstack-protector-strong --param=ssp-buffer-size=4 -Werror=trampolines -fPIC -march=x86-64 -gdwarf-4 -fno-debug-types-section -fvar-tracking-assignments -g2 -DNDEBUG -DQT_NO_DEBUG -fPIC -mmmx -msse -msse2 -pthread -o CMakeFiles/libobs-opengl.dir/gl-texture2d.c.o -c /tmp/B.Ey4Kql/BUILD/obs-studio-21.0.1/libobs-opengl/gl-texture2d.c make[2]: Leaving directory '/tmp/B.Ey4Kql/BUILD/obs-studio-21.0.1/build' make[2]: Entering directory '/tmp/B.Ey4Kql/BUILD/obs-studio-21.0.1/build' [ 48%] Building C object libobs-opengl/CMakeFiles/libobs-opengl.dir/gl-zstencil.c.o cd /tmp/B.Ey4Kql/BUILD/obs-studio-21.0.1/build/libobs-opengl && /usr/bin/x86_64-pld-linux-gcc -DHAVE_OBSCONFIG_H -DLIBOBS_EXPORTS -DUSE_XDG -Dlibobs_opengl_EXPORTS -I/tmp/B.Ey4Kql/BUILD/obs-studio-21.0.1/libobs -I/tmp/B.Ey4Kql/BUILD/obs-studio-21.0.1/build/config -I/tmp/B.Ey4Kql/BUILD/obs-studio-21.0.1/deps/glad/include -Wall -Wextra -Wno-unused-function -Werror-implicit-function-declaration -Wno-missing-braces -Wno-missing-field-initializers -std=gnu99 -fno-strict-aliasing -O2 -fwrapv -pipe -Wformat -Werror=format-security -gdwarf-4 -fno-debug-types-section -fvar-tracking-assignments -g2 -Wp,-D_FORTIFY_SOURCE=2 -fstack-protector-strong --param=ssp-buffer-size=4 -Werror=trampolines -fPIC -march=x86-64 -gdwarf-4 -fno-debug-types-section -fvar-tracking-assignments -g2 -DNDEBUG -DQT_NO_DEBUG -fPIC -mmmx -msse -msse2 -pthread -o CMakeFiles/libobs-opengl.dir/gl-zstencil.c.o -c /tmp/B.Ey4Kql/BUILD/obs-studio-21.0.1/libobs-opengl/gl-zstencil.c make[2]: Leaving directory '/tmp/B.Ey4Kql/BUILD/obs-studio-21.0.1/build' make[2]: Entering directory '/tmp/B.Ey4Kql/BUILD/obs-studio-21.0.1/build' [ 43%] Building CXX object plugins/linux-capture/CMakeFiles/linux-capture.dir/xcompcap-main.cpp.o cd /tmp/B.Ey4Kql/BUILD/obs-studio-21.0.1/build/plugins/linux-capture && /usr/bin/x86_64-pld-linux-g++ -DHAVE_OBSCONFIG_H -DUSE_XDG -Dlinux_capture_EXPORTS -I/tmp/B.Ey4Kql/BUILD/obs-studio-21.0.1/build/config -I/tmp/B.Ey4Kql/BUILD/obs-studio-21.0.1/deps/glad/include -isystem /tmp/B.Ey4Kql/BUILD/obs-studio-21.0.1/libobs -Wall -Wextra -Wno-unused-function -Werror-implicit-function-declaration -Wno-missing-field-initializers -std=gnu++11 -fno-strict-aliasing -O2 -fwrapv -pipe -Wformat -Werror=format-security -gdwarf-4 -fno-debug-types-section -fvar-tracking-assignments -g2 -Wp,-D_FORTIFY_SOURCE=2 -fstack-protector-strong --param=ssp-buffer-size=4 -Werror=trampolines -fPIC -march=x86-64 -gdwarf-4 -fno-debug-types-section -fvar-tracking-assignments -g2 -DNDEBUG -DQT_NO_DEBUG -fPIC -mmmx -msse -msse2 -pthread -o CMakeFiles/linux-capture.dir/xcompcap-main.cpp.o -c /tmp/B.Ey4Kql/BUILD/obs-studio-21.0.1/plugins/linux-capture/xcompcap-main.cpp make[2]: Leaving directory '/tmp/B.Ey4Kql/BUILD/obs-studio-21.0.1/build' make[2]: Entering directory '/tmp/B.Ey4Kql/BUILD/obs-studio-21.0.1/build' [ 44%] Building CXX object plugins/decklink/linux/CMakeFiles/linux-decklink.dir/__/decklink-device.cpp.o cd /tmp/B.Ey4Kql/BUILD/obs-studio-21.0.1/build/plugins/decklink/linux && /usr/bin/x86_64-pld-linux-g++ -DHAVE_OBSCONFIG_H -DUSE_XDG -Dlinux_decklink_EXPORTS -I/tmp/B.Ey4Kql/BUILD/obs-studio-21.0.1/libobs -I/tmp/B.Ey4Kql/BUILD/obs-studio-21.0.1/build/config -Wall -Wextra -Wno-unused-function -Werror-implicit-function-declaration -Wno-missing-field-initializers -std=gnu++11 -fno-strict-aliasing -O2 -fwrapv -pipe -Wformat -Werror=format-security -gdwarf-4 -fno-debug-types-section -fvar-tracking-assignments -g2 -Wp,-D_FORTIFY_SOURCE=2 -fstack-protector-strong --param=ssp-buffer-size=4 -Werror=trampolines -fPIC -march=x86-64 -gdwarf-4 -fno-debug-types-section -fvar-tracking-assignments -g2 -DNDEBUG -DQT_NO_DEBUG -fPIC -mmmx -msse -msse2 -pthread -o CMakeFiles/linux-decklink.dir/__/decklink-device.cpp.o -c /tmp/B.Ey4Kql/BUILD/obs-studio-21.0.1/plugins/decklink/decklink-device.cpp make[2]: Leaving directory '/tmp/B.Ey4Kql/BUILD/obs-studio-21.0.1/build' make[2]: Entering directory '/tmp/B.Ey4Kql/BUILD/obs-studio-21.0.1/build' [ 47%] Building C object libobs-opengl/CMakeFiles/libobs-opengl.dir/gl-subsystem.c.o cd /tmp/B.Ey4Kql/BUILD/obs-studio-21.0.1/build/libobs-opengl && /usr/bin/x86_64-pld-linux-gcc -DHAVE_OBSCONFIG_H -DLIBOBS_EXPORTS -DUSE_XDG -Dlibobs_opengl_EXPORTS -I/tmp/B.Ey4Kql/BUILD/obs-studio-21.0.1/libobs -I/tmp/B.Ey4Kql/BUILD/obs-studio-21.0.1/build/config -I/tmp/B.Ey4Kql/BUILD/obs-studio-21.0.1/deps/glad/include -Wall -Wextra -Wno-unused-function -Werror-implicit-function-declaration -Wno-missing-braces -Wno-missing-field-initializers -std=gnu99 -fno-strict-aliasing -O2 -fwrapv -pipe -Wformat -Werror=format-security -gdwarf-4 -fno-debug-types-section -fvar-tracking-assignments -g2 -Wp,-D_FORTIFY_SOURCE=2 -fstack-protector-strong --param=ssp-buffer-size=4 -Werror=trampolines -fPIC -march=x86-64 -gdwarf-4 -fno-debug-types-section -fvar-tracking-assignments -g2 -DNDEBUG -DQT_NO_DEBUG -fPIC -mmmx -msse -msse2 -pthread -o CMakeFiles/libobs-opengl.dir/gl-subsystem.c.o -c /tmp/B.Ey4Kql/BUILD/obs-studio-21.0.1/libobs-opengl/gl-subsystem.c make[2]: Leaving directory '/tmp/B.Ey4Kql/BUILD/obs-studio-21.0.1/build' make[2]: Entering directory '/tmp/B.Ey4Kql/BUILD/obs-studio-21.0.1/build' [ 49%] Linking C shared library libobs-opengl.so cd /tmp/B.Ey4Kql/BUILD/obs-studio-21.0.1/build/libobs-opengl && /usr/bin/cmake -E cmake_link_script CMakeFiles/libobs-opengl.dir/link.txt --verbose=1 /usr/bin/x86_64-pld-linux-gcc -fPIC -Wall -Wextra -Wno-unused-function -Werror-implicit-function-declaration -Wno-missing-braces -Wno-missing-field-initializers -std=gnu99 -fno-strict-aliasing -O2 -fwrapv -pipe -Wformat -Werror=format-security -gdwarf-4 -fno-debug-types-section -fvar-tracking-assignments -g2 -Wp,-D_FORTIFY_SOURCE=2 -fstack-protector-strong --param=ssp-buffer-size=4 -Werror=trampolines -fPIC -march=x86-64 -gdwarf-4 -fno-debug-types-section -fvar-tracking-assignments -g2 -DNDEBUG -DQT_NO_DEBUG -Wl,--as-needed -Wl,--no-copy-dt-needed-entries -Wl,-z,relro -Wl,-z,combreloc -shared -Wl,-soname,libobs-opengl.so.0 -o libobs-opengl.so.0.0 CMakeFiles/libobs-opengl.dir/gl-x11.c.o CMakeFiles/libobs-opengl.dir/gl-helpers.c.o CMakeFiles/libobs-opengl.dir/gl-indexbuffer.c.o CMakeFiles/libobs-opengl.dir/gl-shader.c.o CMakeFiles/libobs-opengl.dir/gl-shaderparser.c.o CMakeFiles/libobs-opengl.dir/gl-stagesurf.c.o CMakeFiles/libobs-opengl.dir/gl-subsystem.c.o CMakeFiles/libobs-opengl.dir/gl-texture2d.c.o CMakeFiles/libobs-opengl.dir/gl-texturecube.c.o CMakeFiles/libobs-opengl.dir/gl-vertexbuffer.c.o CMakeFiles/libobs-opengl.dir/gl-zstencil.c.o -Wl,-rpath,/tmp/B.Ey4Kql/BUILD/obs-studio-21.0.1/build/libobs:/tmp/B.Ey4Kql/BUILD/obs-studio-21.0.1/build/deps/glad: ../libobs/libobs.so.0 ../deps/glad/libobsglad.so.0 -lxcb -lX11-xcb -pthread -lX11 -ldl -lGL cd /tmp/B.Ey4Kql/BUILD/obs-studio-21.0.1/build/libobs-opengl && /usr/bin/cmake -E cmake_symlink_library libobs-opengl.so.0.0 libobs-opengl.so.0 libobs-opengl.so cd /tmp/B.Ey4Kql/BUILD/obs-studio-21.0.1/build/libobs-opengl && /usr/bin/cmake -E copy /tmp/B.Ey4Kql/BUILD/obs-studio-21.0.1/build/libobs-opengl/libobs-opengl.so.0.0 /tmp/B.Ey4Kql/BUILD/obs-studio-21.0.1/build/rundir/PLD/bin/64bit/libobs-opengl.so.0.0 make[2]: Leaving directory '/tmp/B.Ey4Kql/BUILD/obs-studio-21.0.1/build' make[2]: Entering directory '/tmp/B.Ey4Kql/BUILD/obs-studio-21.0.1/build' [ 49%] Linking CXX shared module linux-decklink.so cd /tmp/B.Ey4Kql/BUILD/obs-studio-21.0.1/build/plugins/decklink/linux && /usr/bin/cmake -E cmake_link_script CMakeFiles/linux-decklink.dir/link.txt --verbose=1 /usr/bin/x86_64-pld-linux-g++ -fPIC -Wall -Wextra -Wno-unused-function -Werror-implicit-function-declaration -Wno-missing-field-initializers -std=gnu++11 -fno-strict-aliasing -O2 -fwrapv -pipe -Wformat -Werror=format-security -gdwarf-4 -fno-debug-types-section -fvar-tracking-assignments -g2 -Wp,-D_FORTIFY_SOURCE=2 -fstack-protector-strong --param=ssp-buffer-size=4 -Werror=trampolines -fPIC -march=x86-64 -gdwarf-4 -fno-debug-types-section -fvar-tracking-assignments -g2 -DNDEBUG -DQT_NO_DEBUG -Wl,--as-needed -Wl,--no-copy-dt-needed-entries -Wl,-z,relro -Wl,-z,combreloc -shared -o linux-decklink.so CMakeFiles/linux-decklink.dir/__/plugin-main.cpp.o CMakeFiles/linux-decklink.dir/__/decklink.cpp.o CMakeFiles/linux-decklink.dir/__/decklink-device-instance.cpp.o CMakeFiles/linux-decklink.dir/__/decklink-device-discovery.cpp.o CMakeFiles/linux-decklink.dir/__/decklink-device.cpp.o CMakeFiles/linux-decklink.dir/__/decklink-device-mode.cpp.o CMakeFiles/linux-decklink.dir/__/audio-repack.c.o CMakeFiles/linux-decklink.dir/platform.cpp.o CMakeFiles/linux-decklink.dir/decklink-sdk/DeckLinkAPIDispatch.cpp.o -Wl,-rpath,/tmp/B.Ey4Kql/BUILD/obs-studio-21.0.1/build/libobs: ../../../libobs/libobs.so.0 -pthread cd /tmp/B.Ey4Kql/BUILD/obs-studio-21.0.1/build/plugins/decklink/linux && /usr/bin/cmake -E copy /tmp/B.Ey4Kql/BUILD/obs-studio-21.0.1/build/plugins/decklink/linux/linux-decklink.so /tmp/B.Ey4Kql/BUILD/obs-studio-21.0.1/build/rundir/PLD/obs-plugins/64bit/linux-decklink.so cd /tmp/B.Ey4Kql/BUILD/obs-studio-21.0.1/build/plugins/decklink/linux && /usr/bin/cmake -E copy_directory /tmp/B.Ey4Kql/BUILD/obs-studio-21.0.1/plugins/decklink/linux/../data /tmp/B.Ey4Kql/BUILD/obs-studio-21.0.1/build/rundir/PLD/data/obs-plugins/linux-decklink make[2]: Leaving directory '/tmp/B.Ey4Kql/BUILD/obs-studio-21.0.1/build' make[1]: Entering directory '/tmp/B.Ey4Kql/BUILD/obs-studio-21.0.1/build' [ 49%] Built target libobs-opengl make[1]: Leaving directory '/tmp/B.Ey4Kql/BUILD/obs-studio-21.0.1/build' make[1]: Entering directory '/tmp/B.Ey4Kql/BUILD/obs-studio-21.0.1/build' [ 49%] Built target linux-decklink make[1]: Leaving directory '/tmp/B.Ey4Kql/BUILD/obs-studio-21.0.1/build' make[2]: Entering directory '/tmp/B.Ey4Kql/BUILD/obs-studio-21.0.1/build' [ 46%] Building CXX object plugins/linux-capture/CMakeFiles/linux-capture.dir/xcompcap-helper.cpp.o cd /tmp/B.Ey4Kql/BUILD/obs-studio-21.0.1/build/plugins/linux-capture && /usr/bin/x86_64-pld-linux-g++ -DHAVE_OBSCONFIG_H -DUSE_XDG -Dlinux_capture_EXPORTS -I/tmp/B.Ey4Kql/BUILD/obs-studio-21.0.1/build/config -I/tmp/B.Ey4Kql/BUILD/obs-studio-21.0.1/deps/glad/include -isystem /tmp/B.Ey4Kql/BUILD/obs-studio-21.0.1/libobs -Wall -Wextra -Wno-unused-function -Werror-implicit-function-declaration -Wno-missing-field-initializers -std=gnu++11 -fno-strict-aliasing -O2 -fwrapv -pipe -Wformat -Werror=format-security -gdwarf-4 -fno-debug-types-section -fvar-tracking-assignments -g2 -Wp,-D_FORTIFY_SOURCE=2 -fstack-protector-strong --param=ssp-buffer-size=4 -Werror=trampolines -fPIC -march=x86-64 -gdwarf-4 -fno-debug-types-section -fvar-tracking-assignments -g2 -DNDEBUG -DQT_NO_DEBUG -fPIC -mmmx -msse -msse2 -pthread -o CMakeFiles/linux-capture.dir/xcompcap-helper.cpp.o -c /tmp/B.Ey4Kql/BUILD/obs-studio-21.0.1/plugins/linux-capture/xcompcap-helper.cpp make[2]: Leaving directory '/tmp/B.Ey4Kql/BUILD/obs-studio-21.0.1/build' make[2]: Entering directory '/tmp/B.Ey4Kql/BUILD/obs-studio-21.0.1/build' [ 49%] Linking CXX shared module linux-capture.so cd /tmp/B.Ey4Kql/BUILD/obs-studio-21.0.1/build/plugins/linux-capture && /usr/bin/cmake -E cmake_link_script CMakeFiles/linux-capture.dir/link.txt --verbose=1 /usr/bin/x86_64-pld-linux-g++ -fPIC -Wall -Wextra -Wno-unused-function -Werror-implicit-function-declaration -Wno-missing-field-initializers -std=gnu++11 -fno-strict-aliasing -O2 -fwrapv -pipe -Wformat -Werror=format-security -gdwarf-4 -fno-debug-types-section -fvar-tracking-assignments -g2 -Wp,-D_FORTIFY_SOURCE=2 -fstack-protector-strong --param=ssp-buffer-size=4 -Werror=trampolines -fPIC -march=x86-64 -gdwarf-4 -fno-debug-types-section -fvar-tracking-assignments -g2 -DNDEBUG -DQT_NO_DEBUG -Wl,--as-needed -Wl,--no-copy-dt-needed-entries -Wl,-z,relro -Wl,-z,combreloc -shared -o linux-capture.so CMakeFiles/linux-capture.dir/linux-capture.c.o CMakeFiles/linux-capture.dir/xcursor.c.o CMakeFiles/linux-capture.dir/xcursor-xcb.c.o CMakeFiles/linux-capture.dir/xhelpers.c.o CMakeFiles/linux-capture.dir/xshm-input.c.o CMakeFiles/linux-capture.dir/xcomposite-main.cpp.o CMakeFiles/linux-capture.dir/xcompcap-main.cpp.o CMakeFiles/linux-capture.dir/xcompcap-helper.cpp.o -Wl,-rpath,/tmp/B.Ey4Kql/BUILD/obs-studio-21.0.1/build/libobs:/tmp/B.Ey4Kql/BUILD/obs-studio-21.0.1/build/deps/glad: ../../libobs/libobs.so.0 ../../deps/glad/libobsglad.so.0 -lSM -lICE -lX11 -lXext -lXfixes -lX11 -lXcomposite -lxcb -lxcb-shm -lxcb-xfixes -lxcb-xinerama -pthread -ldl -lGL cd /tmp/B.Ey4Kql/BUILD/obs-studio-21.0.1/build/plugins/linux-capture && /usr/bin/cmake -E copy /tmp/B.Ey4Kql/BUILD/obs-studio-21.0.1/build/plugins/linux-capture/linux-capture.so /tmp/B.Ey4Kql/BUILD/obs-studio-21.0.1/build/rundir/PLD/obs-plugins/64bit/linux-capture.so cd /tmp/B.Ey4Kql/BUILD/obs-studio-21.0.1/build/plugins/linux-capture && /usr/bin/cmake -E copy_directory /tmp/B.Ey4Kql/BUILD/obs-studio-21.0.1/plugins/linux-capture/data /tmp/B.Ey4Kql/BUILD/obs-studio-21.0.1/build/rundir/PLD/data/obs-plugins/linux-capture make[2]: Leaving directory '/tmp/B.Ey4Kql/BUILD/obs-studio-21.0.1/build' make[1]: Entering directory '/tmp/B.Ey4Kql/BUILD/obs-studio-21.0.1/build' [ 49%] Built target linux-capture make[1]: Leaving directory '/tmp/B.Ey4Kql/BUILD/obs-studio-21.0.1/build' make: *** [Makefile:155: all] Error 2 error: Bad exit status from /tmp/B.Ey4Kql/BUILD/tmp/rpm-tmp.89197 (%build) RPM build errors: Bad exit status from /tmp/B.Ey4Kql/BUILD/tmp/rpm-tmp.89197 (%build) ended at: Thu Aug 8 15:29:57 2019, done in 0:00:14.923881 error: No files produced. + chmod -R u+rwX /tmp/B.Ey4Kql/BUILD + rm -rf /tmp/B.Ey4Kql/tmp /tmp/B.Ey4Kql/BUILD + rm -rf /tmp/B.Ey4Kql Begin-PLD-Builder-Info Build-Time: user:70.74s sys:9.45s real:41.63s (faults io:23 non-io:2196636) End-PLD-Builder-Info
[Back to list of logs] [View rpm -qa of builder]