FailedOk

th/SRPMS[OK]
th/x32[OK]
th/i686[OK]
th/x86_64[OK]

ac/SRPMS[OK]
ac/i386[OK]
ac/i586[OK]
ac/i686[OK]
ac/alpha[OK]
ac/amd64[OK]
ac/athlon[OK]
ac/ppc[OK]
ac/sparc[OK]
ac/sparc64[OK]

Advanced Search
main()
Powered by PLD Linux
(c) 2002-2019 PLD Team
$Revision: 1.37 $
Powered by Linux.
Your IP: 18.206.194.210

ocfs2-tools 7a79f454-1667-450c-b4da-43db96fcf01a

Status:Failed
Source URL:ftp://buildlogs.pld-linux.org/th/x86_64/FAIL/ocfs2-tools,7a79f454-1667-450c-b4da-43db96fcf01a.bz2
text/plain URL:View!
rpm -qa of builder:View!
Date:2019/10/19 14:40:30
Runtime:0:00:06.175942

Toc:

  • prep
  • Executing(%prep): /bin/sh -e /tmp/B.fcg2Di/BUILD/tmp/rpm-tmp.83853
  • build
  • Executing(%build): /bin/sh -e /tmp/B.fcg2Di/BUILD/tmp/rpm-tmp.83853
  • error 1
  • ../include/ocfs2/ocfs2.h:208:2: error: unknown type name 'loff_t'
  • error 2
  • make[1]: *** [../Postamble.make:40: alloc.o] Error 1
  • error 3
  • error: Bad exit status from /tmp/B.fcg2Di/BUILD/tmp/rpm-tmp.83853 (%build)
  • error 4
  • RPM build errors:
  • error 5
  • error: No files produced.

Content:

request from: baggins
checking if we should skip the build
started at: Sat Oct 19 14:40:22 2019
killing old processes on a builder
sending signal 9 to pid -1
Killed
cleaning up /tmp
fetching https://srcbuilder.pld-linux.org/th//srpms/7a79f454-1667-450c-b4da-43db96fcf01a/ocfs2-tools-1.6.4-3.src.rpm
fetched 845794 bytes, 2022.7 K/s
installing srpm: ocfs2-tools-1.6.4-3.src.rpm
+ install -d /tmp/B.fcg2Di/BUILD /tmp/B.fcg2Di/RPMS
+ LC_ALL=en_US.UTF-8
+ rpm -qp --changelog ocfs2-tools-1.6.4-3.src.rpm
* Sat Oct 19 2019 PLD Linux Team <feedback@pld-linux.org>
- For complete changelog see: http://git.pld-linux.org/?p=packages/ocfs2-tools.git;a=log;h=master
* Thu Oct 17 2019 Arkadiusz Miƛkiewicz <arekm@maven.pl> 87ccf85
- release 3 (by relup.sh) + rpm -Uhv --nodeps --define '_topdir /tmp/B.fcg2Di' --define '_specdir %{_topdir}' --define '_sourcedir %{_specdir}' --define '_rpmdir %{_topdir}/RPMS' --define '_builddir %{_topdir}/BUILD' ocfs2-tools-1.6.4-3.src.rpm Preparing... ################################################## ocfs2-tools ################################################## + rm -f ocfs2-tools-1.6.4-3.src.rpm + install -m 700 -d /tmp/B.fcg2Di/BUILD/tmp + TMPDIR=/tmp/B.fcg2Di/BUILD/tmp + exec nice -n 0 rpmbuild -bp --short-circuit --nodeps --define '_topdir /tmp/B.fcg2Di' --define '_specdir %{_topdir}' --define '_sourcedir %{_specdir}' --define '_rpmdir %{_topdir}/RPMS' --define '_builddir %{_topdir}/BUILD' --target x86_64-pld-linux --define 'prep exit 0' /tmp/B.fcg2Di/ocfs2-tools.spec Building target platforms: x86_64-pld-linux checking BuildConflict-ing packages no BuildConflicts found checking BR rpm: Building target platforms: x86_64-pld-linux no BR needed building RPM using: set -ex; : build-id: 7a79f454-1667-450c-b4da-43db96fcf01a; TMPDIR=/tmp/B.fcg2Di/BUILD/tmp exec nice -n 0 rpmbuild -bb --define '_smp_mflags -j9' --define '_make_opts -Otarget' --define '_pld_builder 1' --define '_topdir /tmp/B.fcg2Di' --define '_specdir %{_topdir}' --define '_sourcedir %{_specdir}' --define '_rpmdir %{_topdir}/RPMS' --define '_builddir %{_topdir}/BUILD' --target x86_64-pld-linux /tmp/B.fcg2Di/ocfs2-tools.spec + : build-id: 7a79f454-1667-450c-b4da-43db96fcf01a + TMPDIR=/tmp/B.fcg2Di/BUILD/tmp + exec nice -n 0 rpmbuild -bb --define '_smp_mflags -j9' --define '_make_opts -Otarget' --define '_pld_builder 1' --define '_topdir /tmp/B.fcg2Di' --define '_specdir %{_topdir}' --define '_sourcedir %{_specdir}' --define '_rpmdir %{_topdir}/RPMS' --define '_builddir %{_topdir}/BUILD' --target x86_64-pld-linux /tmp/B.fcg2Di/ocfs2-tools.spec Building target platforms: x86_64-pld-linux Executing(%prep): /bin/sh -e /tmp/B.fcg2Di/BUILD/tmp/rpm-tmp.83853 + umask 022 + cd /tmp/B.fcg2Di/BUILD + cd /tmp/B.fcg2Di/BUILD + rm -rf ocfs2-tools-1.6.4 + /usr/bin/gzip -dc /tmp/B.fcg2Di/ocfs2-tools-1.6.4.tar.gz + /bin/tar -xf - + STATUS=0 + '[' 0 -ne 0 ']' + cd ocfs2-tools-1.6.4 + /bin/id -u + '[' 1000 '=' 0 ']' + /bin/id -u + '[' 1000 '=' 0 ']' + /bin/chmod -Rf a+rX,u+w,g-w,o-w . + echo 'Patch #0 (ocfs2-tools-tinfo.patch):' Patch #0 (ocfs2-tools-tinfo.patch): + '[' -f /tmp/B.fcg2Di/ocfs2-tools-tinfo.patch ']' + /bin/cat /tmp/B.fcg2Di/ocfs2-tools-tinfo.patch + /usr/bin/patch -s -p1 + echo 'Patch #2 (ocfs2-tools-linux.patch):' Patch #2 (ocfs2-tools-linux.patch): + '[' -f /tmp/B.fcg2Di/ocfs2-tools-linux.patch ']' + /bin/cat /tmp/B.fcg2Di/ocfs2-tools-linux.patch + /usr/bin/patch -s -p1 + echo 'Patch #3 (ocfs2-tools-format.patch):' Patch #3 (ocfs2-tools-format.patch): + '[' -f /tmp/B.fcg2Di/ocfs2-tools-format.patch ']' + /bin/cat /tmp/B.fcg2Di/ocfs2-tools-format.patch + /usr/bin/patch -s -p1 + echo 'Patch #4 (ocfs2-tools-link.patch):' Patch #4 (ocfs2-tools-link.patch): + '[' -f /tmp/B.fcg2Di/ocfs2-tools-link.patch ']' + /bin/cat /tmp/B.fcg2Di/ocfs2-tools-link.patch + /usr/bin/patch -s -p1 + exit 0 Executing(%build): /bin/sh -e /tmp/B.fcg2Di/BUILD/tmp/rpm-tmp.83853 TMP=/home/users/builder/tmp HOME=/home/users/builder PATH=/home/users/builder/GNUstep/Tools:/usr/local/bin:/usr/bin:/bin:/home/users/builder/bin TMPDIR=/tmp/B.fcg2Di/BUILD/tmp + umask 022 + cd /tmp/B.fcg2Di/BUILD + cd ocfs2-tools-1.6.4 + aclocal -I . aclocal: warning: autoconf input should be named 'configure.ac', not 'configure.in' + autoconf + ./configure 'LDFLAGS=-Wl,--as-needed -Wl,--no-copy-dt-needed-entries -Wl,-z,relro -Wl,-z,combreloc ' 'CFLAGS=-O2 -fwrapv -pipe -Wformat -Werror=format-security -gdwarf-4 -fno-debug-types-section -fvar-tracking-assignments -g2 -Wp,-D_FORTIFY_SOURCE=2 -fstack-protector-strong --param=ssp-buffer-size=4 -Werror=trampolines -fPIC -march=x86-64 -gdwarf-4 -fno-debug-types-section -fvar-tracking-assignments -g2 ' 'CXXFLAGS=-O2 -fwrapv -pipe -Wformat -Werror=format-security -gdwarf-4 -fno-debug-types-section -fvar-tracking-assignments -g2 -Wp,-D_FORTIFY_SOURCE=2 -fstack-protector-strong --param=ssp-buffer-size=4 -Werror=trampolines -fPIC -march=x86-64 -gdwarf-4 -fno-debug-types-section -fvar-tracking-assignments -g2 ' 'FFLAGS=-O2 -fwrapv -pipe -Wformat -Werror=format-security -gdwarf-4 -fno-debug-types-section -fvar-tracking-assignments -g2 -Wp,-D_FORTIFY_SOURCE=2 -fstack-protector-strong --param=ssp-buffer-size=4 -Werror=trampolines -fPIC -march=x86-64 -gdwarf-4 -fno-debug-types-section -fvar-tracking-assignments -g2 ' 'FCFLAGS=-O2 -fwrapv -pipe -Wformat -Werror=format-security -gdwarf-4 -fno-debug-types-section -fvar-tracking-assignments -g2 -Wp,-D_FORTIFY_SOURCE=2 -fstack-protector-strong --param=ssp-buffer-size=4 -Werror=trampolines -fPIC -march=x86-64 -gdwarf-4 -fno-debug-types-section -fvar-tracking-assignments -g2 ' 'CPPFLAGS=' 'CC=x86_64-pld-linux-gcc' 'CXX=x86_64-pld-linux-g++' '--host=x86_64-pld-linux' '--build=x86_64-pld-linux' '--prefix=/usr' '--exec-prefix=/usr' '--bindir=/usr/bin' '--sbindir=/usr/sbin' '--sysconfdir=/etc' '--datadir=/usr/share' '--includedir=/usr/include' '--libdir=/usr/lib64' '--libexecdir=/usr/libexec' '--localstatedir=/var' '--sharedstatedir=/var/lib' '--mandir=/usr/share/man' '--infodir=/usr/share/info' '--x-libraries=/usr/lib64' 'ac_cv_lib_cman_cman_replyto_shutdown=no' 'ac_cv_header_openais_saCkpt_h=no' '--enable-dynamic-fsck=yes' '--enable-dynamic-ctl=yes' '--enable-ocfs2console=yes' checking build system type... x86_64-pld-linux-gnu checking host system type... x86_64-pld-linux-gnu checking for debugging... skipped, CFLAGS is set checking for x86_64-pld-linux-gcc... x86_64-pld-linux-gcc checking whether the C compiler works... yes checking for C compiler default output file name... a.out checking for suffix of executables... checking whether we are cross compiling... no checking for suffix of object files... o checking whether we are using the GNU C compiler... yes checking whether x86_64-pld-linux-gcc accepts -g... yes checking for x86_64-pld-linux-gcc option to accept ISO C89... none needed checking how to run the C preprocessor... x86_64-pld-linux-gcc -E checking for a BSD-compatible install... /usr/bin/install -c checking whether ln -s works... yes checking for x86_64-pld-linux-ranlib... no checking for ranlib... ranlib checking for ar... /usr/bin/ar checking for grep that handles long lines and -e... /bin/grep checking for egrep... /bin/grep -E checking for ANSI C header files... yes checking for an ANSI C-conforming const... yes checking for vendor... not found checking for x86_64-pld-linux-pkg-config... no checking for pkg-config... /usr/bin/pkg-config checking pkg-config is at least version 0.9.0... yes checking for sys/types.h... yes checking for sys/stat.h... yes checking for stdlib.h... yes checking for string.h... yes checking for memory.h... yes checking for strings.h... yes checking for inttypes.h... yes checking for stdint.h... yes checking for unistd.h... yes checking for com_err... yes checking for uuid_unparse in -luuid... yes checking uuid/uuid.h usability... yes checking uuid/uuid.h presence... yes checking for uuid/uuid.h... yes checking for tgetstr in -ltinfo... yes checking for tgetstr in -lncurses... yes checking for readline in -lreadline... yes checking readline/readline.h usability... yes checking readline/readline.h presence... yes checking for readline/readline.h... yes checking for debug executables... no checking for pkg-config... /usr/bin/pkg-config checking for GLIB - version >= 2.2.3... yes (version 2.62.1) checking whether glib and com_err can be linked statically... no checking whether to build fsck dynamically... yes checking whether to build cluster control tools dynamically... yes checking for readline in -lreadline... (cached) yes checking for readline/readline.h... (cached) yes checking for crm_get_peer in -lcrmcluster... yes checking pacemaker/crm_config.h usability... yes checking pacemaker/crm_config.h presence... yes checking for pacemaker/crm_config.h... yes checking for cman_replyto_shutdown in -lcman... (cached) no configure: WARNING: libcman not found, cman support will not be built checking corosync/cpg.h usability... yes checking corosync/cpg.h presence... yes checking for corosync/cpg.h... yes checking for cpg_initialize in -lcpg... yes checking for openais/saCkpt.h... (cached) no configure: WARNING: openais/saCkpt.h not found, ocfs2_controld will not be built no configure: WARNING: libSaCkpt not found, ocfs2_controld will not be built checking for dlmc_fs_connect in -ldlmcontrol... yes checking for libdlmcontrol.h... yes checking libdlm.h usability... yes checking libdlm.h presence... yes checking for libdlm.h... yes checking for dlm_create_lockspace in -ldlm_lt... yes checking for a Python interpreter with version >= 2.3... python checking for python... /usr/bin/python checking for python version... 2.7 checking for python platform... linux2 checking for python script directory... ${prefix}/lib64/python2.7/site-packages checking for python extension module directory... ${exec_prefix}/lib64/python2.7/site-packages checking for headers required to compile python extensions... found checking for blkid >= 1.36... yes configure: creating ./config.status config.status: creating Config.make config.status: WARNING: 'Config.make.in' seems to ignore the --datarootdir setting config.status: creating o2cb.pc config.status: creating o2dlm.pc config.status: creating ocfs2.pc config.status: creating ocfs2console/ocfs2interface/confdefs.py config.status: creating debugfs.ocfs2/debugfs.ocfs2.8 config.status: creating mkfs.ocfs2/mkfs.ocfs2.8 config.status: creating mounted.ocfs2/mounted.ocfs2.8 config.status: creating fsck.ocfs2/fsck.ocfs2.8 config.status: creating fsck.ocfs2/fsck.ocfs2.checks.8 config.status: creating mount.ocfs2/mount.ocfs2.8 config.status: creating o2cb_ctl/o2cb_ctl.8 config.status: creating ocfs2_hb_ctl/ocfs2_hb_ctl.8 config.status: creating ocfs2console/ocfs2console.8 config.status: creating tunefs.ocfs2/tunefs.ocfs2.8 config.status: creating o2image/o2image.8 config.status: creating o2info/o2info.1 config.status: creating libo2cb/o2cb.7 config.status: creating vendor/common/ocfs2-tools.spec-generic + /usr/bin/make -Otarget -j9 -j1 /usr/bin/make -C include make[1]: Entering directory '/tmp/B.fcg2Di/BUILD/ocfs2-tools-1.6.4/include' /usr/bin/make -C tools-internal make[2]: Entering directory '/tmp/B.fcg2Di/BUILD/ocfs2-tools-1.6.4/include/tools-internal' make[2]: Nothing to be done for 'all'. make[2]: Leaving directory '/tmp/B.fcg2Di/BUILD/ocfs2-tools-1.6.4/include/tools-internal' /usr/bin/make -C ocfs2-kernel make[2]: Entering directory '/tmp/B.fcg2Di/BUILD/ocfs2-tools-1.6.4/include/ocfs2-kernel' make[2]: Nothing to be done for 'all'. make[2]: Leaving directory '/tmp/B.fcg2Di/BUILD/ocfs2-tools-1.6.4/include/ocfs2-kernel' /usr/bin/make -C o2dlm make[2]: Entering directory '/tmp/B.fcg2Di/BUILD/ocfs2-tools-1.6.4/include/o2dlm' make -C ../../libo2dlm o2dlm_err.h make[3]: Entering directory '/tmp/B.fcg2Di/BUILD/ocfs2-tools-1.6.4/libo2dlm' compile_et o2dlm_err.et make[3]: Leaving directory '/tmp/B.fcg2Di/BUILD/ocfs2-tools-1.6.4/libo2dlm' cp ../../libo2dlm/o2dlm_err.h o2dlm_err.h make[2]: Leaving directory '/tmp/B.fcg2Di/BUILD/ocfs2-tools-1.6.4/include/o2dlm' /usr/bin/make -C o2cb make[2]: Entering directory '/tmp/B.fcg2Di/BUILD/ocfs2-tools-1.6.4/include/o2cb' make -C ../../libo2cb o2cb_err.h make[3]: Entering directory '/tmp/B.fcg2Di/BUILD/ocfs2-tools-1.6.4/libo2cb' compile_et o2cb_err.et make[3]: Leaving directory '/tmp/B.fcg2Di/BUILD/ocfs2-tools-1.6.4/libo2cb' cp ../../libo2cb/o2cb_err.h o2cb_err.h make[2]: Leaving directory '/tmp/B.fcg2Di/BUILD/ocfs2-tools-1.6.4/include/o2cb' /usr/bin/make -C ocfs2 make[2]: Entering directory '/tmp/B.fcg2Di/BUILD/ocfs2-tools-1.6.4/include/ocfs2' make -C ../../libocfs2 ocfs2_err.h make[3]: Entering directory '/tmp/B.fcg2Di/BUILD/ocfs2-tools-1.6.4/libocfs2' compile_et ocfs2_err.et make[3]: Leaving directory '/tmp/B.fcg2Di/BUILD/ocfs2-tools-1.6.4/libocfs2' cp ../../libocfs2/ocfs2_err.h ocfs2_err.h make[2]: Leaving directory '/tmp/B.fcg2Di/BUILD/ocfs2-tools-1.6.4/include/ocfs2' make[1]: Leaving directory '/tmp/B.fcg2Di/BUILD/ocfs2-tools-1.6.4/include' /usr/bin/make -C libtools-internal make[1]: Entering directory '/tmp/B.fcg2Di/BUILD/ocfs2-tools-1.6.4/libtools-internal' x86_64-pld-linux-gcc -O2 -fwrapv -pipe -Wformat -Werror=format-security -gdwarf-4 -fno-debug-types-section -fvar-tracking-assignments -g2 -Wp,-D_FORTIFY_SOURCE=2 -fstack-protector-strong --param=ssp-buffer-size=4 -Werror=trampolines -fPIC -march=x86-64 -gdwarf-4 -fno-debug-types-section -fvar-tracking-assignments -g2 -Wall -Wstrict-prototypes -Wmissing-prototypes -Wmissing-declarations -pipe -fPIC -I. -I../include -DVERSION=\"1.6.4\" -MD -MP -MF ./.verbose.d -o verbose.o -c verbose.c x86_64-pld-linux-gcc -O2 -fwrapv -pipe -Wformat -Werror=format-security -gdwarf-4 -fno-debug-types-section -fvar-tracking-assignments -g2 -Wp,-D_FORTIFY_SOURCE=2 -fstack-protector-strong --param=ssp-buffer-size=4 -Werror=trampolines -fPIC -march=x86-64 -gdwarf-4 -fno-debug-types-section -fvar-tracking-assignments -g2 -Wall -Wstrict-prototypes -Wmissing-prototypes -Wmissing-declarations -pipe -fPIC -I. -I../include -DVERSION=\"1.6.4\" -MD -MP -MF ./.progress.d -o progress.o -c progress.c rm -f libtools-internal.a /usr/bin/ar r libtools-internal.a verbose.o progress.o /usr/bin/ar: creating libtools-internal.a ranlib libtools-internal.a make[1]: Leaving directory '/tmp/B.fcg2Di/BUILD/ocfs2-tools-1.6.4/libtools-internal' /usr/bin/make -C libo2dlm make[1]: Entering directory '/tmp/B.fcg2Di/BUILD/ocfs2-tools-1.6.4/libo2dlm' x86_64-pld-linux-gcc -O2 -fwrapv -pipe -Wformat -Werror=format-security -gdwarf-4 -fno-debug-types-section -fvar-tracking-assignments -g2 -Wp,-D_FORTIFY_SOURCE=2 -fstack-protector-strong --param=ssp-buffer-size=4 -Werror=trampolines -fPIC -march=x86-64 -gdwarf-4 -fno-debug-types-section -fvar-tracking-assignments -g2 -Wall -Wstrict-prototypes -Wmissing-prototypes -Wmissing-declarations -pipe -fPIC -I. -I../include -DHAVE_FSDLM -MD -MP -MF ./.o2dlm.d -o o2dlm.o -c o2dlm.c In file included from /usr/include/string.h:494, from o2dlm.c:38: In function 'strncpy', inlined from 'o2dlm_new_lock_res' at o2dlm.c:384:3: /usr/include/bits/string_fortified.h:106:10: warning: '__builtin_strncpy' specified bound 32 equals destination size [-Wstringop-truncation] 106 | return __builtin___strncpy_chk (__dest, __src, __len, __bos (__dest)); | ^~~~~~~~~~~~~~~~~~~~~~~~~~~~~~~~~~~~~~~~~~~~~~~~~~~~~~~~~~~~~~ x86_64-pld-linux-gcc -O2 -fwrapv -pipe -Wformat -Werror=format-security -gdwarf-4 -fno-debug-types-section -fvar-tracking-assignments -g2 -Wp,-D_FORTIFY_SOURCE=2 -fstack-protector-strong --param=ssp-buffer-size=4 -Werror=trampolines -fPIC -march=x86-64 -gdwarf-4 -fno-debug-types-section -fvar-tracking-assignments -g2 -Wall -Wstrict-prototypes -Wmissing-prototypes -Wmissing-declarations -pipe -fPIC -I. -I../include -DHAVE_FSDLM -MD -MP -MF ./.capabilities.d -o capabilities.o -c capabilities.c x86_64-pld-linux-gcc -O2 -fwrapv -pipe -Wformat -Werror=format-security -gdwarf-4 -fno-debug-types-section -fvar-tracking-assignments -g2 -Wp,-D_FORTIFY_SOURCE=2 -fstack-protector-strong --param=ssp-buffer-size=4 -Werror=trampolines -fPIC -march=x86-64 -gdwarf-4 -fno-debug-types-section -fvar-tracking-assignments -g2 -Wall -Wstrict-prototypes -Wmissing-prototypes -Wmissing-declarations -pipe -fPIC -I. -I../include -DHAVE_FSDLM -MD -MP -MF ./.o2dlm_err.d -o o2dlm_err.o -c o2dlm_err.c rm -f libo2dlm.a /usr/bin/ar r libo2dlm.a o2dlm.o capabilities.o o2dlm_err.o /usr/bin/ar: creating libo2dlm.a ranlib libo2dlm.a make[1]: Leaving directory '/tmp/B.fcg2Di/BUILD/ocfs2-tools-1.6.4/libo2dlm' /usr/bin/make -C libo2cb make[1]: Entering directory '/tmp/B.fcg2Di/BUILD/ocfs2-tools-1.6.4/libo2cb' x86_64-pld-linux-gcc -O2 -fwrapv -pipe -Wformat -Werror=format-security -gdwarf-4 -fno-debug-types-section -fvar-tracking-assignments -g2 -Wp,-D_FORTIFY_SOURCE=2 -fstack-protector-strong --param=ssp-buffer-size=4 -Werror=trampolines -fPIC -march=x86-64 -gdwarf-4 -fno-debug-types-section -fvar-tracking-assignments -g2 -Wall -Wstrict-prototypes -Wmissing-prototypes -Wmissing-declarations -pipe -fPIC -I../include -I. -MD -MP -MF ./.o2cb_abi.d -o o2cb_abi.o -c o2cb_abi.c In file included from /usr/include/string.h:494, from o2cb_abi.c:24: In function 'strncpy', inlined from 'determine_stack' at o2cb_abi.c:152:4, inlined from 'o2cb_init' at o2cb_abi.c:677:8: /usr/include/bits/string_fortified.h:106:10: warning: '__builtin_strncpy' output may be truncated copying 4 bytes from a string of length 99 [-Wstringop-truncation] 106 | return __builtin___strncpy_chk (__dest, __src, __len, __bos (__dest)); | ^~~~~~~~~~~~~~~~~~~~~~~~~~~~~~~~~~~~~~~~~~~~~~~~~~~~~~~~~~~~~~ o2cb_abi.c: In function 'classic_group_leave': o2cb_abi.c:1214:5: warning: 'hb_refs' may be used uninitialized in this function [-Wmaybe-uninitialized] 1214 | if (!hb_refs) { | ^ x86_64-pld-linux-gcc -O2 -fwrapv -pipe -Wformat -Werror=format-security -gdwarf-4 -fno-debug-types-section -fvar-tracking-assignments -g2 -Wp,-D_FORTIFY_SOURCE=2 -fstack-protector-strong --param=ssp-buffer-size=4 -Werror=trampolines -fPIC -march=x86-64 -gdwarf-4 -fno-debug-types-section -fvar-tracking-assignments -g2 -Wall -Wstrict-prototypes -Wmissing-prototypes -Wmissing-declarations -pipe -fPIC -I../include -I. -MD -MP -MF ./.o2cb_crc32.d -o o2cb_crc32.o -c o2cb_crc32.c x86_64-pld-linux-gcc -O2 -fwrapv -pipe -Wformat -Werror=format-security -gdwarf-4 -fno-debug-types-section -fvar-tracking-assignments -g2 -Wp,-D_FORTIFY_SOURCE=2 -fstack-protector-strong --param=ssp-buffer-size=4 -Werror=trampolines -fPIC -march=x86-64 -gdwarf-4 -fno-debug-types-section -fvar-tracking-assignments -g2 -Wall -Wstrict-prototypes -Wmissing-prototypes -Wmissing-declarations -pipe -fPIC -I../include -I. -MD -MP -MF ./.client_proto.d -o client_proto.o -c client_proto.c x86_64-pld-linux-gcc -O2 -fwrapv -pipe -Wformat -Werror=format-security -gdwarf-4 -fno-debug-types-section -fvar-tracking-assignments -g2 -Wp,-D_FORTIFY_SOURCE=2 -fstack-protector-strong --param=ssp-buffer-size=4 -Werror=trampolines -fPIC -march=x86-64 -gdwarf-4 -fno-debug-types-section -fvar-tracking-assignments -g2 -Wall -Wstrict-prototypes -Wmissing-prototypes -Wmissing-declarations -pipe -fPIC -I../include -I. -MD -MP -MF ./.o2cb_err.d -o o2cb_err.o -c o2cb_err.c rm -f libo2cb.a /usr/bin/ar r libo2cb.a o2cb_abi.o o2cb_crc32.o client_proto.o o2cb_err.o /usr/bin/ar: creating libo2cb.a ranlib libo2cb.a make[1]: Leaving directory '/tmp/B.fcg2Di/BUILD/ocfs2-tools-1.6.4/libo2cb' /usr/bin/make -C libocfs2 make[1]: Entering directory '/tmp/B.fcg2Di/BUILD/ocfs2-tools-1.6.4/libocfs2' x86_64-pld-linux-gcc -O2 -fwrapv -pipe -Wformat -Werror=format-security -gdwarf-4 -fno-debug-types-section -fvar-tracking-assignments -g2 -Wp,-D_FORTIFY_SOURCE=2 -fstack-protector-strong --param=ssp-buffer-size=4 -Werror=trampolines -fPIC -march=x86-64 -gdwarf-4 -fno-debug-types-section -fvar-tracking-assignments -g2 -Wall -Wstrict-prototypes -Wmissing-prototypes -Wmissing-declarations -pipe -fPIC -I../include -MD -MP -MF ./.alloc.d -o alloc.o -c alloc.c In file included from alloc.c:32: ../include/ocfs2/ocfs2.h:208:2: error: unknown type name 'loff_t' 208 | loff_t d_off; /* Offset of structure in the file */ | ^~~~~~ make[1]: *** [../Postamble.make:40: alloc.o] Error 1 make[1]: Leaving directory '/tmp/B.fcg2Di/BUILD/ocfs2-tools-1.6.4/libocfs2' make: *** [Postamble.make:54: libocfs2] Error 2 error: Bad exit status from /tmp/B.fcg2Di/BUILD/tmp/rpm-tmp.83853 (%build) RPM build errors: Bad exit status from /tmp/B.fcg2Di/BUILD/tmp/rpm-tmp.83853 (%build) ended at: Sat Oct 19 14:40:30 2019, done in 0:00:06.175942 error: No files produced. + chmod -R u+rwX /tmp/B.fcg2Di/BUILD + rm -rf /tmp/B.fcg2Di/tmp /tmp/B.fcg2Di/BUILD + rm -rf /tmp/B.fcg2Di Begin-PLD-Builder-Info Build-Time: user:5.75s sys:1.03s real:9.08s (faults io:0 non-io:486174) End-PLD-Builder-Info
[Back to list of logs] [View rpm -qa of builder]