FailedOk

th/SRPMS[OK]
th/x32[OK]
th/i686[OK]
th/x86_64[OK]

ac/SRPMS[OK]
ac/i386[OK]
ac/i586[OK]
ac/i686[OK]
ac/alpha[OK]
ac/amd64[OK]
ac/athlon[OK]
ac/ppc[OK]
ac/sparc[OK]
ac/sparc64[OK]

Advanced Search
main()
Powered by PLD Linux
(c) 2002-2019 PLD Team
$Revision: 1.37 $
Powered by vim.
Your IP: 35.172.150.239

ocfs2-tools 7a79f454-1667-450c-b4da-43db96fcf01a

Status:Failed
Source URL:ftp://buildlogs.pld-linux.org/th/x86_64/FAIL/ocfs2-tools,7a79f454-1667-450c-b4da-43db96fcf01a.bz2
text/plain URL:View!
full text:View!
rpm -qa of builder:View!
Date:2019/10/19 14:40:30
Runtime:0:00:06.175942

Toc:

  • error 1
  • ../include/ocfs2/ocfs2.h:208:2: error: unknown type name 'loff_t'
  • error 2
  • make[1]: *** [../Postamble.make:40: alloc.o] Error 1
  • error 3
  • error: Bad exit status from /tmp/B.fcg2Di/BUILD/tmp/rpm-tmp.83853 (%build)
  • error 4
  • RPM build errors:
  • error 5
  • error: No files produced.

Content:

config.status: creating fsck.ocfs2/fsck.ocfs2.checks.8
config.status: creating mount.ocfs2/mount.ocfs2.8
config.status: creating o2cb_ctl/o2cb_ctl.8
config.status: creating ocfs2_hb_ctl/ocfs2_hb_ctl.8
config.status: creating ocfs2console/ocfs2console.8
config.status: creating tunefs.ocfs2/tunefs.ocfs2.8
config.status: creating o2image/o2image.8
config.status: creating o2info/o2info.1
config.status: creating libo2cb/o2cb.7
config.status: creating vendor/common/ocfs2-tools.spec-generic
+ /usr/bin/make -Otarget -j9 -j1
/usr/bin/make -C include
make[1]: Entering directory '/tmp/B.fcg2Di/BUILD/ocfs2-tools-1.6.4/include'
/usr/bin/make -C tools-internal
make[2]: Entering directory '/tmp/B.fcg2Di/BUILD/ocfs2-tools-1.6.4/include/tools-internal'
make[2]: Nothing to be done for 'all'.
make[2]: Leaving directory '/tmp/B.fcg2Di/BUILD/ocfs2-tools-1.6.4/include/tools-internal'
/usr/bin/make -C ocfs2-kernel
make[2]: Entering directory '/tmp/B.fcg2Di/BUILD/ocfs2-tools-1.6.4/include/ocfs2-kernel'
make[2]: Nothing to be done for 'all'.
make[2]: Leaving directory '/tmp/B.fcg2Di/BUILD/ocfs2-tools-1.6.4/include/ocfs2-kernel'
/usr/bin/make -C o2dlm
make[2]: Entering directory '/tmp/B.fcg2Di/BUILD/ocfs2-tools-1.6.4/include/o2dlm'
make -C ../../libo2dlm o2dlm_err.h
make[3]: Entering directory '/tmp/B.fcg2Di/BUILD/ocfs2-tools-1.6.4/libo2dlm'
compile_et o2dlm_err.et
make[3]: Leaving directory '/tmp/B.fcg2Di/BUILD/ocfs2-tools-1.6.4/libo2dlm'
cp ../../libo2dlm/o2dlm_err.h o2dlm_err.h
make[2]: Leaving directory '/tmp/B.fcg2Di/BUILD/ocfs2-tools-1.6.4/include/o2dlm'
/usr/bin/make -C o2cb
make[2]: Entering directory '/tmp/B.fcg2Di/BUILD/ocfs2-tools-1.6.4/include/o2cb'
make -C ../../libo2cb o2cb_err.h
make[3]: Entering directory '/tmp/B.fcg2Di/BUILD/ocfs2-tools-1.6.4/libo2cb'
compile_et o2cb_err.et
make[3]: Leaving directory '/tmp/B.fcg2Di/BUILD/ocfs2-tools-1.6.4/libo2cb'
cp ../../libo2cb/o2cb_err.h o2cb_err.h
make[2]: Leaving directory '/tmp/B.fcg2Di/BUILD/ocfs2-tools-1.6.4/include/o2cb'
/usr/bin/make -C ocfs2
make[2]: Entering directory '/tmp/B.fcg2Di/BUILD/ocfs2-tools-1.6.4/include/ocfs2'
make -C ../../libocfs2 ocfs2_err.h
make[3]: Entering directory '/tmp/B.fcg2Di/BUILD/ocfs2-tools-1.6.4/libocfs2'
compile_et ocfs2_err.et
make[3]: Leaving directory '/tmp/B.fcg2Di/BUILD/ocfs2-tools-1.6.4/libocfs2'
cp ../../libocfs2/ocfs2_err.h ocfs2_err.h
make[2]: Leaving directory '/tmp/B.fcg2Di/BUILD/ocfs2-tools-1.6.4/include/ocfs2'
make[1]: Leaving directory '/tmp/B.fcg2Di/BUILD/ocfs2-tools-1.6.4/include'
/usr/bin/make -C libtools-internal
make[1]: Entering directory '/tmp/B.fcg2Di/BUILD/ocfs2-tools-1.6.4/libtools-internal'
x86_64-pld-linux-gcc -O2 -fwrapv -pipe -Wformat -Werror=format-security -gdwarf-4 -fno-debug-types-section -fvar-tracking-assignments -g2 -Wp,-D_FORTIFY_SOURCE=2 -fstack-protector-strong --param=ssp-buffer-size=4 -Werror=trampolines -fPIC -march=x86-64 -gdwarf-4 -fno-debug-types-section -fvar-tracking-assignments -g2  -Wall -Wstrict-prototypes -Wmissing-prototypes -Wmissing-declarations -pipe -fPIC    -I. -I../include  -DVERSION=\"1.6.4\"  -MD -MP -MF ./.verbose.d -o verbose.o -c verbose.c
x86_64-pld-linux-gcc -O2 -fwrapv -pipe -Wformat -Werror=format-security -gdwarf-4 -fno-debug-types-section -fvar-tracking-assignments -g2 -Wp,-D_FORTIFY_SOURCE=2 -fstack-protector-strong --param=ssp-buffer-size=4 -Werror=trampolines -fPIC -march=x86-64 -gdwarf-4 -fno-debug-types-section -fvar-tracking-assignments -g2  -Wall -Wstrict-prototypes -Wmissing-prototypes -Wmissing-declarations -pipe -fPIC    -I. -I../include  -DVERSION=\"1.6.4\"  -MD -MP -MF ./.progress.d -o progress.o -c progress.c
rm -f libtools-internal.a
/usr/bin/ar r libtools-internal.a verbose.o progress.o
/usr/bin/ar: creating libtools-internal.a
ranlib libtools-internal.a
make[1]: Leaving directory '/tmp/B.fcg2Di/BUILD/ocfs2-tools-1.6.4/libtools-internal'
/usr/bin/make -C libo2dlm
make[1]: Entering directory '/tmp/B.fcg2Di/BUILD/ocfs2-tools-1.6.4/libo2dlm'
x86_64-pld-linux-gcc -O2 -fwrapv -pipe -Wformat -Werror=format-security -gdwarf-4 -fno-debug-types-section -fvar-tracking-assignments -g2 -Wp,-D_FORTIFY_SOURCE=2 -fstack-protector-strong --param=ssp-buffer-size=4 -Werror=trampolines -fPIC -march=x86-64 -gdwarf-4 -fno-debug-types-section -fvar-tracking-assignments -g2  -Wall -Wstrict-prototypes -Wmissing-prototypes -Wmissing-declarations -pipe -fPIC    -I. -I../include  -DHAVE_FSDLM  -MD -MP -MF ./.o2dlm.d -o o2dlm.o -c o2dlm.c
In file included from /usr/include/string.h:494,
                 from o2dlm.c:38:
In function 'strncpy',
    inlined from 'o2dlm_new_lock_res' at o2dlm.c:384:3:
/usr/include/bits/string_fortified.h:106:10: warning: '__builtin_strncpy' specified bound 32 equals destination size [-Wstringop-truncation]
  106 |   return __builtin___strncpy_chk (__dest, __src, __len, __bos (__dest));
      |          ^~~~~~~~~~~~~~~~~~~~~~~~~~~~~~~~~~~~~~~~~~~~~~~~~~~~~~~~~~~~~~
x86_64-pld-linux-gcc -O2 -fwrapv -pipe -Wformat -Werror=format-security -gdwarf-4 -fno-debug-types-section -fvar-tracking-assignments -g2 -Wp,-D_FORTIFY_SOURCE=2 -fstack-protector-strong --param=ssp-buffer-size=4 -Werror=trampolines -fPIC -march=x86-64 -gdwarf-4 -fno-debug-types-section -fvar-tracking-assignments -g2  -Wall -Wstrict-prototypes -Wmissing-prototypes -Wmissing-declarations -pipe -fPIC    -I. -I../include  -DHAVE_FSDLM  -MD -MP -MF ./.capabilities.d -o capabilities.o -c capabilities.c
x86_64-pld-linux-gcc -O2 -fwrapv -pipe -Wformat -Werror=format-security -gdwarf-4 -fno-debug-types-section -fvar-tracking-assignments -g2 -Wp,-D_FORTIFY_SOURCE=2 -fstack-protector-strong --param=ssp-buffer-size=4 -Werror=trampolines -fPIC -march=x86-64 -gdwarf-4 -fno-debug-types-section -fvar-tracking-assignments -g2  -Wall -Wstrict-prototypes -Wmissing-prototypes -Wmissing-declarations -pipe -fPIC    -I. -I../include  -DHAVE_FSDLM  -MD -MP -MF ./.o2dlm_err.d -o o2dlm_err.o -c o2dlm_err.c
rm -f libo2dlm.a
/usr/bin/ar r libo2dlm.a o2dlm.o capabilities.o o2dlm_err.o
/usr/bin/ar: creating libo2dlm.a
ranlib libo2dlm.a
make[1]: Leaving directory '/tmp/B.fcg2Di/BUILD/ocfs2-tools-1.6.4/libo2dlm'
/usr/bin/make -C libo2cb
make[1]: Entering directory '/tmp/B.fcg2Di/BUILD/ocfs2-tools-1.6.4/libo2cb'
x86_64-pld-linux-gcc -O2 -fwrapv -pipe -Wformat -Werror=format-security -gdwarf-4 -fno-debug-types-section -fvar-tracking-assignments -g2 -Wp,-D_FORTIFY_SOURCE=2 -fstack-protector-strong --param=ssp-buffer-size=4 -Werror=trampolines -fPIC -march=x86-64 -gdwarf-4 -fno-debug-types-section -fvar-tracking-assignments -g2  -Wall -Wstrict-prototypes -Wmissing-prototypes -Wmissing-declarations -pipe -fPIC    -I../include -I.   -MD -MP -MF ./.o2cb_abi.d -o o2cb_abi.o -c o2cb_abi.c
In file included from /usr/include/string.h:494,
                 from o2cb_abi.c:24:
In function 'strncpy',
    inlined from 'determine_stack' at o2cb_abi.c:152:4,
    inlined from 'o2cb_init' at o2cb_abi.c:677:8:
/usr/include/bits/string_fortified.h:106:10: warning: '__builtin_strncpy' output may be truncated copying 4 bytes from a string of length 99 [-Wstringop-truncation]
  106 |   return __builtin___strncpy_chk (__dest, __src, __len, __bos (__dest));
      |          ^~~~~~~~~~~~~~~~~~~~~~~~~~~~~~~~~~~~~~~~~~~~~~~~~~~~~~~~~~~~~~
o2cb_abi.c: In function 'classic_group_leave':
o2cb_abi.c:1214:5: warning: 'hb_refs' may be used uninitialized in this function [-Wmaybe-uninitialized]
 1214 |  if (!hb_refs) {
      |     ^
x86_64-pld-linux-gcc -O2 -fwrapv -pipe -Wformat -Werror=format-security -gdwarf-4 -fno-debug-types-section -fvar-tracking-assignments -g2 -Wp,-D_FORTIFY_SOURCE=2 -fstack-protector-strong --param=ssp-buffer-size=4 -Werror=trampolines -fPIC -march=x86-64 -gdwarf-4 -fno-debug-types-section -fvar-tracking-assignments -g2  -Wall -Wstrict-prototypes -Wmissing-prototypes -Wmissing-declarations -pipe -fPIC    -I../include -I.   -MD -MP -MF ./.o2cb_crc32.d -o o2cb_crc32.o -c o2cb_crc32.c
x86_64-pld-linux-gcc -O2 -fwrapv -pipe -Wformat -Werror=format-security -gdwarf-4 -fno-debug-types-section -fvar-tracking-assignments -g2 -Wp,-D_FORTIFY_SOURCE=2 -fstack-protector-strong --param=ssp-buffer-size=4 -Werror=trampolines -fPIC -march=x86-64 -gdwarf-4 -fno-debug-types-section -fvar-tracking-assignments -g2  -Wall -Wstrict-prototypes -Wmissing-prototypes -Wmissing-declarations -pipe -fPIC    -I../include -I.   -MD -MP -MF ./.client_proto.d -o client_proto.o -c client_proto.c
x86_64-pld-linux-gcc -O2 -fwrapv -pipe -Wformat -Werror=format-security -gdwarf-4 -fno-debug-types-section -fvar-tracking-assignments -g2 -Wp,-D_FORTIFY_SOURCE=2 -fstack-protector-strong --param=ssp-buffer-size=4 -Werror=trampolines -fPIC -march=x86-64 -gdwarf-4 -fno-debug-types-section -fvar-tracking-assignments -g2  -Wall -Wstrict-prototypes -Wmissing-prototypes -Wmissing-declarations -pipe -fPIC    -I../include -I.   -MD -MP -MF ./.o2cb_err.d -o o2cb_err.o -c o2cb_err.c
rm -f libo2cb.a
/usr/bin/ar r libo2cb.a o2cb_abi.o o2cb_crc32.o client_proto.o o2cb_err.o
/usr/bin/ar: creating libo2cb.a
ranlib libo2cb.a
make[1]: Leaving directory '/tmp/B.fcg2Di/BUILD/ocfs2-tools-1.6.4/libo2cb'
/usr/bin/make -C libocfs2
make[1]: Entering directory '/tmp/B.fcg2Di/BUILD/ocfs2-tools-1.6.4/libocfs2'
x86_64-pld-linux-gcc -O2 -fwrapv -pipe -Wformat -Werror=format-security -gdwarf-4 -fno-debug-types-section -fvar-tracking-assignments -g2 -Wp,-D_FORTIFY_SOURCE=2 -fstack-protector-strong --param=ssp-buffer-size=4 -Werror=trampolines -fPIC -march=x86-64 -gdwarf-4 -fno-debug-types-section -fvar-tracking-assignments -g2  -Wall -Wstrict-prototypes -Wmissing-prototypes -Wmissing-declarations -pipe -fPIC    -I../include   -MD -MP -MF ./.alloc.d -o alloc.o -c alloc.c
In file included from alloc.c:32:
../include/ocfs2/ocfs2.h:208:2: error: unknown type name 'loff_t'
  208 |  loff_t d_off; /* Offset of structure in the file */
      |  ^~~~~~
make[1]: *** [../Postamble.make:40: alloc.o] Error 1
make[1]: Leaving directory '/tmp/B.fcg2Di/BUILD/ocfs2-tools-1.6.4/libocfs2'
make: *** [Postamble.make:54: libocfs2] Error 2
error: Bad exit status from /tmp/B.fcg2Di/BUILD/tmp/rpm-tmp.83853 (%build)


RPM build errors:
    Bad exit status from /tmp/B.fcg2Di/BUILD/tmp/rpm-tmp.83853 (%build)
ended at: Sat Oct 19 14:40:30 2019, done in 0:00:06.175942
error: No files produced.
+ chmod -R u+rwX /tmp/B.fcg2Di/BUILD
+ rm -rf /tmp/B.fcg2Di/tmp /tmp/B.fcg2Di/BUILD
+ rm -rf /tmp/B.fcg2Di
Begin-PLD-Builder-Info
Build-Time: user:5.75s sys:1.03s real:9.08s (faults io:0 non-io:486174)

End-PLD-Builder-Info
[Back to list of logs] [View rpm -qa of builder]