FailedOk

th/SRPMS[OK]
th/x32[OK]
th/i686[OK]
th/x86_64[OK]

ac/SRPMS[OK]
ac/i386[OK]
ac/i586[OK]
ac/i686[OK]
ac/alpha[OK]
ac/amd64[OK]
ac/athlon[OK]
ac/ppc[OK]
ac/sparc[OK]
ac/sparc64[OK]

Advanced Search
main()
Powered by PLD Linux
(c) 2002-2017 PLD Team
$Revision: 1.37 $
Powered by foobar.
Your IP: 54.167.44.32

owncloudclient ffc0c99d-4b65-41d2-940d-fec5381d2120

Status:Failed
Source URL:ftp://buildlogs.pld-linux.org/th/x86_64/FAIL/owncloudclient,ffc0c99d-4b65-41d2-940d-fec5381d2120.bz2
text/plain URL:View!
rpm -qa of builder:View!
Date:2017/09/25 20:59:11
Runtime:0:00:45.927904

Toc:

  • error 1
  • rpm: error: Failed build dependencies:
  • error 2
  • rpm: error: Failed build dependencies:
  • prep
  • Executing(%prep): /bin/sh -e /tmp/B.LDs7so/BUILD/tmp/rpm-tmp.88705
  • build
  • Executing(%build): /bin/sh -e /tmp/B.LDs7so/BUILD/tmp/rpm-tmp.84468
  • error 3
  • error: Bad exit status from /tmp/B.LDs7so/BUILD/tmp/rpm-tmp.84468 (%build)
  • error 4
  • RPM build errors:
  • error 5
  • error: No files produced.

Content:

request from: baggins
checking if we should skip the build
started at: Mon Sep 25 20:57:36 2017
fetching https://srcbuilder.pld-linux.org/th//srpms/ffc0c99d-4b65-41d2-940d-fec5381d2120/owncloudclient-2.3.3-1.src.rpm
fetched 33858221 bytes, 5097.7 K/s
installing srpm: owncloudclient-2.3.3-1.src.rpm
mesg: ttyname failed: Inappropriate ioctl for device
+ install -d /tmp/B.LDs7so/BUILD /tmp/B.LDs7so/RPMS
+ LC_ALL=en_US.UTF-8
+ rpm -qp --changelog owncloudclient-2.3.3-1.src.rpm
* Mon Sep 25 2017 PLD Linux Team <feedback@pld-linux.org>
- For complete changelog see: http://git.pld-linux.org/?p=packages/owncloudclient.git;a=log;h=master
* Sun Sep 24 2017 Jaroslaw Kruk <kruk.jaroslaw@gmail.com> d31e5b3
- updated to 2.3.3 * Sun Sep 24 2017 Jaroslaw Kruk <kruk.jaroslaw@gmail.com> 461d7e6
- updated to 2.3.2 added caja subpackage rel 1 + rpm -Uhv --nodeps --define '_topdir /tmp/B.LDs7so' --define '_specdir %{_topdir}' --define '_sourcedir %{_specdir}' --define '_rpmdir %{_topdir}/RPMS' --define '_builddir %{_topdir}/BUILD' owncloudclient-2.3.3-1.src.rpm Preparing... ################################################## owncloudclient ################################################## + rm -f owncloudclient-2.3.3-1.src.rpm mesg: ttyname failed: Inappropriate ioctl for device + install -m 700 -d /tmp/B.LDs7so/BUILD/tmp mesg: ttyname failed: Inappropriate ioctl for device + TMPDIR=/tmp/B.LDs7so/BUILD/tmp + exec nice -n 0 rpmbuild -bp --short-circuit --nodeps --define '_topdir /tmp/B.LDs7so' --define '_specdir %{_topdir}' --define '_sourcedir %{_specdir}' --define '_rpmdir %{_topdir}/RPMS' --define '_builddir %{_topdir}/BUILD' --target x86_64-pld-linux --define 'prep exit 0' /tmp/B.LDs7so/owncloudclient.spec Building target platforms: x86_64-pld-linux checking BuildConflict-ing packages rpmbuild: QtLockedFile-devel conflicts with owncloudclient-2.3.3-1.src uninstalling conflicting packages removing QtLockedFile-devel mark QtLockedFile-devel-2.4-3.x86_64 Processing dependencies... There are 1 package to remove: R QtLockedFile-devel-2.4-3.x86_64 This operation will free 51.8KB of disk space. Running pm-command.sh --erase --root /... no BuildConflicts found checking BR rpm: error: Failed build dependencies: rpm: Qt5Keychain-devel is needed by owncloudclient-2.3.3-1.src rpm: texlive-latex-ams is needed by owncloudclient-2.3.3-1.src rpm: Building target platforms: x86_64-pld-linux updating poldek cache... ready is up to date Retrieving th::packages.ndir.md... th is up to date Retrieving th::packages.ndir.md... th is up to date Retrieving th-ready::packages.ndir.md... th-ready is up to date Retrieving th-ready::packages.ndir.md... th-ready is up to date Retrieving th-test::packages.ndir.md... th-test is up to date Retrieving th-test::packages.ndir.md... th-test is up to date checking conflicting packages in BRed packages poldek: Loading [pndir]ready... poldek: Loading [pndir]th-test... poldek: Loading [pndir]th-test... poldek: Loading [pndir]th-ready... poldek: Loading [pndir]th-ready... poldek: Loading [pndir]th... poldek: Loading [pndir]th... poldek: 28502 packages read poldek: Removed 1399 duplicate packages from available set poldek: Processing dependencies... poldek: Qt5Keychain-devel-0.4.0-2.x86_64 marks Qt5Keychain-0.4.0-2.x86_64 (cap Qt5Keychain = 0.4.0-2) poldek: There are 3 packages to install (1 marked by dependencies): poldek: I Qt5Keychain-devel-0.4.0-2.x86_64 texlive-latex-ams-20080816-33.noarch poldek: D Qt5Keychain-0.4.0-2.x86_64 poldek: This operation will use 7.6MB of disk space. poldek: Need to get 3.3MB of archives (3.3MB to download). poldek: poldek: Retrieving [1/3] th::Qt5Keychain-0.4.0-2.x86_64.rpm... poldek: ..............................done poldek: Retrieving [2/3] th::Qt5Keychain-devel-0.4.0-2.x86_64.rpm... poldek: ..............................done poldek: Retrieving [3/3] th::texlive-latex-ams-20080816-33.noarch.rpm... poldek: ..............................done poldek: Executing pm-command.sh --upgrade -vh --test --root / --define _check_dirname_deps 1... poldek: Preparing... ################################################## no conflicts found checking BR rpm: error: Failed build dependencies: rpm: Qt5Keychain-devel is needed by owncloudclient-2.3.3-1.src rpm: texlive-latex-ams is needed by owncloudclient-2.3.3-1.src rpm: Building target platforms: x86_64-pld-linux installing BR: Qt5Keychain\-devel texlive\-latex\-ams + poldek --noask --caplookup -Q -v --upgrade Qt5Keychain-devel texlive-latex-ams Loading [pndir]ready... Loading [pndir]th-test... Loading [pndir]th-test... Loading [pndir]th-ready... Loading [pndir]th-ready... Loading [pndir]th... Loading [pndir]th... 28502 packages read Removed 1399 duplicate packages from available set Processing dependencies... Qt5Keychain-devel-0.4.0-2.x86_64 marks Qt5Keychain-0.4.0-2.x86_64 (cap Qt5Keychain = 0.4.0-2) There are 2 packages to install (1 marked by dependencies): I Qt5Keychain-devel-0.4.0-2.x86_64 D Qt5Keychain-0.4.0-2.x86_64 This operation will use 164.4KB of disk space. Need to get 54.9KB of archives. Executing pm-command.sh --upgrade -vh --root / --define _check_dirname_deps 1... Preparing... ################################################## Qt5Keychain ################################################## Qt5Keychain-devel ################################################## Installing set #2 Processing dependencies... There are 1 package to install: I texlive-latex-ams-20080816-33.noarch This operation will use 7.5MB of disk space. Need to get 3.3MB of archives. Executing pm-command.sh --upgrade -vh --root / --define _check_dirname_deps 1... Preparing... ################################################## texlive-latex-ams ################################################## building RPM using: set -ex; : build-id: ffc0c99d-4b65-41d2-940d-fec5381d2120; TMPDIR=/tmp/B.LDs7so/BUILD/tmp exec nice -n 0 rpmbuild -bb --define '_smp_mflags -j5' --define '_make_opts -Otarget' --define '_pld_builder 1' --define '_topdir /tmp/B.LDs7so' --define '_specdir %{_topdir}' --define '_sourcedir %{_specdir}' --define '_rpmdir %{_topdir}/RPMS' --define '_builddir %{_topdir}/BUILD' --target x86_64-pld-linux /tmp/B.LDs7so/owncloudclient.spec mesg: ttyname failed: Inappropriate ioctl for device + : build-id: ffc0c99d-4b65-41d2-940d-fec5381d2120 + TMPDIR=/tmp/B.LDs7so/BUILD/tmp + exec nice -n 0 rpmbuild -bb --define '_smp_mflags -j5' --define '_make_opts -Otarget' --define '_pld_builder 1' --define '_topdir /tmp/B.LDs7so' --define '_specdir %{_topdir}' --define '_sourcedir %{_specdir}' --define '_rpmdir %{_topdir}/RPMS' --define '_builddir %{_topdir}/BUILD' --target x86_64-pld-linux /tmp/B.LDs7so/owncloudclient.spec Building target platforms: x86_64-pld-linux Executing(%prep): /bin/sh -e /tmp/B.LDs7so/BUILD/tmp/rpm-tmp.88705 + umask 022 + cd /tmp/B.LDs7so/BUILD + cd /tmp/B.LDs7so/BUILD + rm -rf owncloudclient-2.3.3 + /usr/bin/xz -dc /tmp/B.LDs7so/owncloudclient-2.3.3.tar.xz + /bin/tar -xf - + STATUS=0 + '[' 0 -ne 0 ']' + cd owncloudclient-2.3.3 + /bin/id -u + '[' 1000 '=' 0 ']' + /bin/id -u + '[' 1000 '=' 0 ']' + /bin/chmod -Rf a+rX,u+w,g-w,o-w . + echo 'Patch #0 (syslibs.patch):' Patch #0 (syslibs.patch): + '[' -f /tmp/B.LDs7so/syslibs.patch ']' + /bin/cat /tmp/B.LDs7so/syslibs.patch + /usr/bin/patch -s -p1 + mv src/3rdparty/qtlockedfile . + mv src/3rdparty/qtsingleapplication . + exit 0 Executing(%build): /bin/sh -e /tmp/B.LDs7so/BUILD/tmp/rpm-tmp.84468 TMP=/home/users/builder/tmp HOME=/home/users/builder PATH=/home/users/builder/GNUstep/Tools:/usr/local/bin:/usr/bin:/bin:/home/users/builder/bin TMPDIR=/tmp/B.LDs7so/BUILD/tmp + umask 022 + cd /tmp/B.LDs7so/BUILD + cd owncloudclient-2.3.3 + install -d build + cd build + CC=x86_64-pld-linux-gcc CXX=x86_64-pld-linux-g++ CPPFLAGS= /usr/bin/cmake '-DCMAKE_VERBOSE_MAKEFILE=ON' '-DCMAKE_BUILD_TYPE=PLD' '-DCMAKE_INSTALL_BINDIR:PATH=/usr/bin' '-DCMAKE_INSTALL_SBINDIR:PATH=/usr/sbin' '-DCMAKE_INSTALL_LIBEXECDIR:PATH=/usr/lib64' '-DCMAKE_INSTALL_SYSCONFDIR:PATH=/etc' '-DCMAKE_INSTALL_SHAREDSTATEDIRPATH:PATH=/var/lib' '-DCMAKE_INSTALL_LOCALSTATEDIRPATH:PATH=/var' '-DCMAKE_INSTALL_LIBDIR:PATH=/usr/lib64' '-DCMAKE_INSTALL_INCLUDEDIR:PATH=/usr/include' '-DCMAKE_INSTALL_OLDINCLUDEDIR:PATH=/usr/include' '-DCMAKE_INSTALL_DATAROOTDIR:PATH=/usr/share' '-DCMAKE_INSTALL_DATADIR:PATH=/usr/share' '-DCMAKE_INSTALL_INFODIR:PATH=/usr/share/info' '-DCMAKE_INSTALL_LOCALEDIR:PATH=/usr/share/locale' '-DCMAKE_INSTALL_MANDIR:PATH=/usr/share/man' '-DCMAKE_INSTALL_DOCDIR:PATH=/usr/share/doc' '-DCMAKE_INSTALL_PREFIX:PATH=/usr' '-DSYSCONF_INSTALL_DIR:PATH=/etc' '-DCMAKE_CXX_FLAGS_PLD=-O2 -fwrapv -pipe -Wformat -Werror=format-security -gdwarf-4 -fno-debug-types-section -fvar-tracking-assignments -g2 -Wp,-D_FORTIFY_SOURCE=2 -fstack-protector-strong --param=ssp-buffer-size=4 -fPIC -march=x86-64 -gdwarf-4 -fno-debug-types-section -fvar-tracking-assignments -g2 -DNDEBUG -DQT_NO_DEBUG' '-DCMAKE_C_FLAGS_PLD=-O2 -fwrapv -pipe -Wformat -Werror=format-security -gdwarf-4 -fno-debug-types-section -fvar-tracking-assignments -g2 -Wp,-D_FORTIFY_SOURCE=2 -fstack-protector-strong --param=ssp-buffer-size=4 -fPIC -march=x86-64 -gdwarf-4 -fno-debug-types-section -fvar-tracking-assignments -g2 -DNDEBUG -DQT_NO_DEBUG' '-DCMAKE_Fortran_FLAGS_PLD=-O2 -fwrapv -pipe -Wformat -Werror=format-security -gdwarf-4 -fno-debug-types-section -fvar-tracking-assignments -g2 -Wp,-D_FORTIFY_SOURCE=2 -fstack-protector-strong --param=ssp-buffer-size=4 -fPIC -march=x86-64 -gdwarf-4 -fno-debug-types-section -fvar-tracking-assignments -g2 -DNDEBUG -DQT_NO_DEBUG' '-DCMAKE_EXE_LINKER_FLAGS_PLD=-Wl,--as-needed -Wl,--no-copy-dt-needed-entries -Wl,-z,relro -Wl,-z,combreloc ' '-DCMAKE_SHARED_LINKER_FLAGS_PLD=-Wl,--as-needed -Wl,--no-copy-dt-needed-entries -Wl,-z,relro -Wl,-z,combreloc ' '-DCMAKE_MODULE_LINKER_FLAGS_PLD=-Wl,--as-needed -Wl,--no-copy-dt-needed-entries -Wl,-z,relro -Wl,-z,combreloc ' '-DLIB_SUFFIX=64' '-DBUILD_SHARED_LIBS:BOOL=ON' '-DQTKEYCHAIN_INCLUDE_DIR=/usr/include/qt5keychain' '-DQTKEYCHAIN_LIBRARY=/usr/lib64/libqt5keychain.so' '-DQT_LRELEASE_EXECUTABLE=/usr/bin/lrelease-qt5' '-DBUILD_WITH_QT4=NO' '-DSPHINX_EXECUTABLE=/usr/bin/sphinx-build-2' '-DPDFLATEX_EXECUTABLE=/usr/bin/pdflatex' '-DDOXYGEN_EXECUTABLE=/usr/bin/doxygen' '-DCMAKE_INSTALL_DOCDIR=/usr/share/doc/owncloudclient' '-DCMAKE_DISABLE_FIND_PACKAGE_ECM=TRUE' '-DCMAKE_DISABLE_FIND_PACKAGE_KF5=TRUE' .. -- The C compiler identification is GNU 7.2.0 -- The CXX compiler identification is GNU 7.2.0 -- Check for working C compiler: /usr/bin/x86_64-pld-linux-gcc -- Check for working C compiler: /usr/bin/x86_64-pld-linux-gcc -- works -- Detecting C compiler ABI info -- Detecting C compiler ABI info - done -- Detecting C compile features -- Detecting C compile features - done -- Check for working CXX compiler: /usr/bin/x86_64-pld-linux-g++ -- Check for working CXX compiler: /usr/bin/x86_64-pld-linux-g++ -- works -- Detecting CXX compiler ABI info -- Detecting CXX compiler ABI info - done -- Detecting CXX compile features -- Detecting CXX compile features - done -- Build of crashreporter disabled. 57bc7918d7b0650c116f3512787f7677d4e5ab17 -- GIT_SHA1 57bc7918d7b0650c116f3512787f7677d4e5ab17 -- Found OpenSSL: /usr/lib64/libcrypto.so (found suitable version "1.0.2l", minimum required is "1.0.0") -- Could NOT find INOTIFY (missing: INOTIFY_LIBRARY_DIR) -- Found Sphinx: /usr/bin/sphinx-build-2 -- Found PdfLatex: /usr/bin/pdflatex -- Found PkgConfig: /usr/bin/pkg-config (found version "0.29.2") -- Checking for module 'sqlite3' -- Found sqlite3, version 3.20.0 -- Found SQLite3: /usr/lib64/libsqlite3.so (Required is at least version "3.8.0") -- Found ZLIB: /usr/lib64/libz.so (found version "1.2.11") -- Performing Test WITH_FPIC -- Performing Test WITH_FPIC - Success -- Performing Test WITH_STACK_PROTECTOR -- Performing Test WITH_STACK_PROTECTOR - Success -- Looking for iconv.h -- Looking for iconv.h - found -- Looking for sys/iconv.h -- Looking for sys/iconv.h - not found -- Looking for iconv -- Looking for iconv - found -- Checking prototype iconv for HAVE_ICONV_CONST - False -- Found Iconv: /usr/include -- Checking for module 'sqlite3' -- Found sqlite3, version 3.20.0 -- Found SQLite3: /usr/lib64/libsqlite3.so;/usr/lib64/libsqlite3.so (Required is at least version "3.8.0") -- Looking for argp.h -- Looking for argp.h - found -- Looking for clock_gettime in rt -- Looking for clock_gettime in rt - found -- Looking for dlopen in dl -- Looking for dlopen in dl - found -- Looking for asprintf -- Looking for asprintf - found -- Looking for fnmatch -- Looking for fnmatch - found -- Looking for timegm -- Looking for timegm - found -- Looking for strerror_r -- Looking for strerror_r - found -- Looking for utimes -- Looking for utimes - found -- Looking for lstat -- Looking for lstat - found -- Copy file from /tmp/B.LDs7so/BUILD/owncloudclient-2.3.3/csync/CTestCustom.cmake to /tmp/B.LDs7so/BUILD/owncloudclient-2.3.3/build/csync/CTestCustom.cmake -- Performing Test COMPILER_HAS_HIDDEN_VISIBILITY -- Performing Test COMPILER_HAS_HIDDEN_VISIBILITY - Success -- Performing Test COMPILER_HAS_HIDDEN_INLINE_VISIBILITY -- Performing Test COMPILER_HAS_HIDDEN_INLINE_VISIBILITY - Success -- Performing Test COMPILER_HAS_DEPRECATED_ATTR -- Performing Test COMPILER_HAS_DEPRECATED_ATTR - Success -- Found Qt5 core, checking for further dependencies... -- Using Qt 5! -- Found Qt5Keychain: /usr/lib64/libqt5keychain.so Dolphin plugin disabled: KDE Frameworks 5.16 not found -- Found Doxygen: /usr/bin/doxygen (found version "1.8.8") -- Configuring done -- Generating done CMake Warning: Manually-specified variables were not used by the project: CMAKE_Fortran_FLAGS_PLD CMAKE_INSTALL_LOCALSTATEDIRPATH CMAKE_INSTALL_SHAREDSTATEDIRPATH CMAKE_MODULE_LINKER_FLAGS_PLD QT_LRELEASE_EXECUTABLE -- Build files have been written to: /tmp/B.LDs7so/BUILD/owncloudclient-2.3.3/build + /usr/bin/make -Otarget -j5 /usr/bin/cmake -H/tmp/B.LDs7so/BUILD/owncloudclient-2.3.3 -B/tmp/B.LDs7so/BUILD/owncloudclient-2.3.3/build --check-build-system CMakeFiles/Makefile.cmake 0 /usr/bin/cmake -E cmake_progress_start /tmp/B.LDs7so/BUILD/owncloudclient-2.3.3/build/CMakeFiles /tmp/B.LDs7so/BUILD/owncloudclient-2.3.3/build/CMakeFiles/progress.marks /usr/bin/make -f CMakeFiles/Makefile2 all /usr/bin/make -f csync/src/std/CMakeFiles/cstdlib.dir/build.make csync/src/std/CMakeFiles/cstdlib.dir/depend /usr/bin/make -f src/libsync/CMakeFiles/owncloudsync_autogen.dir/build.make src/libsync/CMakeFiles/owncloudsync_autogen.dir/depend /usr/bin/make -f src/gui/CMakeFiles/updater_autogen.dir/build.make src/gui/CMakeFiles/updater_autogen.dir/depend /usr/bin/make -f src/gui/CMakeFiles/owncloud_autogen.dir/build.make src/gui/CMakeFiles/owncloud_autogen.dir/depend /usr/bin/make -f src/cmd/CMakeFiles/owncloudcmd_autogen.dir/build.make src/cmd/CMakeFiles/owncloudcmd_autogen.dir/depend make[2]: Entering directory '/tmp/B.LDs7so/BUILD/owncloudclient-2.3.3/build' cd /tmp/B.LDs7so/BUILD/owncloudclient-2.3.3/build && /usr/bin/cmake -E cmake_depends "Unix Makefiles" /tmp/B.LDs7so/BUILD/owncloudclient-2.3.3 /tmp/B.LDs7so/BUILD/owncloudclient-2.3.3/src/gui /tmp/B.LDs7so/BUILD/owncloudclient-2.3.3/build /tmp/B.LDs7so/BUILD/owncloudclient-2.3.3/build/src/gui /tmp/B.LDs7so/BUILD/owncloudclient-2.3.3/build/src/gui/CMakeFiles/owncloud_autogen.dir/DependInfo.cmake --color= Scanning dependencies of target owncloud_autogen make[2]: Leaving directory '/tmp/B.LDs7so/BUILD/owncloudclient-2.3.3/build' /usr/bin/make -f src/gui/CMakeFiles/owncloud_autogen.dir/build.make src/gui/CMakeFiles/owncloud_autogen.dir/build make[2]: Entering directory '/tmp/B.LDs7so/BUILD/owncloudclient-2.3.3/build' cd /tmp/B.LDs7so/BUILD/owncloudclient-2.3.3/build && /usr/bin/cmake -E cmake_depends "Unix Makefiles" /tmp/B.LDs7so/BUILD/owncloudclient-2.3.3 /tmp/B.LDs7so/BUILD/owncloudclient-2.3.3/src/cmd /tmp/B.LDs7so/BUILD/owncloudclient-2.3.3/build /tmp/B.LDs7so/BUILD/owncloudclient-2.3.3/build/src/cmd /tmp/B.LDs7so/BUILD/owncloudclient-2.3.3/build/src/cmd/CMakeFiles/owncloudcmd_autogen.dir/DependInfo.cmake --color= Scanning dependencies of target owncloudcmd_autogen make[2]: Leaving directory '/tmp/B.LDs7so/BUILD/owncloudclient-2.3.3/build' /usr/bin/make -f src/cmd/CMakeFiles/owncloudcmd_autogen.dir/build.make src/cmd/CMakeFiles/owncloudcmd_autogen.dir/build make[2]: Entering directory '/tmp/B.LDs7so/BUILD/owncloudclient-2.3.3/build' cd /tmp/B.LDs7so/BUILD/owncloudclient-2.3.3/build && /usr/bin/cmake -E cmake_depends "Unix Makefiles" /tmp/B.LDs7so/BUILD/owncloudclient-2.3.3 /tmp/B.LDs7so/BUILD/owncloudclient-2.3.3/csync/src/std /tmp/B.LDs7so/BUILD/owncloudclient-2.3.3/build /tmp/B.LDs7so/BUILD/owncloudclient-2.3.3/build/csync/src/std /tmp/B.LDs7so/BUILD/owncloudclient-2.3.3/build/csync/src/std/CMakeFiles/cstdlib.dir/DependInfo.cmake --color= Scanning dependencies of target cstdlib make[2]: Leaving directory '/tmp/B.LDs7so/BUILD/owncloudclient-2.3.3/build' /usr/bin/make -f csync/src/std/CMakeFiles/cstdlib.dir/build.make csync/src/std/CMakeFiles/cstdlib.dir/build make[2]: Entering directory '/tmp/B.LDs7so/BUILD/owncloudclient-2.3.3/build' cd /tmp/B.LDs7so/BUILD/owncloudclient-2.3.3/build && /usr/bin/cmake -E cmake_depends "Unix Makefiles" /tmp/B.LDs7so/BUILD/owncloudclient-2.3.3 /tmp/B.LDs7so/BUILD/owncloudclient-2.3.3/src/gui /tmp/B.LDs7so/BUILD/owncloudclient-2.3.3/build /tmp/B.LDs7so/BUILD/owncloudclient-2.3.3/build/src/gui /tmp/B.LDs7so/BUILD/owncloudclient-2.3.3/build/src/gui/CMakeFiles/updater_autogen.dir/DependInfo.cmake --color= Scanning dependencies of target updater_autogen make[2]: Leaving directory '/tmp/B.LDs7so/BUILD/owncloudclient-2.3.3/build' /usr/bin/make -f src/gui/CMakeFiles/updater_autogen.dir/build.make src/gui/CMakeFiles/updater_autogen.dir/build make[2]: Entering directory '/tmp/B.LDs7so/BUILD/owncloudclient-2.3.3/build' cd /tmp/B.LDs7so/BUILD/owncloudclient-2.3.3/build && /usr/bin/cmake -E cmake_depends "Unix Makefiles" /tmp/B.LDs7so/BUILD/owncloudclient-2.3.3 /tmp/B.LDs7so/BUILD/owncloudclient-2.3.3/src/libsync /tmp/B.LDs7so/BUILD/owncloudclient-2.3.3/build /tmp/B.LDs7so/BUILD/owncloudclient-2.3.3/build/src/libsync /tmp/B.LDs7so/BUILD/owncloudclient-2.3.3/build/src/libsync/CMakeFiles/owncloudsync_autogen.dir/DependInfo.cmake --color= Scanning dependencies of target owncloudsync_autogen make[2]: Leaving directory '/tmp/B.LDs7so/BUILD/owncloudclient-2.3.3/build' /usr/bin/make -f src/libsync/CMakeFiles/owncloudsync_autogen.dir/build.make src/libsync/CMakeFiles/owncloudsync_autogen.dir/build make[2]: Entering directory '/tmp/B.LDs7so/BUILD/owncloudclient-2.3.3/build' [ 1%] Building C object csync/src/std/CMakeFiles/cstdlib.dir/c_alloc.c.o cd /tmp/B.LDs7so/BUILD/owncloudclient-2.3.3/build/csync/src/std && /usr/bin/x86_64-pld-linux-gcc -DUNICODE -DUSE_FDO_NOTIFICATIONS -D_GNU_SOURCE -D_UNICODE -I/tmp/B.LDs7so/BUILD/owncloudclient-2.3.3/build/csync/src/std -I/tmp/B.LDs7so/BUILD/owncloudclient-2.3.3/csync/src/std -I/tmp/B.LDs7so/BUILD/owncloudclient-2.3.3/build -I/tmp/B.LDs7so/BUILD/owncloudclient-2.3.3/build/csync -std=gnu99 -pedantic -pedantic-errors -Wall -Wextra -Wshadow -Wmissing-prototypes -Wunused -Wfloat-equal -Wpointer-arith -Wwrite-strings -Wformat-security -Wmissing-format-attribute -Wmissing-format-attribute -D_GNU_SOURCE -D__STDC_FORMAT_MACROS=1 -fPIC -fstack-protector -D_LARGEFILE64_SOURCE -O2 -fwrapv -pipe -Wformat -Werror=format-security -gdwarf-4 -fno-debug-types-section -fvar-tracking-assignments -g2 -Wp,-D_FORTIFY_SOURCE=2 -fstack-protector-strong --param=ssp-buffer-size=4 -fPIC -march=x86-64 -gdwarf-4 -fno-debug-types-section -fvar-tracking-assignments -g2 -DNDEBUG -DQT_NO_DEBUG -fPIC -o CMakeFiles/cstdlib.dir/c_alloc.c.o -c /tmp/B.LDs7so/BUILD/owncloudclient-2.3.3/csync/src/std/c_alloc.c make[2]: Leaving directory '/tmp/B.LDs7so/BUILD/owncloudclient-2.3.3/build' make[2]: Entering directory '/tmp/B.LDs7so/BUILD/owncloudclient-2.3.3/build' [ 1%] Automatic MOC for target owncloudcmd cd /tmp/B.LDs7so/BUILD/owncloudclient-2.3.3/build/src/cmd && /usr/bin/cmake -E cmake_autogen /tmp/B.LDs7so/BUILD/owncloudclient-2.3.3/build/src/cmd/CMakeFiles/owncloudcmd_autogen.dir/ PLD Generating MOC source owncloudcmd_autogen/EWIEGA46WW/moc_cmd.cpp Generating MOC compilation owncloudcmd_autogen/moc_compilation.cpp make[2]: Leaving directory '/tmp/B.LDs7so/BUILD/owncloudclient-2.3.3/build' make[1]: Entering directory '/tmp/B.LDs7so/BUILD/owncloudclient-2.3.3/build' [ 3%] Built target owncloudcmd_autogen make[1]: Leaving directory '/tmp/B.LDs7so/BUILD/owncloudclient-2.3.3/build' make[2]: Entering directory '/tmp/B.LDs7so/BUILD/owncloudclient-2.3.3/build' [ 2%] Automatic MOC for target updater cd /tmp/B.LDs7so/BUILD/owncloudclient-2.3.3/build/src/gui && /usr/bin/cmake -E cmake_autogen /tmp/B.LDs7so/BUILD/owncloudclient-2.3.3/build/src/gui/CMakeFiles/updater_autogen.dir/ PLD Generating MOC source updater_autogen/KVXHJ3PMW4/moc_ocupdater.cpp Generating MOC source updater_autogen/KVXHJ3PMW4/moc_updater.cpp Generating MOC compilation updater_autogen/moc_compilation.cpp make[2]: Leaving directory '/tmp/B.LDs7so/BUILD/owncloudclient-2.3.3/build' make[1]: Entering directory '/tmp/B.LDs7so/BUILD/owncloudclient-2.3.3/build' [ 4%] Built target updater_autogen make[1]: Leaving directory '/tmp/B.LDs7so/BUILD/owncloudclient-2.3.3/build' make[2]: Entering directory '/tmp/B.LDs7so/BUILD/owncloudclient-2.3.3/build' [ 3%] Building C object csync/src/std/CMakeFiles/cstdlib.dir/c_path.c.o cd /tmp/B.LDs7so/BUILD/owncloudclient-2.3.3/build/csync/src/std && /usr/bin/x86_64-pld-linux-gcc -DUNICODE -DUSE_FDO_NOTIFICATIONS -D_GNU_SOURCE -D_UNICODE -I/tmp/B.LDs7so/BUILD/owncloudclient-2.3.3/build/csync/src/std -I/tmp/B.LDs7so/BUILD/owncloudclient-2.3.3/csync/src/std -I/tmp/B.LDs7so/BUILD/owncloudclient-2.3.3/build -I/tmp/B.LDs7so/BUILD/owncloudclient-2.3.3/build/csync -std=gnu99 -pedantic -pedantic-errors -Wall -Wextra -Wshadow -Wmissing-prototypes -Wunused -Wfloat-equal -Wpointer-arith -Wwrite-strings -Wformat-security -Wmissing-format-attribute -Wmissing-format-attribute -D_GNU_SOURCE -D__STDC_FORMAT_MACROS=1 -fPIC -fstack-protector -D_LARGEFILE64_SOURCE -O2 -fwrapv -pipe -Wformat -Werror=format-security -gdwarf-4 -fno-debug-types-section -fvar-tracking-assignments -g2 -Wp,-D_FORTIFY_SOURCE=2 -fstack-protector-strong --param=ssp-buffer-size=4 -fPIC -march=x86-64 -gdwarf-4 -fno-debug-types-section -fvar-tracking-assignments -g2 -DNDEBUG -DQT_NO_DEBUG -fPIC -o CMakeFiles/cstdlib.dir/c_path.c.o -c /tmp/B.LDs7so/BUILD/owncloudclient-2.3.3/csync/src/std/c_path.c make[2]: Leaving directory '/tmp/B.LDs7so/BUILD/owncloudclient-2.3.3/build' make[2]: Entering directory '/tmp/B.LDs7so/BUILD/owncloudclient-2.3.3/build' [ 4%] Building C object csync/src/std/CMakeFiles/cstdlib.dir/c_rbtree.c.o cd /tmp/B.LDs7so/BUILD/owncloudclient-2.3.3/build/csync/src/std && /usr/bin/x86_64-pld-linux-gcc -DUNICODE -DUSE_FDO_NOTIFICATIONS -D_GNU_SOURCE -D_UNICODE -I/tmp/B.LDs7so/BUILD/owncloudclient-2.3.3/build/csync/src/std -I/tmp/B.LDs7so/BUILD/owncloudclient-2.3.3/csync/src/std -I/tmp/B.LDs7so/BUILD/owncloudclient-2.3.3/build -I/tmp/B.LDs7so/BUILD/owncloudclient-2.3.3/build/csync -std=gnu99 -pedantic -pedantic-errors -Wall -Wextra -Wshadow -Wmissing-prototypes -Wunused -Wfloat-equal -Wpointer-arith -Wwrite-strings -Wformat-security -Wmissing-format-attribute -Wmissing-format-attribute -D_GNU_SOURCE -D__STDC_FORMAT_MACROS=1 -fPIC -fstack-protector -D_LARGEFILE64_SOURCE -O2 -fwrapv -pipe -Wformat -Werror=format-security -gdwarf-4 -fno-debug-types-section -fvar-tracking-assignments -g2 -Wp,-D_FORTIFY_SOURCE=2 -fstack-protector-strong --param=ssp-buffer-size=4 -fPIC -march=x86-64 -gdwarf-4 -fno-debug-types-section -fvar-tracking-assignments -g2 -DNDEBUG -DQT_NO_DEBUG -fPIC -o CMakeFiles/cstdlib.dir/c_rbtree.c.o -c /tmp/B.LDs7so/BUILD/owncloudclient-2.3.3/csync/src/std/c_rbtree.c make[2]: Leaving directory '/tmp/B.LDs7so/BUILD/owncloudclient-2.3.3/build' make[2]: Entering directory '/tmp/B.LDs7so/BUILD/owncloudclient-2.3.3/build' [ 5%] Building C object csync/src/std/CMakeFiles/cstdlib.dir/c_time.c.o cd /tmp/B.LDs7so/BUILD/owncloudclient-2.3.3/build/csync/src/std && /usr/bin/x86_64-pld-linux-gcc -DUNICODE -DUSE_FDO_NOTIFICATIONS -D_GNU_SOURCE -D_UNICODE -I/tmp/B.LDs7so/BUILD/owncloudclient-2.3.3/build/csync/src/std -I/tmp/B.LDs7so/BUILD/owncloudclient-2.3.3/csync/src/std -I/tmp/B.LDs7so/BUILD/owncloudclient-2.3.3/build -I/tmp/B.LDs7so/BUILD/owncloudclient-2.3.3/build/csync -std=gnu99 -pedantic -pedantic-errors -Wall -Wextra -Wshadow -Wmissing-prototypes -Wunused -Wfloat-equal -Wpointer-arith -Wwrite-strings -Wformat-security -Wmissing-format-attribute -Wmissing-format-attribute -D_GNU_SOURCE -D__STDC_FORMAT_MACROS=1 -fPIC -fstack-protector -D_LARGEFILE64_SOURCE -O2 -fwrapv -pipe -Wformat -Werror=format-security -gdwarf-4 -fno-debug-types-section -fvar-tracking-assignments -g2 -Wp,-D_FORTIFY_SOURCE=2 -fstack-protector-strong --param=ssp-buffer-size=4 -fPIC -march=x86-64 -gdwarf-4 -fno-debug-types-section -fvar-tracking-assignments -g2 -DNDEBUG -DQT_NO_DEBUG -fPIC -o CMakeFiles/cstdlib.dir/c_time.c.o -c /tmp/B.LDs7so/BUILD/owncloudclient-2.3.3/csync/src/std/c_time.c make[2]: Leaving directory '/tmp/B.LDs7so/BUILD/owncloudclient-2.3.3/build' make[2]: Entering directory '/tmp/B.LDs7so/BUILD/owncloudclient-2.3.3/build' [ 4%] Building C object csync/src/std/CMakeFiles/cstdlib.dir/c_string.c.o cd /tmp/B.LDs7so/BUILD/owncloudclient-2.3.3/build/csync/src/std && /usr/bin/x86_64-pld-linux-gcc -DUNICODE -DUSE_FDO_NOTIFICATIONS -D_GNU_SOURCE -D_UNICODE -I/tmp/B.LDs7so/BUILD/owncloudclient-2.3.3/build/csync/src/std -I/tmp/B.LDs7so/BUILD/owncloudclient-2.3.3/csync/src/std -I/tmp/B.LDs7so/BUILD/owncloudclient-2.3.3/build -I/tmp/B.LDs7so/BUILD/owncloudclient-2.3.3/build/csync -std=gnu99 -pedantic -pedantic-errors -Wall -Wextra -Wshadow -Wmissing-prototypes -Wunused -Wfloat-equal -Wpointer-arith -Wwrite-strings -Wformat-security -Wmissing-format-attribute -Wmissing-format-attribute -D_GNU_SOURCE -D__STDC_FORMAT_MACROS=1 -fPIC -fstack-protector -D_LARGEFILE64_SOURCE -O2 -fwrapv -pipe -Wformat -Werror=format-security -gdwarf-4 -fno-debug-types-section -fvar-tracking-assignments -g2 -Wp,-D_FORTIFY_SOURCE=2 -fstack-protector-strong --param=ssp-buffer-size=4 -fPIC -march=x86-64 -gdwarf-4 -fno-debug-types-section -fvar-tracking-assignments -g2 -DNDEBUG -DQT_NO_DEBUG -fPIC -o CMakeFiles/cstdlib.dir/c_string.c.o -c /tmp/B.LDs7so/BUILD/owncloudclient-2.3.3/csync/src/std/c_string.c make[2]: Leaving directory '/tmp/B.LDs7so/BUILD/owncloudclient-2.3.3/build' make[2]: Entering directory '/tmp/B.LDs7so/BUILD/owncloudclient-2.3.3/build' [ 5%] Linking C static library libcstdlib.a cd /tmp/B.LDs7so/BUILD/owncloudclient-2.3.3/build/csync/src/std && /usr/bin/cmake -P CMakeFiles/cstdlib.dir/cmake_clean_target.cmake cd /tmp/B.LDs7so/BUILD/owncloudclient-2.3.3/build/csync/src/std && /usr/bin/cmake -E cmake_link_script CMakeFiles/cstdlib.dir/link.txt --verbose=1 /usr/bin/ar qc libcstdlib.a CMakeFiles/cstdlib.dir/c_alloc.c.o CMakeFiles/cstdlib.dir/c_path.c.o CMakeFiles/cstdlib.dir/c_rbtree.c.o CMakeFiles/cstdlib.dir/c_string.c.o CMakeFiles/cstdlib.dir/c_time.c.o /usr/bin/ranlib libcstdlib.a make[2]: Leaving directory '/tmp/B.LDs7so/BUILD/owncloudclient-2.3.3/build' make[1]: Entering directory '/tmp/B.LDs7so/BUILD/owncloudclient-2.3.3/build' [ 5%] Built target cstdlib make[1]: Leaving directory '/tmp/B.LDs7so/BUILD/owncloudclient-2.3.3/build' /usr/bin/make -f csync/src/CMakeFiles/ocsync.dir/build.make csync/src/CMakeFiles/ocsync.dir/depend make[2]: Entering directory '/tmp/B.LDs7so/BUILD/owncloudclient-2.3.3/build' cd /tmp/B.LDs7so/BUILD/owncloudclient-2.3.3/build && /usr/bin/cmake -E cmake_depends "Unix Makefiles" /tmp/B.LDs7so/BUILD/owncloudclient-2.3.3 /tmp/B.LDs7so/BUILD/owncloudclient-2.3.3/csync/src /tmp/B.LDs7so/BUILD/owncloudclient-2.3.3/build /tmp/B.LDs7so/BUILD/owncloudclient-2.3.3/build/csync/src /tmp/B.LDs7so/BUILD/owncloudclient-2.3.3/build/csync/src/CMakeFiles/ocsync.dir/DependInfo.cmake --color= Scanning dependencies of target ocsync make[2]: Leaving directory '/tmp/B.LDs7so/BUILD/owncloudclient-2.3.3/build' /usr/bin/make -f csync/src/CMakeFiles/ocsync.dir/build.make csync/src/CMakeFiles/ocsync.dir/build make[2]: Entering directory '/tmp/B.LDs7so/BUILD/owncloudclient-2.3.3/build' [ 7%] Building C object csync/src/CMakeFiles/ocsync.dir/csync_log.c.o cd /tmp/B.LDs7so/BUILD/owncloudclient-2.3.3/build/csync/src && /usr/bin/x86_64-pld-linux-gcc -DUNICODE -DUSE_FDO_NOTIFICATIONS -D_GNU_SOURCE -D_UNICODE -Docsync_EXPORTS -I/tmp/B.LDs7so/BUILD/owncloudclient-2.3.3/build/csync/src -I/tmp/B.LDs7so/BUILD/owncloudclient-2.3.3/csync/src -I/tmp/B.LDs7so/BUILD/owncloudclient-2.3.3/build -I/tmp/B.LDs7so/BUILD/owncloudclient-2.3.3/build/csync -I/tmp/B.LDs7so/BUILD/owncloudclient-2.3.3 -I/tmp/B.LDs7so/BUILD/owncloudclient-2.3.3/csync/src/std -std=gnu99 -pedantic -pedantic-errors -Wall -Wextra -Wshadow -Wmissing-prototypes -Wunused -Wfloat-equal -Wpointer-arith -Wwrite-strings -Wformat-security -Wmissing-format-attribute -Wmissing-format-attribute -D_GNU_SOURCE -D__STDC_FORMAT_MACROS=1 -fPIC -fstack-protector -D_LARGEFILE64_SOURCE -O2 -fwrapv -pipe -Wformat -Werror=format-security -gdwarf-4 -fno-debug-types-section -fvar-tracking-assignments -g2 -Wp,-D_FORTIFY_SOURCE=2 -fstack-protector-strong --param=ssp-buffer-size=4 -fPIC -march=x86-64 -gdwarf-4 -fno-debug-types-section -fvar-tracking-assignments -g2 -DNDEBUG -DQT_NO_DEBUG -fPIC -o CMakeFiles/ocsync.dir/csync_log.c.o -c /tmp/B.LDs7so/BUILD/owncloudclient-2.3.3/csync/src/csync_log.c make[2]: Leaving directory '/tmp/B.LDs7so/BUILD/owncloudclient-2.3.3/build' make[2]: Entering directory '/tmp/B.LDs7so/BUILD/owncloudclient-2.3.3/build' [ 6%] Building C object csync/src/CMakeFiles/ocsync.dir/csync_exclude.c.o cd /tmp/B.LDs7so/BUILD/owncloudclient-2.3.3/build/csync/src && /usr/bin/x86_64-pld-linux-gcc -DUNICODE -DUSE_FDO_NOTIFICATIONS -D_GNU_SOURCE -D_UNICODE -Docsync_EXPORTS -I/tmp/B.LDs7so/BUILD/owncloudclient-2.3.3/build/csync/src -I/tmp/B.LDs7so/BUILD/owncloudclient-2.3.3/csync/src -I/tmp/B.LDs7so/BUILD/owncloudclient-2.3.3/build -I/tmp/B.LDs7so/BUILD/owncloudclient-2.3.3/build/csync -I/tmp/B.LDs7so/BUILD/owncloudclient-2.3.3 -I/tmp/B.LDs7so/BUILD/owncloudclient-2.3.3/csync/src/std -std=gnu99 -pedantic -pedantic-errors -Wall -Wextra -Wshadow -Wmissing-prototypes -Wunused -Wfloat-equal -Wpointer-arith -Wwrite-strings -Wformat-security -Wmissing-format-attribute -Wmissing-format-attribute -D_GNU_SOURCE -D__STDC_FORMAT_MACROS=1 -fPIC -fstack-protector -D_LARGEFILE64_SOURCE -O2 -fwrapv -pipe -Wformat -Werror=format-security -gdwarf-4 -fno-debug-types-section -fvar-tracking-assignments -g2 -Wp,-D_FORTIFY_SOURCE=2 -fstack-protector-strong --param=ssp-buffer-size=4 -fPIC -march=x86-64 -gdwarf-4 -fno-debug-types-section -fvar-tracking-assignments -g2 -DNDEBUG -DQT_NO_DEBUG -fPIC -o CMakeFiles/ocsync.dir/csync_exclude.c.o -c /tmp/B.LDs7so/BUILD/owncloudclient-2.3.3/csync/src/csync_exclude.c make[2]: Leaving directory '/tmp/B.LDs7so/BUILD/owncloudclient-2.3.3/build' make[2]: Entering directory '/tmp/B.LDs7so/BUILD/owncloudclient-2.3.3/build' [ 6%] Building C object csync/src/CMakeFiles/ocsync.dir/csync.c.o cd /tmp/B.LDs7so/BUILD/owncloudclient-2.3.3/build/csync/src && /usr/bin/x86_64-pld-linux-gcc -DUNICODE -DUSE_FDO_NOTIFICATIONS -D_GNU_SOURCE -D_UNICODE -Docsync_EXPORTS -I/tmp/B.LDs7so/BUILD/owncloudclient-2.3.3/build/csync/src -I/tmp/B.LDs7so/BUILD/owncloudclient-2.3.3/csync/src -I/tmp/B.LDs7so/BUILD/owncloudclient-2.3.3/build -I/tmp/B.LDs7so/BUILD/owncloudclient-2.3.3/build/csync -I/tmp/B.LDs7so/BUILD/owncloudclient-2.3.3 -I/tmp/B.LDs7so/BUILD/owncloudclient-2.3.3/csync/src/std -std=gnu99 -pedantic -pedantic-errors -Wall -Wextra -Wshadow -Wmissing-prototypes -Wunused -Wfloat-equal -Wpointer-arith -Wwrite-strings -Wformat-security -Wmissing-format-attribute -Wmissing-format-attribute -D_GNU_SOURCE -D__STDC_FORMAT_MACROS=1 -fPIC -fstack-protector -D_LARGEFILE64_SOURCE -O2 -fwrapv -pipe -Wformat -Werror=format-security -gdwarf-4 -fno-debug-types-section -fvar-tracking-assignments -g2 -Wp,-D_FORTIFY_SOURCE=2 -fstack-protector-strong --param=ssp-buffer-size=4 -fPIC -march=x86-64 -gdwarf-4 -fno-debug-types-section -fvar-tracking-assignments -g2 -DNDEBUG -DQT_NO_DEBUG -fPIC -o CMakeFiles/ocsync.dir/csync.c.o -c /tmp/B.LDs7so/BUILD/owncloudclient-2.3.3/csync/src/csync.c In file included from /tmp/B.LDs7so/BUILD/owncloudclient-2.3.3/csync/src/csync.c:59:0: /tmp/B.LDs7so/BUILD/owncloudclient-2.3.3/csync/src/std/c_jhash.h: In function 'c_jhash64': /tmp/B.LDs7so/BUILD/owncloudclient-2.3.3/csync/src/std/c_jhash.h:210:15: warning: this statement may fall through [-Wimplicit-fallthrough=] case 23: c+=((uint64_t)k[22]<<56); ~^~~~~~~~~~~~~~~~~~~~~~~ /tmp/B.LDs7so/BUILD/owncloudclient-2.3.3/csync/src/std/c_jhash.h:211:5: note: here case 22: c+=((uint64_t)k[21]<<48); ^~~~ /tmp/B.LDs7so/BUILD/owncloudclient-2.3.3/csync/src/std/c_jhash.h:211:15: warning: this statement may fall through [-Wimplicit-fallthrough=] case 22: c+=((uint64_t)k[21]<<48); ~^~~~~~~~~~~~~~~~~~~~~~~ /tmp/B.LDs7so/BUILD/owncloudclient-2.3.3/csync/src/std/c_jhash.h:212:5: note: here case 21: c+=((uint64_t)k[20]<<40); ^~~~ /tmp/B.LDs7so/BUILD/owncloudclient-2.3.3/csync/src/std/c_jhash.h:212:15: warning: this statement may fall through [-Wimplicit-fallthrough=] case 21: c+=((uint64_t)k[20]<<40); ~^~~~~~~~~~~~~~~~~~~~~~~ /tmp/B.LDs7so/BUILD/owncloudclient-2.3.3/csync/src/std/c_jhash.h:213:5: note: here case 20: c+=((uint64_t)k[19]<<32); ^~~~ /tmp/B.LDs7so/BUILD/owncloudclient-2.3.3/csync/src/std/c_jhash.h:213:15: warning: this statement may fall through [-Wimplicit-fallthrough=] case 20: c+=((uint64_t)k[19]<<32); ~^~~~~~~~~~~~~~~~~~~~~~~ /tmp/B.LDs7so/BUILD/owncloudclient-2.3.3/csync/src/std/c_jhash.h:214:5: note: here case 19: c+=((uint64_t)k[18]<<24); ^~~~ /tmp/B.LDs7so/BUILD/owncloudclient-2.3.3/csync/src/std/c_jhash.h:214:15: warning: this statement may fall through [-Wimplicit-fallthrough=] case 19: c+=((uint64_t)k[18]<<24); ~^~~~~~~~~~~~~~~~~~~~~~~ /tmp/B.LDs7so/BUILD/owncloudclient-2.3.3/csync/src/std/c_jhash.h:215:5: note: here case 18: c+=((uint64_t)k[17]<<16); ^~~~ /tmp/B.LDs7so/BUILD/owncloudclient-2.3.3/csync/src/std/c_jhash.h:215:15: warning: this statement may fall through [-Wimplicit-fallthrough=] case 18: c+=((uint64_t)k[17]<<16); ~^~~~~~~~~~~~~~~~~~~~~~~ /tmp/B.LDs7so/BUILD/owncloudclient-2.3.3/csync/src/std/c_jhash.h:216:5: note: here case 17: c+=((uint64_t)k[16]<<8); ^~~~ /tmp/B.LDs7so/BUILD/owncloudclient-2.3.3/csync/src/std/c_jhash.h:216:15: warning: this statement may fall through [-Wimplicit-fallthrough=] case 17: c+=((uint64_t)k[16]<<8); ~^~~~~~~~~~~~~~~~~~~~~~ /tmp/B.LDs7so/BUILD/owncloudclient-2.3.3/csync/src/std/c_jhash.h:218:5: note: here case 16: b+=((uint64_t)k[15]<<56); ^~~~ /tmp/B.LDs7so/BUILD/owncloudclient-2.3.3/csync/src/std/c_jhash.h:218:15: warning: this statement may fall through [-Wimplicit-fallthrough=] case 16: b+=((uint64_t)k[15]<<56); ~^~~~~~~~~~~~~~~~~~~~~~~ /tmp/B.LDs7so/BUILD/owncloudclient-2.3.3/csync/src/std/c_jhash.h:219:5: note: here case 15: b+=((uint64_t)k[14]<<48); ^~~~ /tmp/B.LDs7so/BUILD/owncloudclient-2.3.3/csync/src/std/c_jhash.h:219:15: warning: this statement may fall through [-Wimplicit-fallthrough=] case 15: b+=((uint64_t)k[14]<<48); ~^~~~~~~~~~~~~~~~~~~~~~~ /tmp/B.LDs7so/BUILD/owncloudclient-2.3.3/csync/src/std/c_jhash.h:220:5: note: here case 14: b+=((uint64_t)k[13]<<40); ^~~~ /tmp/B.LDs7so/BUILD/owncloudclient-2.3.3/csync/src/std/c_jhash.h:220:15: warning: this statement may fall through [-Wimplicit-fallthrough=] case 14: b+=((uint64_t)k[13]<<40); ~^~~~~~~~~~~~~~~~~~~~~~~ /tmp/B.LDs7so/BUILD/owncloudclient-2.3.3/csync/src/std/c_jhash.h:221:5: note: here case 13: b+=((uint64_t)k[12]<<32); ^~~~ /tmp/B.LDs7so/BUILD/owncloudclient-2.3.3/csync/src/std/c_jhash.h:221:15: warning: this statement may fall through [-Wimplicit-fallthrough=] case 13: b+=((uint64_t)k[12]<<32); ~^~~~~~~~~~~~~~~~~~~~~~~ /tmp/B.LDs7so/BUILD/owncloudclient-2.3.3/csync/src/std/c_jhash.h:222:5: note: here case 12: b+=((uint64_t)k[11]<<24); ^~~~ /tmp/B.LDs7so/BUILD/owncloudclient-2.3.3/csync/src/std/c_jhash.h:222:15: warning: this statement may fall through [-Wimplicit-fallthrough=] case 12: b+=((uint64_t)k[11]<<24); ~^~~~~~~~~~~~~~~~~~~~~~~ /tmp/B.LDs7so/BUILD/owncloudclient-2.3.3/csync/src/std/c_jhash.h:223:5: note: here case 11: b+=((uint64_t)k[10]<<16); ^~~~ /tmp/B.LDs7so/BUILD/owncloudclient-2.3.3/csync/src/std/c_jhash.h:223:15: warning: this statement may fall through [-Wimplicit-fallthrough=] case 11: b+=((uint64_t)k[10]<<16); ~^~~~~~~~~~~~~~~~~~~~~~~ /tmp/B.LDs7so/BUILD/owncloudclient-2.3.3/csync/src/std/c_jhash.h:224:5: note: here case 10: b+=((uint64_t)k[ 9]<<8); ^~~~ /tmp/B.LDs7so/BUILD/owncloudclient-2.3.3/csync/src/std/c_jhash.h:224:15: warning: this statement may fall through [-Wimplicit-fallthrough=] case 10: b+=((uint64_t)k[ 9]<<8); ~^~~~~~~~~~~~~~~~~~~~~~ /tmp/B.LDs7so/BUILD/owncloudclient-2.3.3/csync/src/std/c_jhash.h:225:5: note: here case 9: b+=((uint64_t)k[ 8]); ^~~~ /tmp/B.LDs7so/BUILD/owncloudclient-2.3.3/csync/src/std/c_jhash.h:225:15: warning: this statement may fall through [-Wimplicit-fallthrough=] case 9: b+=((uint64_t)k[ 8]); ~^~~~~~~~~~~~~~~~~~~ /tmp/B.LDs7so/BUILD/owncloudclient-2.3.3/csync/src/std/c_jhash.h:226:5: note: here case 8: a+=((uint64_t)k[ 7]<<56); ^~~~ /tmp/B.LDs7so/BUILD/owncloudclient-2.3.3/csync/src/std/c_jhash.h:226:15: warning: this statement may fall through [-Wimplicit-fallthrough=] case 8: a+=((uint64_t)k[ 7]<<56); ~^~~~~~~~~~~~~~~~~~~~~~~ /tmp/B.LDs7so/BUILD/owncloudclient-2.3.3/csync/src/std/c_jhash.h:227:5: note: here case 7: a+=((uint64_t)k[ 6]<<48); ^~~~ /tmp/B.LDs7so/BUILD/owncloudclient-2.3.3/csync/src/std/c_jhash.h:227:15: warning: this statement may fall through [-Wimplicit-fallthrough=] case 7: a+=((uint64_t)k[ 6]<<48); ~^~~~~~~~~~~~~~~~~~~~~~~ /tmp/B.LDs7so/BUILD/owncloudclient-2.3.3/csync/src/std/c_jhash.h:228:5: note: here case 6: a+=((uint64_t)k[ 5]<<40); ^~~~ /tmp/B.LDs7so/BUILD/owncloudclient-2.3.3/csync/src/std/c_jhash.h:228:15: warning: this statement may fall through [-Wimplicit-fallthrough=] case 6: a+=((uint64_t)k[ 5]<<40); ~^~~~~~~~~~~~~~~~~~~~~~~ /tmp/B.LDs7so/BUILD/owncloudclient-2.3.3/csync/src/std/c_jhash.h:229:5: note: here case 5: a+=((uint64_t)k[ 4]<<32); ^~~~ /tmp/B.LDs7so/BUILD/owncloudclient-2.3.3/csync/src/std/c_jhash.h:229:15: warning: this statement may fall through [-Wimplicit-fallthrough=] case 5: a+=((uint64_t)k[ 4]<<32); ~^~~~~~~~~~~~~~~~~~~~~~~ /tmp/B.LDs7so/BUILD/owncloudclient-2.3.3/csync/src/std/c_jhash.h:230:5: note: here case 4: a+=((uint64_t)k[ 3]<<24); ^~~~ /tmp/B.LDs7so/BUILD/owncloudclient-2.3.3/csync/src/std/c_jhash.h:230:15: warning: this statement may fall through [-Wimplicit-fallthrough=] case 4: a+=((uint64_t)k[ 3]<<24); ~^~~~~~~~~~~~~~~~~~~~~~~ /tmp/B.LDs7so/BUILD/owncloudclient-2.3.3/csync/src/std/c_jhash.h:231:5: note: here case 3: a+=((uint64_t)k[ 2]<<16); ^~~~ /tmp/B.LDs7so/BUILD/owncloudclient-2.3.3/csync/src/std/c_jhash.h:231:15: warning: this statement may fall through [-Wimplicit-fallthrough=] case 3: a+=((uint64_t)k[ 2]<<16); ~^~~~~~~~~~~~~~~~~~~~~~~ /tmp/B.LDs7so/BUILD/owncloudclient-2.3.3/csync/src/std/c_jhash.h:232:5: note: here case 2: a+=((uint64_t)k[ 1]<<8); ^~~~ /tmp/B.LDs7so/BUILD/owncloudclient-2.3.3/csync/src/std/c_jhash.h:232:15: warning: this statement may fall through [-Wimplicit-fallthrough=] case 2: a+=((uint64_t)k[ 1]<<8); ~^~~~~~~~~~~~~~~~~~~~~~ /tmp/B.LDs7so/BUILD/owncloudclient-2.3.3/csync/src/std/c_jhash.h:233:5: note: here case 1: a+=((uint64_t)k[ 0]); ^~~~ make[2]: Leaving directory '/tmp/B.LDs7so/BUILD/owncloudclient-2.3.3/build' make[2]: Entering directory '/tmp/B.LDs7so/BUILD/owncloudclient-2.3.3/build' [ 8%] Building C object csync/src/CMakeFiles/ocsync.dir/csync_time.c.o cd /tmp/B.LDs7so/BUILD/owncloudclient-2.3.3/build/csync/src && /usr/bin/x86_64-pld-linux-gcc -DUNICODE -DUSE_FDO_NOTIFICATIONS -D_GNU_SOURCE -D_UNICODE -Docsync_EXPORTS -I/tmp/B.LDs7so/BUILD/owncloudclient-2.3.3/build/csync/src -I/tmp/B.LDs7so/BUILD/owncloudclient-2.3.3/csync/src -I/tmp/B.LDs7so/BUILD/owncloudclient-2.3.3/build -I/tmp/B.LDs7so/BUILD/owncloudclient-2.3.3/build/csync -I/tmp/B.LDs7so/BUILD/owncloudclient-2.3.3 -I/tmp/B.LDs7so/BUILD/owncloudclient-2.3.3/csync/src/std -std=gnu99 -pedantic -pedantic-errors -Wall -Wextra -Wshadow -Wmissing-prototypes -Wunused -Wfloat-equal -Wpointer-arith -Wwrite-strings -Wformat-security -Wmissing-format-attribute -Wmissing-format-attribute -D_GNU_SOURCE -D__STDC_FORMAT_MACROS=1 -fPIC -fstack-protector -D_LARGEFILE64_SOURCE -O2 -fwrapv -pipe -Wformat -Werror=format-security -gdwarf-4 -fno-debug-types-section -fvar-tracking-assignments -g2 -Wp,-D_FORTIFY_SOURCE=2 -fstack-protector-strong --param=ssp-buffer-size=4 -fPIC -march=x86-64 -gdwarf-4 -fno-debug-types-section -fvar-tracking-assignments -g2 -DNDEBUG -DQT_NO_DEBUG -fPIC -o CMakeFiles/ocsync.dir/csync_time.c.o -c /tmp/B.LDs7so/BUILD/owncloudclient-2.3.3/csync/src/csync_time.c make[2]: Leaving directory '/tmp/B.LDs7so/BUILD/owncloudclient-2.3.3/build' make[2]: Entering directory '/tmp/B.LDs7so/BUILD/owncloudclient-2.3.3/build' [ 7%] Building C object csync/src/CMakeFiles/ocsync.dir/csync_statedb.c.o cd /tmp/B.LDs7so/BUILD/owncloudclient-2.3.3/build/csync/src && /usr/bin/x86_64-pld-linux-gcc -DUNICODE -DUSE_FDO_NOTIFICATIONS -D_GNU_SOURCE -D_UNICODE -Docsync_EXPORTS -I/tmp/B.LDs7so/BUILD/owncloudclient-2.3.3/build/csync/src -I/tmp/B.LDs7so/BUILD/owncloudclient-2.3.3/csync/src -I/tmp/B.LDs7so/BUILD/owncloudclient-2.3.3/build -I/tmp/B.LDs7so/BUILD/owncloudclient-2.3.3/build/csync -I/tmp/B.LDs7so/BUILD/owncloudclient-2.3.3 -I/tmp/B.LDs7so/BUILD/owncloudclient-2.3.3/csync/src/std -std=gnu99 -pedantic -pedantic-errors -Wall -Wextra -Wshadow -Wmissing-prototypes -Wunused -Wfloat-equal -Wpointer-arith -Wwrite-strings -Wformat-security -Wmissing-format-attribute -Wmissing-format-attribute -D_GNU_SOURCE -D__STDC_FORMAT_MACROS=1 -fPIC -fstack-protector -D_LARGEFILE64_SOURCE -O2 -fwrapv -pipe -Wformat -Werror=format-security -gdwarf-4 -fno-debug-types-section -fvar-tracking-assignments -g2 -Wp,-D_FORTIFY_SOURCE=2 -fstack-protector-strong --param=ssp-buffer-size=4 -fPIC -march=x86-64 -gdwarf-4 -fno-debug-types-section -fvar-tracking-assignments -g2 -DNDEBUG -DQT_NO_DEBUG -fPIC -o CMakeFiles/ocsync.dir/csync_statedb.c.o -c /tmp/B.LDs7so/BUILD/owncloudclient-2.3.3/csync/src/csync_statedb.c make[2]: Leaving directory '/tmp/B.LDs7so/BUILD/owncloudclient-2.3.3/build' make[2]: Entering directory '/tmp/B.LDs7so/BUILD/owncloudclient-2.3.3/build' [ 8%] Building C object csync/src/CMakeFiles/ocsync.dir/csync_util.c.o cd /tmp/B.LDs7so/BUILD/owncloudclient-2.3.3/build/csync/src && /usr/bin/x86_64-pld-linux-gcc -DUNICODE -DUSE_FDO_NOTIFICATIONS -D_GNU_SOURCE -D_UNICODE -Docsync_EXPORTS -I/tmp/B.LDs7so/BUILD/owncloudclient-2.3.3/build/csync/src -I/tmp/B.LDs7so/BUILD/owncloudclient-2.3.3/csync/src -I/tmp/B.LDs7so/BUILD/owncloudclient-2.3.3/build -I/tmp/B.LDs7so/BUILD/owncloudclient-2.3.3/build/csync -I/tmp/B.LDs7so/BUILD/owncloudclient-2.3.3 -I/tmp/B.LDs7so/BUILD/owncloudclient-2.3.3/csync/src/std -std=gnu99 -pedantic -pedantic-errors -Wall -Wextra -Wshadow -Wmissing-prototypes -Wunused -Wfloat-equal -Wpointer-arith -Wwrite-strings -Wformat-security -Wmissing-format-attribute -Wmissing-format-attribute -D_GNU_SOURCE -D__STDC_FORMAT_MACROS=1 -fPIC -fstack-protector -D_LARGEFILE64_SOURCE -O2 -fwrapv -pipe -Wformat -Werror=format-security -gdwarf-4 -fno-debug-types-section -fvar-tracking-assignments -g2 -Wp,-D_FORTIFY_SOURCE=2 -fstack-protector-strong --param=ssp-buffer-size=4 -fPIC -march=x86-64 -gdwarf-4 -fno-debug-types-section -fvar-tracking-assignments -g2 -DNDEBUG -DQT_NO_DEBUG -fPIC -o CMakeFiles/ocsync.dir/csync_util.c.o -c /tmp/B.LDs7so/BUILD/owncloudclient-2.3.3/csync/src/csync_util.c make[2]: Leaving directory '/tmp/B.LDs7so/BUILD/owncloudclient-2.3.3/build' make[2]: Entering directory '/tmp/B.LDs7so/BUILD/owncloudclient-2.3.3/build' [ 9%] Building C object csync/src/CMakeFiles/ocsync.dir/csync_misc.c.o cd /tmp/B.LDs7so/BUILD/owncloudclient-2.3.3/build/csync/src && /usr/bin/x86_64-pld-linux-gcc -DUNICODE -DUSE_FDO_NOTIFICATIONS -D_GNU_SOURCE -D_UNICODE -Docsync_EXPORTS -I/tmp/B.LDs7so/BUILD/owncloudclient-2.3.3/build/csync/src -I/tmp/B.LDs7so/BUILD/owncloudclient-2.3.3/csync/src -I/tmp/B.LDs7so/BUILD/owncloudclient-2.3.3/build -I/tmp/B.LDs7so/BUILD/owncloudclient-2.3.3/build/csync -I/tmp/B.LDs7so/BUILD/owncloudclient-2.3.3 -I/tmp/B.LDs7so/BUILD/owncloudclient-2.3.3/csync/src/std -std=gnu99 -pedantic -pedantic-errors -Wall -Wextra -Wshadow -Wmissing-prototypes -Wunused -Wfloat-equal -Wpointer-arith -Wwrite-strings -Wformat-security -Wmissing-format-attribute -Wmissing-format-attribute -D_GNU_SOURCE -D__STDC_FORMAT_MACROS=1 -fPIC -fstack-protector -D_LARGEFILE64_SOURCE -O2 -fwrapv -pipe -Wformat -Werror=format-security -gdwarf-4 -fno-debug-types-section -fvar-tracking-assignments -g2 -Wp,-D_FORTIFY_SOURCE=2 -fstack-protector-strong --param=ssp-buffer-size=4 -fPIC -march=x86-64 -gdwarf-4 -fno-debug-types-section -fvar-tracking-assignments -g2 -DNDEBUG -DQT_NO_DEBUG -fPIC -o CMakeFiles/ocsync.dir/csync_misc.c.o -c /tmp/B.LDs7so/BUILD/owncloudclient-2.3.3/csync/src/csync_misc.c make[2]: Leaving directory '/tmp/B.LDs7so/BUILD/owncloudclient-2.3.3/build' make[2]: Entering directory '/tmp/B.LDs7so/BUILD/owncloudclient-2.3.3/build' [ 10%] Building C object csync/src/CMakeFiles/ocsync.dir/csync_reconcile.c.o cd /tmp/B.LDs7so/BUILD/owncloudclient-2.3.3/build/csync/src && /usr/bin/x86_64-pld-linux-gcc -DUNICODE -DUSE_FDO_NOTIFICATIONS -D_GNU_SOURCE -D_UNICODE -Docsync_EXPORTS -I/tmp/B.LDs7so/BUILD/owncloudclient-2.3.3/build/csync/src -I/tmp/B.LDs7so/BUILD/owncloudclient-2.3.3/csync/src -I/tmp/B.LDs7so/BUILD/owncloudclient-2.3.3/build -I/tmp/B.LDs7so/BUILD/owncloudclient-2.3.3/build/csync -I/tmp/B.LDs7so/BUILD/owncloudclient-2.3.3 -I/tmp/B.LDs7so/BUILD/owncloudclient-2.3.3/csync/src/std -std=gnu99 -pedantic -pedantic-errors -Wall -Wextra -Wshadow -Wmissing-prototypes -Wunused -Wfloat-equal -Wpointer-arith -Wwrite-strings -Wformat-security -Wmissing-format-attribute -Wmissing-format-attribute -D_GNU_SOURCE -D__STDC_FORMAT_MACROS=1 -fPIC -fstack-protector -D_LARGEFILE64_SOURCE -O2 -fwrapv -pipe -Wformat -Werror=format-security -gdwarf-4 -fno-debug-types-section -fvar-tracking-assignments -g2 -Wp,-D_FORTIFY_SOURCE=2 -fstack-protector-strong --param=ssp-buffer-size=4 -fPIC -march=x86-64 -gdwarf-4 -fno-debug-types-section -fvar-tracking-assignments -g2 -DNDEBUG -DQT_NO_DEBUG -fPIC -o CMakeFiles/ocsync.dir/csync_reconcile.c.o -c /tmp/B.LDs7so/BUILD/owncloudclient-2.3.3/csync/src/csync_reconcile.c /tmp/B.LDs7so/BUILD/owncloudclient-2.3.3/csync/src/csync_reconcile.c: In function '_csync_merge_algorithm_visitor': /tmp/B.LDs7so/BUILD/owncloudclient-2.3.3/csync/src/csync_reconcile.c:251:30: warning: this statement may fall through [-Wimplicit-fallthrough=] cur->instruction = CSYNC_INSTRUCTION_NEW; ~~~~~~~~~~~~~~~~~^~~~~~~~~~~~~~~~~~~~~~~ /tmp/B.LDs7so/BUILD/owncloudclient-2.3.3/csync/src/csync_reconcile.c:254:9: note: here case CSYNC_INSTRUCTION_EVAL: ^~~~ In file included from /tmp/B.LDs7so/BUILD/owncloudclient-2.3.3/csync/src/csync_reconcile.c:29:0: /tmp/B.LDs7so/BUILD/owncloudclient-2.3.3/csync/src/std/c_jhash.h: In function 'c_jhash64': /tmp/B.LDs7so/BUILD/owncloudclient-2.3.3/csync/src/std/c_jhash.h:210:15: warning: this statement may fall through [-Wimplicit-fallthrough=] case 23: c+=((uint64_t)k[22]<<56); ~^~~~~~~~~~~~~~~~~~~~~~~ /tmp/B.LDs7so/BUILD/owncloudclient-2.3.3/csync/src/std/c_jhash.h:211:5: note: here case 22: c+=((uint64_t)k[21]<<48); ^~~~ /tmp/B.LDs7so/BUILD/owncloudclient-2.3.3/csync/src/std/c_jhash.h:211:15: warning: this statement may fall through [-Wimplicit-fallthrough=] case 22: c+=((uint64_t)k[21]<<48); ~^~~~~~~~~~~~~~~~~~~~~~~ /tmp/B.LDs7so/BUILD/owncloudclient-2.3.3/csync/src/std/c_jhash.h:212:5: note: here case 21: c+=((uint64_t)k[20]<<40); ^~~~ /tmp/B.LDs7so/BUILD/owncloudclient-2.3.3/csync/src/std/c_jhash.h:212:15: warning: this statement may fall through [-Wimplicit-fallthrough=] case 21: c+=((uint64_t)k[20]<<40); ~^~~~~~~~~~~~~~~~~~~~~~~ /tmp/B.LDs7so/BUILD/owncloudclient-2.3.3/csync/src/std/c_jhash.h:213:5: note: here case 20: c+=((uint64_t)k[19]<<32); ^~~~ /tmp/B.LDs7so/BUILD/owncloudclient-2.3.3/csync/src/std/c_jhash.h:213:15: warning: this statement may fall through [-Wimplicit-fallthrough=] case 20: c+=((uint64_t)k[19]<<32); ~^~~~~~~~~~~~~~~~~~~~~~~ /tmp/B.LDs7so/BUILD/owncloudclient-2.3.3/csync/src/std/c_jhash.h:214:5: note: here case 19: c+=((uint64_t)k[18]<<24); ^~~~ /tmp/B.LDs7so/BUILD/owncloudclient-2.3.3/csync/src/std/c_jhash.h:214:15: warning: this statement may fall through [-Wimplicit-fallthrough=] case 19: c+=((uint64_t)k[18]<<24); ~^~~~~~~~~~~~~~~~~~~~~~~ /tmp/B.LDs7so/BUILD/owncloudclient-2.3.3/csync/src/std/c_jhash.h:215:5: note: here case 18: c+=((uint64_t)k[17]<<16); ^~~~ /tmp/B.LDs7so/BUILD/owncloudclient-2.3.3/csync/src/std/c_jhash.h:215:15: warning: this statement may fall through [-Wimplicit-fallthrough=] case 18: c+=((uint64_t)k[17]<<16); ~^~~~~~~~~~~~~~~~~~~~~~~ /tmp/B.LDs7so/BUILD/owncloudclient-2.3.3/csync/src/std/c_jhash.h:216:5: note: here case 17: c+=((uint64_t)k[16]<<8); ^~~~ /tmp/B.LDs7so/BUILD/owncloudclient-2.3.3/csync/src/std/c_jhash.h:216:15: warning: this statement may fall through [-Wimplicit-fallthrough=] case 17: c+=((uint64_t)k[16]<<8); ~^~~~~~~~~~~~~~~~~~~~~~ /tmp/B.LDs7so/BUILD/owncloudclient-2.3.3/csync/src/std/c_jhash.h:218:5: note: here case 16: b+=((uint64_t)k[15]<<56); ^~~~ /tmp/B.LDs7so/BUILD/owncloudclient-2.3.3/csync/src/std/c_jhash.h:218:15: warning: this statement may fall through [-Wimplicit-fallthrough=] case 16: b+=((uint64_t)k[15]<<56); ~^~~~~~~~~~~~~~~~~~~~~~~ /tmp/B.LDs7so/BUILD/owncloudclient-2.3.3/csync/src/std/c_jhash.h:219:5: note: here case 15: b+=((uint64_t)k[14]<<48); ^~~~ /tmp/B.LDs7so/BUILD/owncloudclient-2.3.3/csync/src/std/c_jhash.h:219:15: warning: this statement may fall through [-Wimplicit-fallthrough=] case 15: b+=((uint64_t)k[14]<<48); ~^~~~~~~~~~~~~~~~~~~~~~~ /tmp/B.LDs7so/BUILD/owncloudclient-2.3.3/csync/src/std/c_jhash.h:220:5: note: here case 14: b+=((uint64_t)k[13]<<40); ^~~~ /tmp/B.LDs7so/BUILD/owncloudclient-2.3.3/csync/src/std/c_jhash.h:220:15: warning: this statement may fall through [-Wimplicit-fallthrough=] case 14: b+=((uint64_t)k[13]<<40); ~^~~~~~~~~~~~~~~~~~~~~~~ /tmp/B.LDs7so/BUILD/owncloudclient-2.3.3/csync/src/std/c_jhash.h:221:5: note: here case 13: b+=((uint64_t)k[12]<<32); ^~~~ /tmp/B.LDs7so/BUILD/owncloudclient-2.3.3/csync/src/std/c_jhash.h:221:15: warning: this statement may fall through [-Wimplicit-fallthrough=] case 13: b+=((uint64_t)k[12]<<32); ~^~~~~~~~~~~~~~~~~~~~~~~ /tmp/B.LDs7so/BUILD/owncloudclient-2.3.3/csync/src/std/c_jhash.h:222:5: note: here case 12: b+=((uint64_t)k[11]<<24); ^~~~ /tmp/B.LDs7so/BUILD/owncloudclient-2.3.3/csync/src/std/c_jhash.h:222:15: warning: this statement may fall through [-Wimplicit-fallthrough=] case 12: b+=((uint64_t)k[11]<<24); ~^~~~~~~~~~~~~~~~~~~~~~~ /tmp/B.LDs7so/BUILD/owncloudclient-2.3.3/csync/src/std/c_jhash.h:223:5: note: here case 11: b+=((uint64_t)k[10]<<16); ^~~~ /tmp/B.LDs7so/BUILD/owncloudclient-2.3.3/csync/src/std/c_jhash.h:223:15: warning: this statement may fall through [-Wimplicit-fallthrough=] case 11: b+=((uint64_t)k[10]<<16); ~^~~~~~~~~~~~~~~~~~~~~~~ /tmp/B.LDs7so/BUILD/owncloudclient-2.3.3/csync/src/std/c_jhash.h:224:5: note: here case 10: b+=((uint64_t)k[ 9]<<8); ^~~~ /tmp/B.LDs7so/BUILD/owncloudclient-2.3.3/csync/src/std/c_jhash.h:224:15: warning: this statement may fall through [-Wimplicit-fallthrough=] case 10: b+=((uint64_t)k[ 9]<<8); ~^~~~~~~~~~~~~~~~~~~~~~ /tmp/B.LDs7so/BUILD/owncloudclient-2.3.3/csync/src/std/c_jhash.h:225:5: note: here case 9: b+=((uint64_t)k[ 8]); ^~~~ /tmp/B.LDs7so/BUILD/owncloudclient-2.3.3/csync/src/std/c_jhash.h:225:15: warning: this statement may fall through [-Wimplicit-fallthrough=] case 9: b+=((uint64_t)k[ 8]); ~^~~~~~~~~~~~~~~~~~~ /tmp/B.LDs7so/BUILD/owncloudclient-2.3.3/csync/src/std/c_jhash.h:226:5: note: here case 8: a+=((uint64_t)k[ 7]<<56); ^~~~ /tmp/B.LDs7so/BUILD/owncloudclient-2.3.3/csync/src/std/c_jhash.h:226:15: warning: this statement may fall through [-Wimplicit-fallthrough=] case 8: a+=((uint64_t)k[ 7]<<56); ~^~~~~~~~~~~~~~~~~~~~~~~ /tmp/B.LDs7so/BUILD/owncloudclient-2.3.3/csync/src/std/c_jhash.h:227:5: note: here case 7: a+=((uint64_t)k[ 6]<<48); ^~~~ /tmp/B.LDs7so/BUILD/owncloudclient-2.3.3/csync/src/std/c_jhash.h:227:15: warning: this statement may fall through [-Wimplicit-fallthrough=] case 7: a+=((uint64_t)k[ 6]<<48); ~^~~~~~~~~~~~~~~~~~~~~~~ /tmp/B.LDs7so/BUILD/owncloudclient-2.3.3/csync/src/std/c_jhash.h:228:5: note: here case 6: a+=((uint64_t)k[ 5]<<40); ^~~~ /tmp/B.LDs7so/BUILD/owncloudclient-2.3.3/csync/src/std/c_jhash.h:228:15: warning: this statement may fall through [-Wimplicit-fallthrough=] case 6: a+=((uint64_t)k[ 5]<<40); ~^~~~~~~~~~~~~~~~~~~~~~~ /tmp/B.LDs7so/BUILD/owncloudclient-2.3.3/csync/src/std/c_jhash.h:229:5: note: here case 5: a+=((uint64_t)k[ 4]<<32); ^~~~ /tmp/B.LDs7so/BUILD/owncloudclient-2.3.3/csync/src/std/c_jhash.h:229:15: warning: this statement may fall through [-Wimplicit-fallthrough=] case 5: a+=((uint64_t)k[ 4]<<32); ~^~~~~~~~~~~~~~~~~~~~~~~ /tmp/B.LDs7so/BUILD/owncloudclient-2.3.3/csync/src/std/c_jhash.h:230:5: note: here case 4: a+=((uint64_t)k[ 3]<<24); ^~~~ /tmp/B.LDs7so/BUILD/owncloudclient-2.3.3/csync/src/std/c_jhash.h:230:15: warning: this statement may fall through [-Wimplicit-fallthrough=] case 4: a+=((uint64_t)k[ 3]<<24); ~^~~~~~~~~~~~~~~~~~~~~~~ /tmp/B.LDs7so/BUILD/owncloudclient-2.3.3/csync/src/std/c_jhash.h:231:5: note: here case 3: a+=((uint64_t)k[ 2]<<16); ^~~~ /tmp/B.LDs7so/BUILD/owncloudclient-2.3.3/csync/src/std/c_jhash.h:231:15: warning: this statement may fall through [-Wimplicit-fallthrough=] case 3: a+=((uint64_t)k[ 2]<<16); ~^~~~~~~~~~~~~~~~~~~~~~~ /tmp/B.LDs7so/BUILD/owncloudclient-2.3.3/csync/src/std/c_jhash.h:232:5: note: here case 2: a+=((uint64_t)k[ 1]<<8); ^~~~ /tmp/B.LDs7so/BUILD/owncloudclient-2.3.3/csync/src/std/c_jhash.h:232:15: warning: this statement may fall through [-Wimplicit-fallthrough=] case 2: a+=((uint64_t)k[ 1]<<8); ~^~~~~~~~~~~~~~~~~~~~~~ /tmp/B.LDs7so/BUILD/owncloudclient-2.3.3/csync/src/std/c_jhash.h:233:5: note: here case 1: a+=((uint64_t)k[ 0]); ^~~~ make[2]: Leaving directory '/tmp/B.LDs7so/BUILD/owncloudclient-2.3.3/build' make[2]: Entering directory '/tmp/B.LDs7so/BUILD/owncloudclient-2.3.3/build' [ 9%] Building C object csync/src/CMakeFiles/ocsync.dir/csync_update.c.o cd /tmp/B.LDs7so/BUILD/owncloudclient-2.3.3/build/csync/src && /usr/bin/x86_64-pld-linux-gcc -DUNICODE -DUSE_FDO_NOTIFICATIONS -D_GNU_SOURCE -D_UNICODE -Docsync_EXPORTS -I/tmp/B.LDs7so/BUILD/owncloudclient-2.3.3/build/csync/src -I/tmp/B.LDs7so/BUILD/owncloudclient-2.3.3/csync/src -I/tmp/B.LDs7so/BUILD/owncloudclient-2.3.3/build -I/tmp/B.LDs7so/BUILD/owncloudclient-2.3.3/build/csync -I/tmp/B.LDs7so/BUILD/owncloudclient-2.3.3 -I/tmp/B.LDs7so/BUILD/owncloudclient-2.3.3/csync/src/std -std=gnu99 -pedantic -pedantic-errors -Wall -Wextra -Wshadow -Wmissing-prototypes -Wunused -Wfloat-equal -Wpointer-arith -Wwrite-strings -Wformat-security -Wmissing-format-attribute -Wmissing-format-attribute -D_GNU_SOURCE -D__STDC_FORMAT_MACROS=1 -fPIC -fstack-protector -D_LARGEFILE64_SOURCE -O2 -fwrapv -pipe -Wformat -Werror=format-security -gdwarf-4 -fno-debug-types-section -fvar-tracking-assignments -g2 -Wp,-D_FORTIFY_SOURCE=2 -fstack-protector-strong --param=ssp-buffer-size=4 -fPIC -march=x86-64 -gdwarf-4 -fno-debug-types-section -fvar-tracking-assignments -g2 -DNDEBUG -DQT_NO_DEBUG -fPIC -o CMakeFiles/ocsync.dir/csync_update.c.o -c /tmp/B.LDs7so/BUILD/owncloudclient-2.3.3/csync/src/csync_update.c In file included from /tmp/B.LDs7so/BUILD/owncloudclient-2.3.3/csync/src/csync_update.c:36:0: /tmp/B.LDs7so/BUILD/owncloudclient-2.3.3/csync/src/std/c_jhash.h: In function 'c_jhash64': /tmp/B.LDs7so/BUILD/owncloudclient-2.3.3/csync/src/std/c_jhash.h:210:15: warning: this statement may fall through [-Wimplicit-fallthrough=] case 23: c+=((uint64_t)k[22]<<56); ~^~~~~~~~~~~~~~~~~~~~~~~ /tmp/B.LDs7so/BUILD/owncloudclient-2.3.3/csync/src/std/c_jhash.h:211:5: note: here case 22: c+=((uint64_t)k[21]<<48); ^~~~ /tmp/B.LDs7so/BUILD/owncloudclient-2.3.3/csync/src/std/c_jhash.h:211:15: warning: this statement may fall through [-Wimplicit-fallthrough=] case 22: c+=((uint64_t)k[21]<<48); ~^~~~~~~~~~~~~~~~~~~~~~~ /tmp/B.LDs7so/BUILD/owncloudclient-2.3.3/csync/src/std/c_jhash.h:212:5: note: here case 21: c+=((uint64_t)k[20]<<40); ^~~~ /tmp/B.LDs7so/BUILD/owncloudclient-2.3.3/csync/src/std/c_jhash.h:212:15: warning: this statement may fall through [-Wimplicit-fallthrough=] case 21: c+=((uint64_t)k[20]<<40); ~^~~~~~~~~~~~~~~~~~~~~~~ /tmp/B.LDs7so/BUILD/owncloudclient-2.3.3/csync/src/std/c_jhash.h:213:5: note: here case 20: c+=((uint64_t)k[19]<<32); ^~~~ /tmp/B.LDs7so/BUILD/owncloudclient-2.3.3/csync/src/std/c_jhash.h:213:15: warning: this statement may fall through [-Wimplicit-fallthrough=] case 20: c+=((uint64_t)k[19]<<32); ~^~~~~~~~~~~~~~~~~~~~~~~ /tmp/B.LDs7so/BUILD/owncloudclient-2.3.3/csync/src/std/c_jhash.h:214:5: note: here case 19: c+=((uint64_t)k[18]<<24); ^~~~ /tmp/B.LDs7so/BUILD/owncloudclient-2.3.3/csync/src/std/c_jhash.h:214:15: warning: this statement may fall through [-Wimplicit-fallthrough=] case 19: c+=((uint64_t)k[18]<<24); ~^~~~~~~~~~~~~~~~~~~~~~~ /tmp/B.LDs7so/BUILD/owncloudclient-2.3.3/csync/src/std/c_jhash.h:215:5: note: here case 18: c+=((uint64_t)k[17]<<16); ^~~~ /tmp/B.LDs7so/BUILD/owncloudclient-2.3.3/csync/src/std/c_jhash.h:215:15: warning: this statement may fall through [-Wimplicit-fallthrough=] case 18: c+=((uint64_t)k[17]<<16); ~^~~~~~~~~~~~~~~~~~~~~~~ /tmp/B.LDs7so/BUILD/owncloudclient-2.3.3/csync/src/std/c_jhash.h:216:5: note: here case 17: c+=((uint64_t)k[16]<<8); ^~~~ /tmp/B.LDs7so/BUILD/owncloudclient-2.3.3/csync/src/std/c_jhash.h:216:15: warning: this statement may fall through [-Wimplicit-fallthrough=] case 17: c+=((uint64_t)k[16]<<8); ~^~~~~~~~~~~~~~~~~~~~~~ /tmp/B.LDs7so/BUILD/owncloudclient-2.3.3/csync/src/std/c_jhash.h:218:5: note: here case 16: b+=((uint64_t)k[15]<<56); ^~~~ /tmp/B.LDs7so/BUILD/owncloudclient-2.3.3/csync/src/std/c_jhash.h:218:15: warning: this statement may fall through [-Wimplicit-fallthrough=] case 16: b+=((uint64_t)k[15]<<56); ~^~~~~~~~~~~~~~~~~~~~~~~ /tmp/B.LDs7so/BUILD/owncloudclient-2.3.3/csync/src/std/c_jhash.h:219:5: note: here case 15: b+=((uint64_t)k[14]<<48); ^~~~ /tmp/B.LDs7so/BUILD/owncloudclient-2.3.3/csync/src/std/c_jhash.h:219:15: warning: this statement may fall through [-Wimplicit-fallthrough=] case 15: b+=((uint64_t)k[14]<<48); ~^~~~~~~~~~~~~~~~~~~~~~~ /tmp/B.LDs7so/BUILD/owncloudclient-2.3.3/csync/src/std/c_jhash.h:220:5: note: here case 14: b+=((uint64_t)k[13]<<40); ^~~~ /tmp/B.LDs7so/BUILD/owncloudclient-2.3.3/csync/src/std/c_jhash.h:220:15: warning: this statement may fall through [-Wimplicit-fallthrough=] case 14: b+=((uint64_t)k[13]<<40); ~^~~~~~~~~~~~~~~~~~~~~~~ /tmp/B.LDs7so/BUILD/owncloudclient-2.3.3/csync/src/std/c_jhash.h:221:5: note: here case 13: b+=((uint64_t)k[12]<<32); ^~~~ /tmp/B.LDs7so/BUILD/owncloudclient-2.3.3/csync/src/std/c_jhash.h:221:15: warning: this statement may fall through [-Wimplicit-fallthrough=] case 13: b+=((uint64_t)k[12]<<32); ~^~~~~~~~~~~~~~~~~~~~~~~ /tmp/B.LDs7so/BUILD/owncloudclient-2.3.3/csync/src/std/c_jhash.h:222:5: note: here case 12: b+=((uint64_t)k[11]<<24); ^~~~ /tmp/B.LDs7so/BUILD/owncloudclient-2.3.3/csync/src/std/c_jhash.h:222:15: warning: this statement may fall through [-Wimplicit-fallthrough=] case 12: b+=((uint64_t)k[11]<<24); ~^~~~~~~~~~~~~~~~~~~~~~~ /tmp/B.LDs7so/BUILD/owncloudclient-2.3.3/csync/src/std/c_jhash.h:223:5: note: here case 11: b+=((uint64_t)k[10]<<16); ^~~~ /tmp/B.LDs7so/BUILD/owncloudclient-2.3.3/csync/src/std/c_jhash.h:223:15: warning: this statement may fall through [-Wimplicit-fallthrough=] case 11: b+=((uint64_t)k[10]<<16); ~^~~~~~~~~~~~~~~~~~~~~~~ /tmp/B.LDs7so/BUILD/owncloudclient-2.3.3/csync/src/std/c_jhash.h:224:5: note: here case 10: b+=((uint64_t)k[ 9]<<8); ^~~~ /tmp/B.LDs7so/BUILD/owncloudclient-2.3.3/csync/src/std/c_jhash.h:224:15: warning: this statement may fall through [-Wimplicit-fallthrough=] case 10: b+=((uint64_t)k[ 9]<<8); ~^~~~~~~~~~~~~~~~~~~~~~ /tmp/B.LDs7so/BUILD/owncloudclient-2.3.3/csync/src/std/c_jhash.h:225:5: note: here case 9: b+=((uint64_t)k[ 8]); ^~~~ /tmp/B.LDs7so/BUILD/owncloudclient-2.3.3/csync/src/std/c_jhash.h:225:15: warning: this statement may fall through [-Wimplicit-fallthrough=] case 9: b+=((uint64_t)k[ 8]); ~^~~~~~~~~~~~~~~~~~~ /tmp/B.LDs7so/BUILD/owncloudclient-2.3.3/csync/src/std/c_jhash.h:226:5: note: here case 8: a+=((uint64_t)k[ 7]<<56); ^~~~ /tmp/B.LDs7so/BUILD/owncloudclient-2.3.3/csync/src/std/c_jhash.h:226:15: warning: this statement may fall through [-Wimplicit-fallthrough=] case 8: a+=((uint64_t)k[ 7]<<56); ~^~~~~~~~~~~~~~~~~~~~~~~ /tmp/B.LDs7so/BUILD/owncloudclient-2.3.3/csync/src/std/c_jhash.h:227:5: note: here case 7: a+=((uint64_t)k[ 6]<<48); ^~~~ /tmp/B.LDs7so/BUILD/owncloudclient-2.3.3/csync/src/std/c_jhash.h:227:15: warning: this statement may fall through [-Wimplicit-fallthrough=] case 7: a+=((uint64_t)k[ 6]<<48); ~^~~~~~~~~~~~~~~~~~~~~~~ /tmp/B.LDs7so/BUILD/owncloudclient-2.3.3/csync/src/std/c_jhash.h:228:5: note: here case 6: a+=((uint64_t)k[ 5]<<40); ^~~~ /tmp/B.LDs7so/BUILD/owncloudclient-2.3.3/csync/src/std/c_jhash.h:228:15: warning: this statement may fall through [-Wimplicit-fallthrough=] case 6: a+=((uint64_t)k[ 5]<<40); ~^~~~~~~~~~~~~~~~~~~~~~~ /tmp/B.LDs7so/BUILD/owncloudclient-2.3.3/csync/src/std/c_jhash.h:229:5: note: here case 5: a+=((uint64_t)k[ 4]<<32); ^~~~ /tmp/B.LDs7so/BUILD/owncloudclient-2.3.3/csync/src/std/c_jhash.h:229:15: warning: this statement may fall through [-Wimplicit-fallthrough=] case 5: a+=((uint64_t)k[ 4]<<32); ~^~~~~~~~~~~~~~~~~~~~~~~ /tmp/B.LDs7so/BUILD/owncloudclient-2.3.3/csync/src/std/c_jhash.h:230:5: note: here case 4: a+=((uint64_t)k[ 3]<<24); ^~~~ /tmp/B.LDs7so/BUILD/owncloudclient-2.3.3/csync/src/std/c_jhash.h:230:15: warning: this statement may fall through [-Wimplicit-fallthrough=] case 4: a+=((uint64_t)k[ 3]<<24); ~^~~~~~~~~~~~~~~~~~~~~~~ /tmp/B.LDs7so/BUILD/owncloudclient-2.3.3/csync/src/std/c_jhash.h:231:5: note: here case 3: a+=((uint64_t)k[ 2]<<16); ^~~~ /tmp/B.LDs7so/BUILD/owncloudclient-2.3.3/csync/src/std/c_jhash.h:231:15: warning: this statement may fall through [-Wimplicit-fallthrough=] case 3: a+=((uint64_t)k[ 2]<<16); ~^~~~~~~~~~~~~~~~~~~~~~~ /tmp/B.LDs7so/BUILD/owncloudclient-2.3.3/csync/src/std/c_jhash.h:232:5: note: here case 2: a+=((uint64_t)k[ 1]<<8); ^~~~ /tmp/B.LDs7so/BUILD/owncloudclient-2.3.3/csync/src/std/c_jhash.h:232:15: warning: this statement may fall through [-Wimplicit-fallthrough=] case 2: a+=((uint64_t)k[ 1]<<8); ~^~~~~~~~~~~~~~~~~~~~~~ /tmp/B.LDs7so/BUILD/owncloudclient-2.3.3/csync/src/std/c_jhash.h:233:5: note: here case 1: a+=((uint64_t)k[ 0]); ^~~~ make[2]: Leaving directory '/tmp/B.LDs7so/BUILD/owncloudclient-2.3.3/build' make[2]: Entering directory '/tmp/B.LDs7so/BUILD/owncloudclient-2.3.3/build' [ 11%] Building C object csync/src/CMakeFiles/ocsync.dir/vio/csync_vio_file_stat.c.o cd /tmp/B.LDs7so/BUILD/owncloudclient-2.3.3/build/csync/src && /usr/bin/x86_64-pld-linux-gcc -DUNICODE -DUSE_FDO_NOTIFICATIONS -D_GNU_SOURCE -D_UNICODE -Docsync_EXPORTS -I/tmp/B.LDs7so/BUILD/owncloudclient-2.3.3/build/csync/src -I/tmp/B.LDs7so/BUILD/owncloudclient-2.3.3/csync/src -I/tmp/B.LDs7so/BUILD/owncloudclient-2.3.3/build -I/tmp/B.LDs7so/BUILD/owncloudclient-2.3.3/build/csync -I/tmp/B.LDs7so/BUILD/owncloudclient-2.3.3 -I/tmp/B.LDs7so/BUILD/owncloudclient-2.3.3/csync/src/std -std=gnu99 -pedantic -pedantic-errors -Wall -Wextra -Wshadow -Wmissing-prototypes -Wunused -Wfloat-equal -Wpointer-arith -Wwrite-strings -Wformat-security -Wmissing-format-attribute -Wmissing-format-attribute -D_GNU_SOURCE -D__STDC_FORMAT_MACROS=1 -fPIC -fstack-protector -D_LARGEFILE64_SOURCE -O2 -fwrapv -pipe -Wformat -Werror=format-security -gdwarf-4 -fno-debug-types-section -fvar-tracking-assignments -g2 -Wp,-D_FORTIFY_SOURCE=2 -fstack-protector-strong --param=ssp-buffer-size=4 -fPIC -march=x86-64 -gdwarf-4 -fno-debug-types-section -fvar-tracking-assignments -g2 -DNDEBUG -DQT_NO_DEBUG -fPIC -o CMakeFiles/ocsync.dir/vio/csync_vio_file_stat.c.o -c /tmp/B.LDs7so/BUILD/owncloudclient-2.3.3/csync/src/vio/csync_vio_file_stat.c make[2]: Leaving directory '/tmp/B.LDs7so/BUILD/owncloudclient-2.3.3/build' make[2]: Entering directory '/tmp/B.LDs7so/BUILD/owncloudclient-2.3.3/build' [ 11%] Building C object csync/src/CMakeFiles/ocsync.dir/vio/csync_vio.c.o cd /tmp/B.LDs7so/BUILD/owncloudclient-2.3.3/build/csync/src && /usr/bin/x86_64-pld-linux-gcc -DUNICODE -DUSE_FDO_NOTIFICATIONS -D_GNU_SOURCE -D_UNICODE -Docsync_EXPORTS -I/tmp/B.LDs7so/BUILD/owncloudclient-2.3.3/build/csync/src -I/tmp/B.LDs7so/BUILD/owncloudclient-2.3.3/csync/src -I/tmp/B.LDs7so/BUILD/owncloudclient-2.3.3/build -I/tmp/B.LDs7so/BUILD/owncloudclient-2.3.3/build/csync -I/tmp/B.LDs7so/BUILD/owncloudclient-2.3.3 -I/tmp/B.LDs7so/BUILD/owncloudclient-2.3.3/csync/src/std -std=gnu99 -pedantic -pedantic-errors -Wall -Wextra -Wshadow -Wmissing-prototypes -Wunused -Wfloat-equal -Wpointer-arith -Wwrite-strings -Wformat-security -Wmissing-format-attribute -Wmissing-format-attribute -D_GNU_SOURCE -D__STDC_FORMAT_MACROS=1 -fPIC -fstack-protector -D_LARGEFILE64_SOURCE -O2 -fwrapv -pipe -Wformat -Werror=format-security -gdwarf-4 -fno-debug-types-section -fvar-tracking-assignments -g2 -Wp,-D_FORTIFY_SOURCE=2 -fstack-protector-strong --param=ssp-buffer-size=4 -fPIC -march=x86-64 -gdwarf-4 -fno-debug-types-section -fvar-tracking-assignments -g2 -DNDEBUG -DQT_NO_DEBUG -fPIC -o CMakeFiles/ocsync.dir/vio/csync_vio.c.o -c /tmp/B.LDs7so/BUILD/owncloudclient-2.3.3/csync/src/vio/csync_vio.c make[2]: Leaving directory '/tmp/B.LDs7so/BUILD/owncloudclient-2.3.3/build' make[2]: Entering directory '/tmp/B.LDs7so/BUILD/owncloudclient-2.3.3/build' [ 12%] Building C object csync/src/CMakeFiles/ocsync.dir/vio/csync_vio_local_unix.c.o cd /tmp/B.LDs7so/BUILD/owncloudclient-2.3.3/build/csync/src && /usr/bin/x86_64-pld-linux-gcc -DUNICODE -DUSE_FDO_NOTIFICATIONS -D_GNU_SOURCE -D_UNICODE -Docsync_EXPORTS -I/tmp/B.LDs7so/BUILD/owncloudclient-2.3.3/build/csync/src -I/tmp/B.LDs7so/BUILD/owncloudclient-2.3.3/csync/src -I/tmp/B.LDs7so/BUILD/owncloudclient-2.3.3/build -I/tmp/B.LDs7so/BUILD/owncloudclient-2.3.3/build/csync -I/tmp/B.LDs7so/BUILD/owncloudclient-2.3.3 -I/tmp/B.LDs7so/BUILD/owncloudclient-2.3.3/csync/src/std -std=gnu99 -pedantic -pedantic-errors -Wall -Wextra -Wshadow -Wmissing-prototypes -Wunused -Wfloat-equal -Wpointer-arith -Wwrite-strings -Wformat-security -Wmissing-format-attribute -Wmissing-format-attribute -D_GNU_SOURCE -D__STDC_FORMAT_MACROS=1 -fPIC -fstack-protector -D_LARGEFILE64_SOURCE -O2 -fwrapv -pipe -Wformat -Werror=format-security -gdwarf-4 -fno-debug-types-section -fvar-tracking-assignments -g2 -Wp,-D_FORTIFY_SOURCE=2 -fstack-protector-strong --param=ssp-buffer-size=4 -fPIC -march=x86-64 -gdwarf-4 -fno-debug-types-section -fvar-tracking-assignments -g2 -DNDEBUG -DQT_NO_DEBUG -fPIC -o CMakeFiles/ocsync.dir/vio/csync_vio_local_unix.c.o -c /tmp/B.LDs7so/BUILD/owncloudclient-2.3.3/csync/src/vio/csync_vio_local_unix.c make[2]: Leaving directory '/tmp/B.LDs7so/BUILD/owncloudclient-2.3.3/build' make[2]: Entering directory '/tmp/B.LDs7so/BUILD/owncloudclient-2.3.3/build' [ 10%] Building CXX object csync/src/CMakeFiles/ocsync.dir/csync_rename.cc.o cd /tmp/B.LDs7so/BUILD/owncloudclient-2.3.3/build/csync/src && /usr/bin/x86_64-pld-linux-g++ -DUNICODE -DUSE_FDO_NOTIFICATIONS -D_GNU_SOURCE -D_UNICODE -Docsync_EXPORTS -I/tmp/B.LDs7so/BUILD/owncloudclient-2.3.3/build/csync/src -I/tmp/B.LDs7so/BUILD/owncloudclient-2.3.3/csync/src -I/tmp/B.LDs7so/BUILD/owncloudclient-2.3.3/build -I/tmp/B.LDs7so/BUILD/owncloudclient-2.3.3/build/csync -I/tmp/B.LDs7so/BUILD/owncloudclient-2.3.3 -I/tmp/B.LDs7so/BUILD/owncloudclient-2.3.3/csync/src/std -Wall -Wextra -pedantic -Wno-long-long -std=c++0x -Wpedantic -O2 -fwrapv -pipe -Wformat -Werror=format-security -gdwarf-4 -fno-debug-types-section -fvar-tracking-assignments -g2 -Wp,-D_FORTIFY_SOURCE=2 -fstack-protector-strong --param=ssp-buffer-size=4 -fPIC -march=x86-64 -gdwarf-4 -fno-debug-types-section -fvar-tracking-assignments -g2 -DNDEBUG -DQT_NO_DEBUG -fPIC -o CMakeFiles/ocsync.dir/csync_rename.cc.o -c /tmp/B.LDs7so/BUILD/owncloudclient-2.3.3/csync/src/csync_rename.cc make[2]: Leaving directory '/tmp/B.LDs7so/BUILD/owncloudclient-2.3.3/build' make[2]: Entering directory '/tmp/B.LDs7so/BUILD/owncloudclient-2.3.3/build' [ 12%] Linking CXX shared library libocsync.so cd /tmp/B.LDs7so/BUILD/owncloudclient-2.3.3/build/csync/src && /usr/bin/cmake -E cmake_link_script CMakeFiles/ocsync.dir/link.txt --verbose=1 /usr/bin/x86_64-pld-linux-g++ -fPIC -Wall -Wextra -pedantic -Wno-long-long -std=c++0x -Wpedantic -O2 -fwrapv -pipe -Wformat -Werror=format-security -gdwarf-4 -fno-debug-types-section -fvar-tracking-assignments -g2 -Wp,-D_FORTIFY_SOURCE=2 -fstack-protector-strong --param=ssp-buffer-size=4 -fPIC -march=x86-64 -gdwarf-4 -fno-debug-types-section -fvar-tracking-assignments -g2 -DNDEBUG -DQT_NO_DEBUG -Wl,--as-needed -Wl,--no-copy-dt-needed-entries -Wl,-z,relro -Wl,-z,combreloc -shared -Wl,-soname,libocsync.so.0 -o libocsync.so.2.3.3 CMakeFiles/ocsync.dir/csync.c.o CMakeFiles/ocsync.dir/csync_exclude.c.o CMakeFiles/ocsync.dir/csync_log.c.o CMakeFiles/ocsync.dir/csync_statedb.c.o CMakeFiles/ocsync.dir/csync_time.c.o CMakeFiles/ocsync.dir/csync_util.c.o CMakeFiles/ocsync.dir/csync_misc.c.o CMakeFiles/ocsync.dir/csync_update.c.o CMakeFiles/ocsync.dir/csync_reconcile.c.o CMakeFiles/ocsync.dir/csync_rename.cc.o CMakeFiles/ocsync.dir/vio/csync_vio.c.o CMakeFiles/ocsync.dir/vio/csync_vio_file_stat.c.o CMakeFiles/ocsync.dir/vio/csync_vio_local_unix.c.o std/libcstdlib.a -lrt -ldl -lsqlite3 -lsqlite3 cd /tmp/B.LDs7so/BUILD/owncloudclient-2.3.3/build/csync/src && /usr/bin/cmake -E cmake_symlink_library libocsync.so.2.3.3 libocsync.so.0 libocsync.so make[2]: Leaving directory '/tmp/B.LDs7so/BUILD/owncloudclient-2.3.3/build' make[1]: Entering directory '/tmp/B.LDs7so/BUILD/owncloudclient-2.3.3/build' [ 12%] Built target ocsync make[1]: Leaving directory '/tmp/B.LDs7so/BUILD/owncloudclient-2.3.3/build' make[2]: Entering directory '/tmp/B.LDs7so/BUILD/owncloudclient-2.3.3/build' [ 3%] Automatic MOC for target owncloudsync cd /tmp/B.LDs7so/BUILD/owncloudclient-2.3.3/build/src/libsync && /usr/bin/cmake -E cmake_autogen /tmp/B.LDs7so/BUILD/owncloudclient-2.3.3/build/src/libsync/CMakeFiles/owncloudsync_autogen.dir/ PLD Generating MOC source owncloudsync_autogen/EWIEGA46WW/moc_abstractnetworkjob.cpp Generating MOC source owncloudsync_autogen/EWIEGA46WW/moc_accessmanager.cpp Generating MOC source owncloudsync_autogen/EWIEGA46WW/moc_account.cpp Generating MOC source owncloudsync_autogen/EWIEGA46WW/moc_bandwidthmanager.cpp Generating MOC source owncloudsync_autogen/EWIEGA46WW/moc_checksums.cpp Generating MOC source owncloudsync_autogen/EWIEGA46WW/moc_clientproxy.cpp Generating MOC source owncloudsync_autogen/EWIEGA46WW/moc_connectionvalidator.cpp Generating MOC source owncloudsync_autogen/EWIEGA46WW/moc_cookiejar.cpp Generating MOC source owncloudsync_autogen/LEWYVFTDK4/moc_abstractcredentials.cpp Generating MOC source owncloudsync_autogen/LEWYVFTDK4/moc_dummycredentials.cpp Generating MOC source owncloudsync_autogen/LEWYVFTDK4/moc_httpcredentials.cpp Generating MOC source owncloudsync_autogen/EWIEGA46WW/moc_discoveryphase.cpp Generating MOC source owncloudsync_autogen/EWIEGA46WW/moc_excludedfiles.cpp Generating MOC source owncloudsync_autogen/EWIEGA46WW/moc_logger.cpp Generating MOC source owncloudsync_autogen/EWIEGA46WW/moc_networkjobs.cpp Generating MOC source owncloudsync_autogen/EWIEGA46WW/moc_owncloudpropagator.cpp Generating MOC source owncloudsync_autogen/EWIEGA46WW/moc_owncloudtheme.cpp Generating MOC source owncloudsync_autogen/EWIEGA46WW/moc_progressdispatcher.cpp Generating MOC source owncloudsync_autogen/EWIEGA46WW/moc_propagatedownload.cpp Generating MOC source owncloudsync_autogen/EWIEGA46WW/moc_propagateremotedelete.cpp Generating MOC source owncloudsync_autogen/EWIEGA46WW/moc_propagateremotemkdir.cpp Generating MOC source owncloudsync_autogen/EWIEGA46WW/moc_propagateremotemove.cpp Generating MOC source owncloudsync_autogen/EWIEGA46WW/moc_propagateupload.cpp Generating MOC source owncloudsync_autogen/EWIEGA46WW/moc_propagatorjobs.cpp Generating MOC source owncloudsync_autogen/EWIEGA46WW/moc_syncengine.cpp Generating MOC source owncloudsync_autogen/EWIEGA46WW/moc_syncfilestatustracker.cpp Generating MOC source owncloudsync_autogen/EWIEGA46WW/moc_syncjournaldb.cpp Generating MOC source owncloudsync_autogen/EWIEGA46WW/moc_theme.cpp Generating MOC compilation owncloudsync_autogen/moc_compilation.cpp make[2]: Leaving directory '/tmp/B.LDs7so/BUILD/owncloudclient-2.3.3/build' make[1]: Entering directory '/tmp/B.LDs7so/BUILD/owncloudclient-2.3.3/build' [ 12%] Built target owncloudsync_autogen make[1]: Leaving directory '/tmp/B.LDs7so/BUILD/owncloudclient-2.3.3/build' /usr/bin/make -f src/libsync/CMakeFiles/owncloudsync.dir/build.make src/libsync/CMakeFiles/owncloudsync.dir/depend make[2]: Entering directory '/tmp/B.LDs7so/BUILD/owncloudclient-2.3.3/build' cd /tmp/B.LDs7so/BUILD/owncloudclient-2.3.3/build && /usr/bin/cmake -E cmake_depends "Unix Makefiles" /tmp/B.LDs7so/BUILD/owncloudclient-2.3.3 /tmp/B.LDs7so/BUILD/owncloudclient-2.3.3/src/libsync /tmp/B.LDs7so/BUILD/owncloudclient-2.3.3/build /tmp/B.LDs7so/BUILD/owncloudclient-2.3.3/build/src/libsync /tmp/B.LDs7so/BUILD/owncloudclient-2.3.3/build/src/libsync/CMakeFiles/owncloudsync.dir/DependInfo.cmake --color= Scanning dependencies of target owncloudsync make[2]: Leaving directory '/tmp/B.LDs7so/BUILD/owncloudclient-2.3.3/build' /usr/bin/make -f src/libsync/CMakeFiles/owncloudsync.dir/build.make src/libsync/CMakeFiles/owncloudsync.dir/build make[2]: Entering directory '/tmp/B.LDs7so/BUILD/owncloudclient-2.3.3/build' [ 14%] Building CXX object src/libsync/CMakeFiles/owncloudsync.dir/clientproxy.cpp.o cd /tmp/B.LDs7so/BUILD/owncloudclient-2.3.3/build/src/libsync && /usr/bin/x86_64-pld-linux-g++ -DQT_CONCURRENT_LIB -DQT_CORE_LIB -DQT_DBUS_LIB -DQT_DISABLE_DEPRECATED_BEFORE=0 -DQT_GUI_LIB -DQT_MESSAGELOGCONTEXT -DQT_NETWORK_LIB -DQT_NO_DEBUG -DQT_USE_QSTRINGBUILDER -DQT_WIDGETS_LIB -DUNICODE -DUSE_FDO_NOTIFICATIONS -D_UNICODE -Downcloudsync_EXPORTS -I/tmp/B.LDs7so/BUILD/owncloudclient-2.3.3/build/src/libsync/owncloudsync_autogen/include -I/tmp/B.LDs7so/BUILD/owncloudclient-2.3.3/build -I/tmp/B.LDs7so/BUILD/owncloudclient-2.3.3/src/libsync -I/tmp/B.LDs7so/BUILD/owncloudclient-2.3.3/build/src/libsync -I/tmp/B.LDs7so/BUILD/owncloudclient-2.3.3/csync/src -I/tmp/B.LDs7so/BUILD/owncloudclient-2.3.3/build/csync -I/tmp/B.LDs7so/BUILD/owncloudclient-2.3.3/build/csync/src -I/tmp/B.LDs7so/BUILD/owncloudclient-2.3.3/src/3rdparty/qjson -I/usr/include/qt5keychain -isystem /usr/include/qt5 -isystem /usr/include/qt5/QtWidgets -isystem /usr/include/qt5/QtGui -isystem /usr/include/qt5/QtCore -isystem /usr/lib64/qt5/./mkspecs/linux-g++ -isystem /usr/include/qt5/QtNetwork -isystem /usr/include/qt5/QtConcurrent -Wall -Wextra -pedantic -Wno-long-long -std=c++0x -Wpedantic -fPIC -O2 -fwrapv -pipe -Wformat -Werror=format-security -gdwarf-4 -fno-debug-types-section -fvar-tracking-assignments -g2 -Wp,-D_FORTIFY_SOURCE=2 -fstack-protector-strong --param=ssp-buffer-size=4 -fPIC -march=x86-64 -gdwarf-4 -fno-debug-types-section -fvar-tracking-assignments -g2 -DNDEBUG -DQT_NO_DEBUG -fPIC -fPIC -std=gnu++11 -o CMakeFiles/owncloudsync.dir/clientproxy.cpp.o -c /tmp/B.LDs7so/BUILD/owncloudclient-2.3.3/src/libsync/clientproxy.cpp make[2]: Leaving directory '/tmp/B.LDs7so/BUILD/owncloudclient-2.3.3/build' make[2]: Entering directory '/tmp/B.LDs7so/BUILD/owncloudclient-2.3.3/build' [ 13%] Building CXX object src/libsync/CMakeFiles/owncloudsync.dir/bandwidthmanager.cpp.o cd /tmp/B.LDs7so/BUILD/owncloudclient-2.3.3/build/src/libsync && /usr/bin/x86_64-pld-linux-g++ -DQT_CONCURRENT_LIB -DQT_CORE_LIB -DQT_DBUS_LIB -DQT_DISABLE_DEPRECATED_BEFORE=0 -DQT_GUI_LIB -DQT_MESSAGELOGCONTEXT -DQT_NETWORK_LIB -DQT_NO_DEBUG -DQT_USE_QSTRINGBUILDER -DQT_WIDGETS_LIB -DUNICODE -DUSE_FDO_NOTIFICATIONS -D_UNICODE -Downcloudsync_EXPORTS -I/tmp/B.LDs7so/BUILD/owncloudclient-2.3.3/build/src/libsync/owncloudsync_autogen/include -I/tmp/B.LDs7so/BUILD/owncloudclient-2.3.3/build -I/tmp/B.LDs7so/BUILD/owncloudclient-2.3.3/src/libsync -I/tmp/B.LDs7so/BUILD/owncloudclient-2.3.3/build/src/libsync -I/tmp/B.LDs7so/BUILD/owncloudclient-2.3.3/csync/src -I/tmp/B.LDs7so/BUILD/owncloudclient-2.3.3/build/csync -I/tmp/B.LDs7so/BUILD/owncloudclient-2.3.3/build/csync/src -I/tmp/B.LDs7so/BUILD/owncloudclient-2.3.3/src/3rdparty/qjson -I/usr/include/qt5keychain -isystem /usr/include/qt5 -isystem /usr/include/qt5/QtWidgets -isystem /usr/include/qt5/QtGui -isystem /usr/include/qt5/QtCore -isystem /usr/lib64/qt5/./mkspecs/linux-g++ -isystem /usr/include/qt5/QtNetwork -isystem /usr/include/qt5/QtConcurrent -Wall -Wextra -pedantic -Wno-long-long -std=c++0x -Wpedantic -fPIC -O2 -fwrapv -pipe -Wformat -Werror=format-security -gdwarf-4 -fno-debug-types-section -fvar-tracking-assignments -g2 -Wp,-D_FORTIFY_SOURCE=2 -fstack-protector-strong --param=ssp-buffer-size=4 -fPIC -march=x86-64 -gdwarf-4 -fno-debug-types-section -fvar-tracking-assignments -g2 -DNDEBUG -DQT_NO_DEBUG -fPIC -fPIC -std=gnu++11 -o CMakeFiles/owncloudsync.dir/bandwidthmanager.cpp.o -c /tmp/B.LDs7so/BUILD/owncloudclient-2.3.3/src/libsync/bandwidthmanager.cpp make[2]: Leaving directory '/tmp/B.LDs7so/BUILD/owncloudclient-2.3.3/build' make[2]: Entering directory '/tmp/B.LDs7so/BUILD/owncloudclient-2.3.3/build' [ 13%] Building CXX object src/libsync/CMakeFiles/owncloudsync.dir/account.cpp.o cd /tmp/B.LDs7so/BUILD/owncloudclient-2.3.3/build/src/libsync && /usr/bin/x86_64-pld-linux-g++ -DQT_CONCURRENT_LIB -DQT_CORE_LIB -DQT_DBUS_LIB -DQT_DISABLE_DEPRECATED_BEFORE=0 -DQT_GUI_LIB -DQT_MESSAGELOGCONTEXT -DQT_NETWORK_LIB -DQT_NO_DEBUG -DQT_USE_QSTRINGBUILDER -DQT_WIDGETS_LIB -DUNICODE -DUSE_FDO_NOTIFICATIONS -D_UNICODE -Downcloudsync_EXPORTS -I/tmp/B.LDs7so/BUILD/owncloudclient-2.3.3/build/src/libsync/owncloudsync_autogen/include -I/tmp/B.LDs7so/BUILD/owncloudclient-2.3.3/build -I/tmp/B.LDs7so/BUILD/owncloudclient-2.3.3/src/libsync -I/tmp/B.LDs7so/BUILD/owncloudclient-2.3.3/build/src/libsync -I/tmp/B.LDs7so/BUILD/owncloudclient-2.3.3/csync/src -I/tmp/B.LDs7so/BUILD/owncloudclient-2.3.3/build/csync -I/tmp/B.LDs7so/BUILD/owncloudclient-2.3.3/build/csync/src -I/tmp/B.LDs7so/BUILD/owncloudclient-2.3.3/src/3rdparty/qjson -I/usr/include/qt5keychain -isystem /usr/include/qt5 -isystem /usr/include/qt5/QtWidgets -isystem /usr/include/qt5/QtGui -isystem /usr/include/qt5/QtCore -isystem /usr/lib64/qt5/./mkspecs/linux-g++ -isystem /usr/include/qt5/QtNetwork -isystem /usr/include/qt5/QtConcurrent -Wall -Wextra -pedantic -Wno-long-long -std=c++0x -Wpedantic -fPIC -O2 -fwrapv -pipe -Wformat -Werror=format-security -gdwarf-4 -fno-debug-types-section -fvar-tracking-assignments -g2 -Wp,-D_FORTIFY_SOURCE=2 -fstack-protector-strong --param=ssp-buffer-size=4 -fPIC -march=x86-64 -gdwarf-4 -fno-debug-types-section -fvar-tracking-assignments -g2 -DNDEBUG -DQT_NO_DEBUG -fPIC -fPIC -std=gnu++11 -o CMakeFiles/owncloudsync.dir/account.cpp.o -c /tmp/B.LDs7so/BUILD/owncloudclient-2.3.3/src/libsync/account.cpp make[2]: Leaving directory '/tmp/B.LDs7so/BUILD/owncloudclient-2.3.3/build' make[2]: Entering directory '/tmp/B.LDs7so/BUILD/owncloudclient-2.3.3/build' [ 14%] Building CXX object src/libsync/CMakeFiles/owncloudsync.dir/capabilities.cpp.o cd /tmp/B.LDs7so/BUILD/owncloudclient-2.3.3/build/src/libsync && /usr/bin/x86_64-pld-linux-g++ -DQT_CONCURRENT_LIB -DQT_CORE_LIB -DQT_DBUS_LIB -DQT_DISABLE_DEPRECATED_BEFORE=0 -DQT_GUI_LIB -DQT_MESSAGELOGCONTEXT -DQT_NETWORK_LIB -DQT_NO_DEBUG -DQT_USE_QSTRINGBUILDER -DQT_WIDGETS_LIB -DUNICODE -DUSE_FDO_NOTIFICATIONS -D_UNICODE -Downcloudsync_EXPORTS -I/tmp/B.LDs7so/BUILD/owncloudclient-2.3.3/build/src/libsync/owncloudsync_autogen/include -I/tmp/B.LDs7so/BUILD/owncloudclient-2.3.3/build -I/tmp/B.LDs7so/BUILD/owncloudclient-2.3.3/src/libsync -I/tmp/B.LDs7so/BUILD/owncloudclient-2.3.3/build/src/libsync -I/tmp/B.LDs7so/BUILD/owncloudclient-2.3.3/csync/src -I/tmp/B.LDs7so/BUILD/owncloudclient-2.3.3/build/csync -I/tmp/B.LDs7so/BUILD/owncloudclient-2.3.3/build/csync/src -I/tmp/B.LDs7so/BUILD/owncloudclient-2.3.3/src/3rdparty/qjson -I/usr/include/qt5keychain -isystem /usr/include/qt5 -isystem /usr/include/qt5/QtWidgets -isystem /usr/include/qt5/QtGui -isystem /usr/include/qt5/QtCore -isystem /usr/lib64/qt5/./mkspecs/linux-g++ -isystem /usr/include/qt5/QtNetwork -isystem /usr/include/qt5/QtConcurrent -Wall -Wextra -pedantic -Wno-long-long -std=c++0x -Wpedantic -fPIC -O2 -fwrapv -pipe -Wformat -Werror=format-security -gdwarf-4 -fno-debug-types-section -fvar-tracking-assignments -g2 -Wp,-D_FORTIFY_SOURCE=2 -fstack-protector-strong --param=ssp-buffer-size=4 -fPIC -march=x86-64 -gdwarf-4 -fno-debug-types-section -fvar-tracking-assignments -g2 -DNDEBUG -DQT_NO_DEBUG -fPIC -fPIC -std=gnu++11 -o CMakeFiles/owncloudsync.dir/capabilities.cpp.o -c /tmp/B.LDs7so/BUILD/owncloudclient-2.3.3/src/libsync/capabilities.cpp make[2]: Leaving directory '/tmp/B.LDs7so/BUILD/owncloudclient-2.3.3/build' make[2]: Entering directory '/tmp/B.LDs7so/BUILD/owncloudclient-2.3.3/build' [ 15%] Building CXX object src/libsync/CMakeFiles/owncloudsync.dir/cookiejar.cpp.o cd /tmp/B.LDs7so/BUILD/owncloudclient-2.3.3/build/src/libsync && /usr/bin/x86_64-pld-linux-g++ -DQT_CONCURRENT_LIB -DQT_CORE_LIB -DQT_DBUS_LIB -DQT_DISABLE_DEPRECATED_BEFORE=0 -DQT_GUI_LIB -DQT_MESSAGELOGCONTEXT -DQT_NETWORK_LIB -DQT_NO_DEBUG -DQT_USE_QSTRINGBUILDER -DQT_WIDGETS_LIB -DUNICODE -DUSE_FDO_NOTIFICATIONS -D_UNICODE -Downcloudsync_EXPORTS -I/tmp/B.LDs7so/BUILD/owncloudclient-2.3.3/build/src/libsync/owncloudsync_autogen/include -I/tmp/B.LDs7so/BUILD/owncloudclient-2.3.3/build -I/tmp/B.LDs7so/BUILD/owncloudclient-2.3.3/src/libsync -I/tmp/B.LDs7so/BUILD/owncloudclient-2.3.3/build/src/libsync -I/tmp/B.LDs7so/BUILD/owncloudclient-2.3.3/csync/src -I/tmp/B.LDs7so/BUILD/owncloudclient-2.3.3/build/csync -I/tmp/B.LDs7so/BUILD/owncloudclient-2.3.3/build/csync/src -I/tmp/B.LDs7so/BUILD/owncloudclient-2.3.3/src/3rdparty/qjson -I/usr/include/qt5keychain -isystem /usr/include/qt5 -isystem /usr/include/qt5/QtWidgets -isystem /usr/include/qt5/QtGui -isystem /usr/include/qt5/QtCore -isystem /usr/lib64/qt5/./mkspecs/linux-g++ -isystem /usr/include/qt5/QtNetwork -isystem /usr/include/qt5/QtConcurrent -Wall -Wextra -pedantic -Wno-long-long -std=c++0x -Wpedantic -fPIC -O2 -fwrapv -pipe -Wformat -Werror=format-security -gdwarf-4 -fno-debug-types-section -fvar-tracking-assignments -g2 -Wp,-D_FORTIFY_SOURCE=2 -fstack-protector-strong --param=ssp-buffer-size=4 -fPIC -march=x86-64 -gdwarf-4 -fno-debug-types-section -fvar-tracking-assignments -g2 -DNDEBUG -DQT_NO_DEBUG -fPIC -fPIC -std=gnu++11 -o CMakeFiles/owncloudsync.dir/cookiejar.cpp.o -c /tmp/B.LDs7so/BUILD/owncloudclient-2.3.3/src/libsync/cookiejar.cpp make[2]: Leaving directory '/tmp/B.LDs7so/BUILD/owncloudclient-2.3.3/build' make[2]: Entering directory '/tmp/B.LDs7so/BUILD/owncloudclient-2.3.3/build' [ 0%] Automatic MOC for target owncloud cd /tmp/B.LDs7so/BUILD/owncloudclient-2.3.3/build/src/gui && /usr/bin/cmake -E cmake_autogen /tmp/B.LDs7so/BUILD/owncloudclient-2.3.3/build/src/gui/CMakeFiles/owncloud_autogen.dir/ PLD Generating MOC source owncloud_autogen/U6I6NBY3Z5/moc_QProgressIndicator.cpp Generating MOC source owncloud_autogen/EWIEGA46WW/moc_accountmanager.cpp Generating MOC source owncloud_autogen/EWIEGA46WW/moc_accountsettings.cpp Generating MOC source owncloud_autogen/EWIEGA46WW/moc_accountstate.cpp Generating MOC source owncloud_autogen/EWIEGA46WW/moc_activityitemdelegate.cpp Generating MOC source owncloud_autogen/EWIEGA46WW/moc_activitylistmodel.cpp Generating MOC source owncloud_autogen/EWIEGA46WW/moc_activitywidget.cpp Generating MOC source owncloud_autogen/EWIEGA46WW/moc_addcertificatedialog.cpp Generating MOC source owncloud_autogen/EWIEGA46WW/moc_application.cpp Generating MOC source owncloud_autogen/EWIEGA46WW/moc_authenticationdialog.cpp Generating MOC source owncloud_autogen/LEWYVFTDK4/moc_httpcredentialsgui.cpp Generating MOC source owncloud_autogen/R2DCEGJIAQ/moc_shibbolethuserjob.cpp Generating MOC source owncloud_autogen/R2DCEGJIAQ/moc_shibbolethwebview.cpp Generating MOC source owncloud_autogen/LEWYVFTDK4/moc_shibbolethcredentials.cpp Generating MOC source owncloud_autogen/EWIEGA46WW/moc_folder.cpp Generating MOC source owncloud_autogen/EWIEGA46WW/moc_folderman.cpp Generating MOC source owncloud_autogen/EWIEGA46WW/moc_folderstatusdelegate.cpp Generating MOC source owncloud_autogen/EWIEGA46WW/moc_folderstatusmodel.cpp Generating MOC source owncloud_autogen/EWIEGA46WW/moc_folderwatcher.cpp Generating MOC source owncloud_autogen/EWIEGA46WW/moc_folderwatcher_linux.cpp Generating MOC source owncloud_autogen/EWIEGA46WW/moc_folderwizard.cpp Generating MOC source owncloud_autogen/EWIEGA46WW/moc_generalsettings.cpp Generating MOC source owncloud_autogen/EWIEGA46WW/moc_ignorelisteditor.cpp Generating MOC source owncloud_autogen/EWIEGA46WW/moc_lockwatcher.cpp Generating MOC source owncloud_autogen/EWIEGA46WW/moc_logbrowser.cpp Generating MOC source owncloud_autogen/EWIEGA46WW/moc_networksettings.cpp Generating MOC source owncloud_autogen/EWIEGA46WW/moc_notificationconfirmjob.cpp Generating MOC source owncloud_autogen/EWIEGA46WW/moc_notificationwidget.cpp Generating MOC source owncloud_autogen/EWIEGA46WW/moc_ocsjob.cpp Generating MOC source owncloud_autogen/EWIEGA46WW/moc_ocsshareejob.cpp Generating MOC source owncloud_autogen/EWIEGA46WW/moc_ocssharejob.cpp Generating MOC source owncloud_autogen/EWIEGA46WW/moc_owncloudgui.cpp Generating MOC source owncloud_autogen/EWIEGA46WW/moc_owncloudsetupwizard.cpp Generating MOC source owncloud_autogen/EWIEGA46WW/moc_protocolwidget.cpp Generating MOC source owncloud_autogen/EWIEGA46WW/moc_proxyauthdialog.cpp Generating MOC source owncloud_autogen/EWIEGA46WW/moc_proxyauthhandler.cpp Generating MOC source owncloud_autogen/EWIEGA46WW/moc_quotainfo.cpp Generating MOC source owncloud_autogen/EWIEGA46WW/moc_selectivesyncdialog.cpp Generating MOC source owncloud_autogen/EWIEGA46WW/moc_servernotificationhandler.cpp Generating MOC source owncloud_autogen/EWIEGA46WW/moc_settingsdialog.cpp Generating MOC source owncloud_autogen/EWIEGA46WW/moc_sharedialog.cpp Generating MOC source owncloud_autogen/EWIEGA46WW/moc_sharee.cpp Generating MOC source owncloud_autogen/EWIEGA46WW/moc_sharelinkwidget.cpp Generating MOC source owncloud_autogen/EWIEGA46WW/moc_sharemanager.cpp Generating MOC source owncloud_autogen/EWIEGA46WW/moc_shareusergroupwidget.cpp Generating MOC source owncloud_autogen/EWIEGA46WW/moc_socketapi.cpp Generating MOC source owncloud_autogen/EWIEGA46WW/moc_sslbutton.cpp Generating MOC source owncloud_autogen/EWIEGA46WW/moc_sslerrordialog.cpp Generating MOC source owncloud_autogen/EWIEGA46WW/moc_synclogdialog.cpp Generating MOC source owncloud_autogen/EWIEGA46WW/moc_systray.cpp Generating MOC source owncloud_autogen/EWIEGA46WW/moc_thumbnailjob.cpp Generating MOC source owncloud_autogen/EWIEGA46WW/moc_tooltipupdater.cpp Generating MOC source owncloud_autogen/WNPF3WE3L6/moc_owncloudadvancedsetuppage.cpp Generating MOC source owncloud_autogen/WNPF3WE3L6/moc_owncloudconnectionmethoddialog.cpp Generating MOC source owncloud_autogen/WNPF3WE3L6/moc_owncloudhttpcredspage.cpp Generating MOC source owncloud_autogen/WNPF3WE3L6/moc_owncloudsetuppage.cpp Generating MOC source owncloud_autogen/WNPF3WE3L6/moc_owncloudshibbolethcredspage.cpp Generating MOC source owncloud_autogen/WNPF3WE3L6/moc_owncloudwizard.cpp Generating MOC source owncloud_autogen/WNPF3WE3L6/moc_owncloudwizardresultpage.cpp Generating MOC source owncloud_autogen/WNPF3WE3L6/moc_postfixlineedit.cpp Generating MOC compilation owncloud_autogen/moc_compilation.cpp make[2]: Leaving directory '/tmp/B.LDs7so/BUILD/owncloudclient-2.3.3/build' make[1]: Entering directory '/tmp/B.LDs7so/BUILD/owncloudclient-2.3.3/build' [ 16%] Built target owncloud_autogen make[1]: Leaving directory '/tmp/B.LDs7so/BUILD/owncloudclient-2.3.3/build' make[2]: Entering directory '/tmp/B.LDs7so/BUILD/owncloudclient-2.3.3/build' [ 16%] Building CXX object src/libsync/CMakeFiles/owncloudsync.dir/filesystem.cpp.o cd /tmp/B.LDs7so/BUILD/owncloudclient-2.3.3/build/src/libsync && /usr/bin/x86_64-pld-linux-g++ -DQT_CONCURRENT_LIB -DQT_CORE_LIB -DQT_DBUS_LIB -DQT_DISABLE_DEPRECATED_BEFORE=0 -DQT_GUI_LIB -DQT_MESSAGELOGCONTEXT -DQT_NETWORK_LIB -DQT_NO_DEBUG -DQT_USE_QSTRINGBUILDER -DQT_WIDGETS_LIB -DUNICODE -DUSE_FDO_NOTIFICATIONS -D_UNICODE -Downcloudsync_EXPORTS -I/tmp/B.LDs7so/BUILD/owncloudclient-2.3.3/build/src/libsync/owncloudsync_autogen/include -I/tmp/B.LDs7so/BUILD/owncloudclient-2.3.3/build -I/tmp/B.LDs7so/BUILD/owncloudclient-2.3.3/src/libsync -I/tmp/B.LDs7so/BUILD/owncloudclient-2.3.3/build/src/libsync -I/tmp/B.LDs7so/BUILD/owncloudclient-2.3.3/csync/src -I/tmp/B.LDs7so/BUILD/owncloudclient-2.3.3/build/csync -I/tmp/B.LDs7so/BUILD/owncloudclient-2.3.3/build/csync/src -I/tmp/B.LDs7so/BUILD/owncloudclient-2.3.3/src/3rdparty/qjson -I/usr/include/qt5keychain -isystem /usr/include/qt5 -isystem /usr/include/qt5/QtWidgets -isystem /usr/include/qt5/QtGui -isystem /usr/include/qt5/QtCore -isystem /usr/lib64/qt5/./mkspecs/linux-g++ -isystem /usr/include/qt5/QtNetwork -isystem /usr/include/qt5/QtConcurrent -Wall -Wextra -pedantic -Wno-long-long -std=c++0x -Wpedantic -fPIC -O2 -fwrapv -pipe -Wformat -Werror=format-security -gdwarf-4 -fno-debug-types-section -fvar-tracking-assignments -g2 -Wp,-D_FORTIFY_SOURCE=2 -fstack-protector-strong --param=ssp-buffer-size=4 -fPIC -march=x86-64 -gdwarf-4 -fno-debug-types-section -fvar-tracking-assignments -g2 -DNDEBUG -DQT_NO_DEBUG -fPIC -fPIC -std=gnu++11 -o CMakeFiles/owncloudsync.dir/filesystem.cpp.o -c /tmp/B.LDs7so/BUILD/owncloudclient-2.3.3/src/libsync/filesystem.cpp make[2]: Leaving directory '/tmp/B.LDs7so/BUILD/owncloudclient-2.3.3/build' make[2]: Entering directory '/tmp/B.LDs7so/BUILD/owncloudclient-2.3.3/build' [ 14%] Building CXX object src/libsync/CMakeFiles/owncloudsync.dir/connectionvalidator.cpp.o cd /tmp/B.LDs7so/BUILD/owncloudclient-2.3.3/build/src/libsync && /usr/bin/x86_64-pld-linux-g++ -DQT_CONCURRENT_LIB -DQT_CORE_LIB -DQT_DBUS_LIB -DQT_DISABLE_DEPRECATED_BEFORE=0 -DQT_GUI_LIB -DQT_MESSAGELOGCONTEXT -DQT_NETWORK_LIB -DQT_NO_DEBUG -DQT_USE_QSTRINGBUILDER -DQT_WIDGETS_LIB -DUNICODE -DUSE_FDO_NOTIFICATIONS -D_UNICODE -Downcloudsync_EXPORTS -I/tmp/B.LDs7so/BUILD/owncloudclient-2.3.3/build/src/libsync/owncloudsync_autogen/include -I/tmp/B.LDs7so/BUILD/owncloudclient-2.3.3/build -I/tmp/B.LDs7so/BUILD/owncloudclient-2.3.3/src/libsync -I/tmp/B.LDs7so/BUILD/owncloudclient-2.3.3/build/src/libsync -I/tmp/B.LDs7so/BUILD/owncloudclient-2.3.3/csync/src -I/tmp/B.LDs7so/BUILD/owncloudclient-2.3.3/build/csync -I/tmp/B.LDs7so/BUILD/owncloudclient-2.3.3/build/csync/src -I/tmp/B.LDs7so/BUILD/owncloudclient-2.3.3/src/3rdparty/qjson -I/usr/include/qt5keychain -isystem /usr/include/qt5 -isystem /usr/include/qt5/QtWidgets -isystem /usr/include/qt5/QtGui -isystem /usr/include/qt5/QtCore -isystem /usr/lib64/qt5/./mkspecs/linux-g++ -isystem /usr/include/qt5/QtNetwork -isystem /usr/include/qt5/QtConcurrent -Wall -Wextra -pedantic -Wno-long-long -std=c++0x -Wpedantic -fPIC -O2 -fwrapv -pipe -Wformat -Werror=format-security -gdwarf-4 -fno-debug-types-section -fvar-tracking-assignments -g2 -Wp,-D_FORTIFY_SOURCE=2 -fstack-protector-strong --param=ssp-buffer-size=4 -fPIC -march=x86-64 -gdwarf-4 -fno-debug-types-section -fvar-tracking-assignments -g2 -DNDEBUG -DQT_NO_DEBUG -fPIC -fPIC -std=gnu++11 -o CMakeFiles/owncloudsync.dir/connectionvalidator.cpp.o -c /tmp/B.LDs7so/BUILD/owncloudclient-2.3.3/src/libsync/connectionvalidator.cpp make[2]: Leaving directory '/tmp/B.LDs7so/BUILD/owncloudclient-2.3.3/build' make[2]: Entering directory '/tmp/B.LDs7so/BUILD/owncloudclient-2.3.3/build' [ 17%] Building CXX object src/libsync/CMakeFiles/owncloudsync.dir/accessmanager.cpp.o cd /tmp/B.LDs7so/BUILD/owncloudclient-2.3.3/build/src/libsync && /usr/bin/x86_64-pld-linux-g++ -DQT_CONCURRENT_LIB -DQT_CORE_LIB -DQT_DBUS_LIB -DQT_DISABLE_DEPRECATED_BEFORE=0 -DQT_GUI_LIB -DQT_MESSAGELOGCONTEXT -DQT_NETWORK_LIB -DQT_NO_DEBUG -DQT_USE_QSTRINGBUILDER -DQT_WIDGETS_LIB -DUNICODE -DUSE_FDO_NOTIFICATIONS -D_UNICODE -Downcloudsync_EXPORTS -I/tmp/B.LDs7so/BUILD/owncloudclient-2.3.3/build/src/libsync/owncloudsync_autogen/include -I/tmp/B.LDs7so/BUILD/owncloudclient-2.3.3/build -I/tmp/B.LDs7so/BUILD/owncloudclient-2.3.3/src/libsync -I/tmp/B.LDs7so/BUILD/owncloudclient-2.3.3/build/src/libsync -I/tmp/B.LDs7so/BUILD/owncloudclient-2.3.3/csync/src -I/tmp/B.LDs7so/BUILD/owncloudclient-2.3.3/build/csync -I/tmp/B.LDs7so/BUILD/owncloudclient-2.3.3/build/csync/src -I/tmp/B.LDs7so/BUILD/owncloudclient-2.3.3/src/3rdparty/qjson -I/usr/include/qt5keychain -isystem /usr/include/qt5 -isystem /usr/include/qt5/QtWidgets -isystem /usr/include/qt5/QtGui -isystem /usr/include/qt5/QtCore -isystem /usr/lib64/qt5/./mkspecs/linux-g++ -isystem /usr/include/qt5/QtNetwork -isystem /usr/include/qt5/QtConcurrent -Wall -Wextra -pedantic -Wno-long-long -std=c++0x -Wpedantic -fPIC -O2 -fwrapv -pipe -Wformat -Werror=format-security -gdwarf-4 -fno-debug-types-section -fvar-tracking-assignments -g2 -Wp,-D_FORTIFY_SOURCE=2 -fstack-protector-strong --param=ssp-buffer-size=4 -fPIC -march=x86-64 -gdwarf-4 -fno-debug-types-section -fvar-tracking-assignments -g2 -DNDEBUG -DQT_NO_DEBUG -fPIC -fPIC -std=gnu++11 -o CMakeFiles/owncloudsync.dir/accessmanager.cpp.o -c /tmp/B.LDs7so/BUILD/owncloudclient-2.3.3/src/libsync/accessmanager.cpp make[2]: Leaving directory '/tmp/B.LDs7so/BUILD/owncloudclient-2.3.3/build' make[2]: Entering directory '/tmp/B.LDs7so/BUILD/owncloudclient-2.3.3/build' [ 15%] Building CXX object src/libsync/CMakeFiles/owncloudsync.dir/discoveryphase.cpp.o cd /tmp/B.LDs7so/BUILD/owncloudclient-2.3.3/build/src/libsync && /usr/bin/x86_64-pld-linux-g++ -DQT_CONCURRENT_LIB -DQT_CORE_LIB -DQT_DBUS_LIB -DQT_DISABLE_DEPRECATED_BEFORE=0 -DQT_GUI_LIB -DQT_MESSAGELOGCONTEXT -DQT_NETWORK_LIB -DQT_NO_DEBUG -DQT_USE_QSTRINGBUILDER -DQT_WIDGETS_LIB -DUNICODE -DUSE_FDO_NOTIFICATIONS -D_UNICODE -Downcloudsync_EXPORTS -I/tmp/B.LDs7so/BUILD/owncloudclient-2.3.3/build/src/libsync/owncloudsync_autogen/include -I/tmp/B.LDs7so/BUILD/owncloudclient-2.3.3/build -I/tmp/B.LDs7so/BUILD/owncloudclient-2.3.3/src/libsync -I/tmp/B.LDs7so/BUILD/owncloudclient-2.3.3/build/src/libsync -I/tmp/B.LDs7so/BUILD/owncloudclient-2.3.3/csync/src -I/tmp/B.LDs7so/BUILD/owncloudclient-2.3.3/build/csync -I/tmp/B.LDs7so/BUILD/owncloudclient-2.3.3/build/csync/src -I/tmp/B.LDs7so/BUILD/owncloudclient-2.3.3/src/3rdparty/qjson -I/usr/include/qt5keychain -isystem /usr/include/qt5 -isystem /usr/include/qt5/QtWidgets -isystem /usr/include/qt5/QtGui -isystem /usr/include/qt5/QtCore -isystem /usr/lib64/qt5/./mkspecs/linux-g++ -isystem /usr/include/qt5/QtNetwork -isystem /usr/include/qt5/QtConcurrent -Wall -Wextra -pedantic -Wno-long-long -std=c++0x -Wpedantic -fPIC -O2 -fwrapv -pipe -Wformat -Werror=format-security -gdwarf-4 -fno-debug-types-section -fvar-tracking-assignments -g2 -Wp,-D_FORTIFY_SOURCE=2 -fstack-protector-strong --param=ssp-buffer-size=4 -fPIC -march=x86-64 -gdwarf-4 -fno-debug-types-section -fvar-tracking-assignments -g2 -DNDEBUG -DQT_NO_DEBUG -fPIC -fPIC -std=gnu++11 -o CMakeFiles/owncloudsync.dir/discoveryphase.cpp.o -c /tmp/B.LDs7so/BUILD/owncloudclient-2.3.3/src/libsync/discoveryphase.cpp make[2]: Leaving directory '/tmp/B.LDs7so/BUILD/owncloudclient-2.3.3/build' make[2]: Entering directory '/tmp/B.LDs7so/BUILD/owncloudclient-2.3.3/build' [ 16%] Building CXX object src/libsync/CMakeFiles/owncloudsync.dir/logger.cpp.o cd /tmp/B.LDs7so/BUILD/owncloudclient-2.3.3/build/src/libsync && /usr/bin/x86_64-pld-linux-g++ -DQT_CONCURRENT_LIB -DQT_CORE_LIB -DQT_DBUS_LIB -DQT_DISABLE_DEPRECATED_BEFORE=0 -DQT_GUI_LIB -DQT_MESSAGELOGCONTEXT -DQT_NETWORK_LIB -DQT_NO_DEBUG -DQT_USE_QSTRINGBUILDER -DQT_WIDGETS_LIB -DUNICODE -DUSE_FDO_NOTIFICATIONS -D_UNICODE -Downcloudsync_EXPORTS -I/tmp/B.LDs7so/BUILD/owncloudclient-2.3.3/build/src/libsync/owncloudsync_autogen/include -I/tmp/B.LDs7so/BUILD/owncloudclient-2.3.3/build -I/tmp/B.LDs7so/BUILD/owncloudclient-2.3.3/src/libsync -I/tmp/B.LDs7so/BUILD/owncloudclient-2.3.3/build/src/libsync -I/tmp/B.LDs7so/BUILD/owncloudclient-2.3.3/csync/src -I/tmp/B.LDs7so/BUILD/owncloudclient-2.3.3/build/csync -I/tmp/B.LDs7so/BUILD/owncloudclient-2.3.3/build/csync/src -I/tmp/B.LDs7so/BUILD/owncloudclient-2.3.3/src/3rdparty/qjson -I/usr/include/qt5keychain -isystem /usr/include/qt5 -isystem /usr/include/qt5/QtWidgets -isystem /usr/include/qt5/QtGui -isystem /usr/include/qt5/QtCore -isystem /usr/lib64/qt5/./mkspecs/linux-g++ -isystem /usr/include/qt5/QtNetwork -isystem /usr/include/qt5/QtConcurrent -Wall -Wextra -pedantic -Wno-long-long -std=c++0x -Wpedantic -fPIC -O2 -fwrapv -pipe -Wformat -Werror=format-security -gdwarf-4 -fno-debug-types-section -fvar-tracking-assignments -g2 -Wp,-D_FORTIFY_SOURCE=2 -fstack-protector-strong --param=ssp-buffer-size=4 -fPIC -march=x86-64 -gdwarf-4 -fno-debug-types-section -fvar-tracking-assignments -g2 -DNDEBUG -DQT_NO_DEBUG -fPIC -fPIC -std=gnu++11 -o CMakeFiles/owncloudsync.dir/logger.cpp.o -c /tmp/B.LDs7so/BUILD/owncloudclient-2.3.3/src/libsync/logger.cpp make[2]: Leaving directory '/tmp/B.LDs7so/BUILD/owncloudclient-2.3.3/build' make[2]: Entering directory '/tmp/B.LDs7so/BUILD/owncloudclient-2.3.3/build' [ 19%] Building CXX object src/libsync/CMakeFiles/owncloudsync.dir/owncloudtheme.cpp.o cd /tmp/B.LDs7so/BUILD/owncloudclient-2.3.3/build/src/libsync && /usr/bin/x86_64-pld-linux-g++ -DQT_CONCURRENT_LIB -DQT_CORE_LIB -DQT_DBUS_LIB -DQT_DISABLE_DEPRECATED_BEFORE=0 -DQT_GUI_LIB -DQT_MESSAGELOGCONTEXT -DQT_NETWORK_LIB -DQT_NO_DEBUG -DQT_USE_QSTRINGBUILDER -DQT_WIDGETS_LIB -DUNICODE -DUSE_FDO_NOTIFICATIONS -D_UNICODE -Downcloudsync_EXPORTS -I/tmp/B.LDs7so/BUILD/owncloudclient-2.3.3/build/src/libsync/owncloudsync_autogen/include -I/tmp/B.LDs7so/BUILD/owncloudclient-2.3.3/build -I/tmp/B.LDs7so/BUILD/owncloudclient-2.3.3/src/libsync -I/tmp/B.LDs7so/BUILD/owncloudclient-2.3.3/build/src/libsync -I/tmp/B.LDs7so/BUILD/owncloudclient-2.3.3/csync/src -I/tmp/B.LDs7so/BUILD/owncloudclient-2.3.3/build/csync -I/tmp/B.LDs7so/BUILD/owncloudclient-2.3.3/build/csync/src -I/tmp/B.LDs7so/BUILD/owncloudclient-2.3.3/src/3rdparty/qjson -I/usr/include/qt5keychain -isystem /usr/include/qt5 -isystem /usr/include/qt5/QtWidgets -isystem /usr/include/qt5/QtGui -isystem /usr/include/qt5/QtCore -isystem /usr/lib64/qt5/./mkspecs/linux-g++ -isystem /usr/include/qt5/QtNetwork -isystem /usr/include/qt5/QtConcurrent -Wall -Wextra -pedantic -Wno-long-long -std=c++0x -Wpedantic -fPIC -O2 -fwrapv -pipe -Wformat -Werror=format-security -gdwarf-4 -fno-debug-types-section -fvar-tracking-assignments -g2 -Wp,-D_FORTIFY_SOURCE=2 -fstack-protector-strong --param=ssp-buffer-size=4 -fPIC -march=x86-64 -gdwarf-4 -fno-debug-types-section -fvar-tracking-assignments -g2 -DNDEBUG -DQT_NO_DEBUG -fPIC -fPIC -std=gnu++11 -o CMakeFiles/owncloudsync.dir/owncloudtheme.cpp.o -c /tmp/B.LDs7so/BUILD/owncloudclient-2.3.3/src/libsync/owncloudtheme.cpp make[2]: Leaving directory '/tmp/B.LDs7so/BUILD/owncloudclient-2.3.3/build' make[2]: Entering directory '/tmp/B.LDs7so/BUILD/owncloudclient-2.3.3/build' [ 18%] Building CXX object src/libsync/CMakeFiles/owncloudsync.dir/abstractnetworkjob.cpp.o cd /tmp/B.LDs7so/BUILD/owncloudclient-2.3.3/build/src/libsync && /usr/bin/x86_64-pld-linux-g++ -DQT_CONCURRENT_LIB -DQT_CORE_LIB -DQT_DBUS_LIB -DQT_DISABLE_DEPRECATED_BEFORE=0 -DQT_GUI_LIB -DQT_MESSAGELOGCONTEXT -DQT_NETWORK_LIB -DQT_NO_DEBUG -DQT_USE_QSTRINGBUILDER -DQT_WIDGETS_LIB -DUNICODE -DUSE_FDO_NOTIFICATIONS -D_UNICODE -Downcloudsync_EXPORTS -I/tmp/B.LDs7so/BUILD/owncloudclient-2.3.3/build/src/libsync/owncloudsync_autogen/include -I/tmp/B.LDs7so/BUILD/owncloudclient-2.3.3/build -I/tmp/B.LDs7so/BUILD/owncloudclient-2.3.3/src/libsync -I/tmp/B.LDs7so/BUILD/owncloudclient-2.3.3/build/src/libsync -I/tmp/B.LDs7so/BUILD/owncloudclient-2.3.3/csync/src -I/tmp/B.LDs7so/BUILD/owncloudclient-2.3.3/build/csync -I/tmp/B.LDs7so/BUILD/owncloudclient-2.3.3/build/csync/src -I/tmp/B.LDs7so/BUILD/owncloudclient-2.3.3/src/3rdparty/qjson -I/usr/include/qt5keychain -isystem /usr/include/qt5 -isystem /usr/include/qt5/QtWidgets -isystem /usr/include/qt5/QtGui -isystem /usr/include/qt5/QtCore -isystem /usr/lib64/qt5/./mkspecs/linux-g++ -isystem /usr/include/qt5/QtNetwork -isystem /usr/include/qt5/QtConcurrent -Wall -Wextra -pedantic -Wno-long-long -std=c++0x -Wpedantic -fPIC -O2 -fwrapv -pipe -Wformat -Werror=format-security -gdwarf-4 -fno-debug-types-section -fvar-tracking-assignments -g2 -Wp,-D_FORTIFY_SOURCE=2 -fstack-protector-strong --param=ssp-buffer-size=4 -fPIC -march=x86-64 -gdwarf-4 -fno-debug-types-section -fvar-tracking-assignments -g2 -DNDEBUG -DQT_NO_DEBUG -fPIC -fPIC -std=gnu++11 -o CMakeFiles/owncloudsync.dir/abstractnetworkjob.cpp.o -c /tmp/B.LDs7so/BUILD/owncloudclient-2.3.3/src/libsync/abstractnetworkjob.cpp make[2]: Leaving directory '/tmp/B.LDs7so/BUILD/owncloudclient-2.3.3/build' make[2]: Entering directory '/tmp/B.LDs7so/BUILD/owncloudclient-2.3.3/build' [ 17%] Building CXX object src/libsync/CMakeFiles/owncloudsync.dir/configfile.cpp.o cd /tmp/B.LDs7so/BUILD/owncloudclient-2.3.3/build/src/libsync && /usr/bin/x86_64-pld-linux-g++ -DQT_CONCURRENT_LIB -DQT_CORE_LIB -DQT_DBUS_LIB -DQT_DISABLE_DEPRECATED_BEFORE=0 -DQT_GUI_LIB -DQT_MESSAGELOGCONTEXT -DQT_NETWORK_LIB -DQT_NO_DEBUG -DQT_USE_QSTRINGBUILDER -DQT_WIDGETS_LIB -DUNICODE -DUSE_FDO_NOTIFICATIONS -D_UNICODE -Downcloudsync_EXPORTS -I/tmp/B.LDs7so/BUILD/owncloudclient-2.3.3/build/src/libsync/owncloudsync_autogen/include -I/tmp/B.LDs7so/BUILD/owncloudclient-2.3.3/build -I/tmp/B.LDs7so/BUILD/owncloudclient-2.3.3/src/libsync -I/tmp/B.LDs7so/BUILD/owncloudclient-2.3.3/build/src/libsync -I/tmp/B.LDs7so/BUILD/owncloudclient-2.3.3/csync/src -I/tmp/B.LDs7so/BUILD/owncloudclient-2.3.3/build/csync -I/tmp/B.LDs7so/BUILD/owncloudclient-2.3.3/build/csync/src -I/tmp/B.LDs7so/BUILD/owncloudclient-2.3.3/src/3rdparty/qjson -I/usr/include/qt5keychain -isystem /usr/include/qt5 -isystem /usr/include/qt5/QtWidgets -isystem /usr/include/qt5/QtGui -isystem /usr/include/qt5/QtCore -isystem /usr/lib64/qt5/./mkspecs/linux-g++ -isystem /usr/include/qt5/QtNetwork -isystem /usr/include/qt5/QtConcurrent -Wall -Wextra -pedantic -Wno-long-long -std=c++0x -Wpedantic -fPIC -O2 -fwrapv -pipe -Wformat -Werror=format-security -gdwarf-4 -fno-debug-types-section -fvar-tracking-assignments -g2 -Wp,-D_FORTIFY_SOURCE=2 -fstack-protector-strong --param=ssp-buffer-size=4 -fPIC -march=x86-64 -gdwarf-4 -fno-debug-types-section -fvar-tracking-assignments -g2 -DNDEBUG -DQT_NO_DEBUG -fPIC -fPIC -std=gnu++11 -o CMakeFiles/owncloudsync.dir/configfile.cpp.o -c /tmp/B.LDs7so/BUILD/owncloudclient-2.3.3/src/libsync/configfile.cpp make[2]: Leaving directory '/tmp/B.LDs7so/BUILD/owncloudclient-2.3.3/build' make[2]: Entering directory '/tmp/B.LDs7so/BUILD/owncloudclient-2.3.3/build' [ 19%] Building CXX object src/libsync/CMakeFiles/owncloudsync.dir/owncloudpropagator.cpp.o cd /tmp/B.LDs7so/BUILD/owncloudclient-2.3.3/build/src/libsync && /usr/bin/x86_64-pld-linux-g++ -DQT_CONCURRENT_LIB -DQT_CORE_LIB -DQT_DBUS_LIB -DQT_DISABLE_DEPRECATED_BEFORE=0 -DQT_GUI_LIB -DQT_MESSAGELOGCONTEXT -DQT_NETWORK_LIB -DQT_NO_DEBUG -DQT_USE_QSTRINGBUILDER -DQT_WIDGETS_LIB -DUNICODE -DUSE_FDO_NOTIFICATIONS -D_UNICODE -Downcloudsync_EXPORTS -I/tmp/B.LDs7so/BUILD/owncloudclient-2.3.3/build/src/libsync/owncloudsync_autogen/include -I/tmp/B.LDs7so/BUILD/owncloudclient-2.3.3/build -I/tmp/B.LDs7so/BUILD/owncloudclient-2.3.3/src/libsync -I/tmp/B.LDs7so/BUILD/owncloudclient-2.3.3/build/src/libsync -I/tmp/B.LDs7so/BUILD/owncloudclient-2.3.3/csync/src -I/tmp/B.LDs7so/BUILD/owncloudclient-2.3.3/build/csync -I/tmp/B.LDs7so/BUILD/owncloudclient-2.3.3/build/csync/src -I/tmp/B.LDs7so/BUILD/owncloudclient-2.3.3/src/3rdparty/qjson -I/usr/include/qt5keychain -isystem /usr/include/qt5 -isystem /usr/include/qt5/QtWidgets -isystem /usr/include/qt5/QtGui -isystem /usr/include/qt5/QtCore -isystem /usr/lib64/qt5/./mkspecs/linux-g++ -isystem /usr/include/qt5/QtNetwork -isystem /usr/include/qt5/QtConcurrent -Wall -Wextra -pedantic -Wno-long-long -std=c++0x -Wpedantic -fPIC -O2 -fwrapv -pipe -Wformat -Werror=format-security -gdwarf-4 -fno-debug-types-section -fvar-tracking-assignments -g2 -Wp,-D_FORTIFY_SOURCE=2 -fstack-protector-strong --param=ssp-buffer-size=4 -fPIC -march=x86-64 -gdwarf-4 -fno-debug-types-section -fvar-tracking-assignments -g2 -DNDEBUG -DQT_NO_DEBUG -fPIC -fPIC -std=gnu++11 -o CMakeFiles/owncloudsync.dir/owncloudpropagator.cpp.o -c /tmp/B.LDs7so/BUILD/owncloudclient-2.3.3/src/libsync/owncloudpropagator.cpp make[2]: Leaving directory '/tmp/B.LDs7so/BUILD/owncloudclient-2.3.3/build' make[2]: Entering directory '/tmp/B.LDs7so/BUILD/owncloudclient-2.3.3/build' [ 18%] Building CXX object src/libsync/CMakeFiles/owncloudsync.dir/networkjobs.cpp.o cd /tmp/B.LDs7so/BUILD/owncloudclient-2.3.3/build/src/libsync && /usr/bin/x86_64-pld-linux-g++ -DQT_CONCURRENT_LIB -DQT_CORE_LIB -DQT_DBUS_LIB -DQT_DISABLE_DEPRECATED_BEFORE=0 -DQT_GUI_LIB -DQT_MESSAGELOGCONTEXT -DQT_NETWORK_LIB -DQT_NO_DEBUG -DQT_USE_QSTRINGBUILDER -DQT_WIDGETS_LIB -DUNICODE -DUSE_FDO_NOTIFICATIONS -D_UNICODE -Downcloudsync_EXPORTS -I/tmp/B.LDs7so/BUILD/owncloudclient-2.3.3/build/src/libsync/owncloudsync_autogen/include -I/tmp/B.LDs7so/BUILD/owncloudclient-2.3.3/build -I/tmp/B.LDs7so/BUILD/owncloudclient-2.3.3/src/libsync -I/tmp/B.LDs7so/BUILD/owncloudclient-2.3.3/build/src/libsync -I/tmp/B.LDs7so/BUILD/owncloudclient-2.3.3/csync/src -I/tmp/B.LDs7so/BUILD/owncloudclient-2.3.3/build/csync -I/tmp/B.LDs7so/BUILD/owncloudclient-2.3.3/build/csync/src -I/tmp/B.LDs7so/BUILD/owncloudclient-2.3.3/src/3rdparty/qjson -I/usr/include/qt5keychain -isystem /usr/include/qt5 -isystem /usr/include/qt5/QtWidgets -isystem /usr/include/qt5/QtGui -isystem /usr/include/qt5/QtCore -isystem /usr/lib64/qt5/./mkspecs/linux-g++ -isystem /usr/include/qt5/QtNetwork -isystem /usr/include/qt5/QtConcurrent -Wall -Wextra -pedantic -Wno-long-long -std=c++0x -Wpedantic -fPIC -O2 -fwrapv -pipe -Wformat -Werror=format-security -gdwarf-4 -fno-debug-types-section -fvar-tracking-assignments -g2 -Wp,-D_FORTIFY_SOURCE=2 -fstack-protector-strong --param=ssp-buffer-size=4 -fPIC -march=x86-64 -gdwarf-4 -fno-debug-types-section -fvar-tracking-assignments -g2 -DNDEBUG -DQT_NO_DEBUG -fPIC -fPIC -std=gnu++11 -o CMakeFiles/owncloudsync.dir/networkjobs.cpp.o -c /tmp/B.LDs7so/BUILD/owncloudclient-2.3.3/src/libsync/networkjobs.cpp make[2]: Leaving directory '/tmp/B.LDs7so/BUILD/owncloudclient-2.3.3/build' make[2]: Entering directory '/tmp/B.LDs7so/BUILD/owncloudclient-2.3.3/build' [ 20%] Building CXX object src/libsync/CMakeFiles/owncloudsync.dir/progressdispatcher.cpp.o cd /tmp/B.LDs7so/BUILD/owncloudclient-2.3.3/build/src/libsync && /usr/bin/x86_64-pld-linux-g++ -DQT_CONCURRENT_LIB -DQT_CORE_LIB -DQT_DBUS_LIB -DQT_DISABLE_DEPRECATED_BEFORE=0 -DQT_GUI_LIB -DQT_MESSAGELOGCONTEXT -DQT_NETWORK_LIB -DQT_NO_DEBUG -DQT_USE_QSTRINGBUILDER -DQT_WIDGETS_LIB -DUNICODE -DUSE_FDO_NOTIFICATIONS -D_UNICODE -Downcloudsync_EXPORTS -I/tmp/B.LDs7so/BUILD/owncloudclient-2.3.3/build/src/libsync/owncloudsync_autogen/include -I/tmp/B.LDs7so/BUILD/owncloudclient-2.3.3/build -I/tmp/B.LDs7so/BUILD/owncloudclient-2.3.3/src/libsync -I/tmp/B.LDs7so/BUILD/owncloudclient-2.3.3/build/src/libsync -I/tmp/B.LDs7so/BUILD/owncloudclient-2.3.3/csync/src -I/tmp/B.LDs7so/BUILD/owncloudclient-2.3.3/build/csync -I/tmp/B.LDs7so/BUILD/owncloudclient-2.3.3/build/csync/src -I/tmp/B.LDs7so/BUILD/owncloudclient-2.3.3/src/3rdparty/qjson -I/usr/include/qt5keychain -isystem /usr/include/qt5 -isystem /usr/include/qt5/QtWidgets -isystem /usr/include/qt5/QtGui -isystem /usr/include/qt5/QtCore -isystem /usr/lib64/qt5/./mkspecs/linux-g++ -isystem /usr/include/qt5/QtNetwork -isystem /usr/include/qt5/QtConcurrent -Wall -Wextra -pedantic -Wno-long-long -std=c++0x -Wpedantic -fPIC -O2 -fwrapv -pipe -Wformat -Werror=format-security -gdwarf-4 -fno-debug-types-section -fvar-tracking-assignments -g2 -Wp,-D_FORTIFY_SOURCE=2 -fstack-protector-strong --param=ssp-buffer-size=4 -fPIC -march=x86-64 -gdwarf-4 -fno-debug-types-section -fvar-tracking-assignments -g2 -DNDEBUG -DQT_NO_DEBUG -fPIC -fPIC -std=gnu++11 -o CMakeFiles/owncloudsync.dir/progressdispatcher.cpp.o -c /tmp/B.LDs7so/BUILD/owncloudclient-2.3.3/src/libsync/progressdispatcher.cpp In file included from /tmp/B.LDs7so/BUILD/owncloudclient-2.3.3/src/libsync/progressdispatcher.h:27:0, from /tmp/B.LDs7so/BUILD/owncloudclient-2.3.3/src/libsync/progressdispatcher.cpp:15: /tmp/B.LDs7so/BUILD/owncloudclient-2.3.3/src/libsync/syncfileitem.h: In member function 'void OCC::ProgressInfo::reset()': /tmp/B.LDs7so/BUILD/owncloudclient-2.3.3/src/libsync/syncfileitem.h:180:12: warning: '*((void*)(&<anonymous>)+136).OCC::SyncFileItem::<unnamed struct>::_other_size' is used uninitialized in this function [-Wuninitialized] struct { ^ /tmp/B.LDs7so/BUILD/owncloudclient-2.3.3/src/libsync/syncfileitem.h:180:12: warning: '*((void*)(&<anonymous>)+136).OCC::SyncFileItem::<unnamed struct>::_other_modtime' is used uninitialized in this function [-Wuninitialized] /tmp/B.LDs7so/BUILD/owncloudclient-2.3.3/src/libsync/syncfileitem.h:180:12: warning: '*((void*)(&<anonymous>)+136).OCC::SyncFileItem::<unnamed struct>::_other_instruction' is used uninitialized in this function [-Wuninitialized] /tmp/B.LDs7so/BUILD/owncloudclient-2.3.3/src/libsync/syncfileitem.h: In member function 'void OCC::ProgressInfo::setProgressItem(const OCC::SyncFileItem&, quint64)': /tmp/B.LDs7so/BUILD/owncloudclient-2.3.3/src/libsync/syncfileitem.h:180:12: warning: '*((void*)(&<anonymous>)+136).OCC::SyncFileItem::<unnamed struct>::_other_size' may be used uninitialized in this function [-Wmaybe-uninitialized] struct { ^ /tmp/B.LDs7so/BUILD/owncloudclient-2.3.3/src/libsync/syncfileitem.h:180:12: warning: '*((void*)(&<anonymous>)+136).OCC::SyncFileItem::<unnamed struct>::_other_modtime' may be used uninitialized in this function [-Wmaybe-uninitialized] /tmp/B.LDs7so/BUILD/owncloudclient-2.3.3/src/libsync/syncfileitem.h:180:12: warning: '*((void*)(&<anonymous>)+136).OCC::SyncFileItem::<unnamed struct>::_other_instruction' may be used uninitialized in this function [-Wmaybe-uninitialized] make[2]: Leaving directory '/tmp/B.LDs7so/BUILD/owncloudclient-2.3.3/build' make[2]: Entering directory '/tmp/B.LDs7so/BUILD/owncloudclient-2.3.3/build' [ 20%] Building CXX object src/libsync/CMakeFiles/owncloudsync.dir/propagatorjobs.cpp.o cd /tmp/B.LDs7so/BUILD/owncloudclient-2.3.3/build/src/libsync && /usr/bin/x86_64-pld-linux-g++ -DQT_CONCURRENT_LIB -DQT_CORE_LIB -DQT_DBUS_LIB -DQT_DISABLE_DEPRECATED_BEFORE=0 -DQT_GUI_LIB -DQT_MESSAGELOGCONTEXT -DQT_NETWORK_LIB -DQT_NO_DEBUG -DQT_USE_QSTRINGBUILDER -DQT_WIDGETS_LIB -DUNICODE -DUSE_FDO_NOTIFICATIONS -D_UNICODE -Downcloudsync_EXPORTS -I/tmp/B.LDs7so/BUILD/owncloudclient-2.3.3/build/src/libsync/owncloudsync_autogen/include -I/tmp/B.LDs7so/BUILD/owncloudclient-2.3.3/build -I/tmp/B.LDs7so/BUILD/owncloudclient-2.3.3/src/libsync -I/tmp/B.LDs7so/BUILD/owncloudclient-2.3.3/build/src/libsync -I/tmp/B.LDs7so/BUILD/owncloudclient-2.3.3/csync/src -I/tmp/B.LDs7so/BUILD/owncloudclient-2.3.3/build/csync -I/tmp/B.LDs7so/BUILD/owncloudclient-2.3.3/build/csync/src -I/tmp/B.LDs7so/BUILD/owncloudclient-2.3.3/src/3rdparty/qjson -I/usr/include/qt5keychain -isystem /usr/include/qt5 -isystem /usr/include/qt5/QtWidgets -isystem /usr/include/qt5/QtGui -isystem /usr/include/qt5/QtCore -isystem /usr/lib64/qt5/./mkspecs/linux-g++ -isystem /usr/include/qt5/QtNetwork -isystem /usr/include/qt5/QtConcurrent -Wall -Wextra -pedantic -Wno-long-long -std=c++0x -Wpedantic -fPIC -O2 -fwrapv -pipe -Wformat -Werror=format-security -gdwarf-4 -fno-debug-types-section -fvar-tracking-assignments -g2 -Wp,-D_FORTIFY_SOURCE=2 -fstack-protector-strong --param=ssp-buffer-size=4 -fPIC -march=x86-64 -gdwarf-4 -fno-debug-types-section -fvar-tracking-assignments -g2 -DNDEBUG -DQT_NO_DEBUG -fPIC -fPIC -std=gnu++11 -o CMakeFiles/owncloudsync.dir/propagatorjobs.cpp.o -c /tmp/B.LDs7so/BUILD/owncloudclient-2.3.3/src/libsync/propagatorjobs.cpp make[2]: Leaving directory '/tmp/B.LDs7so/BUILD/owncloudclient-2.3.3/build' make[2]: Entering directory '/tmp/B.LDs7so/BUILD/owncloudclient-2.3.3/build' [ 21%] Building CXX object src/libsync/CMakeFiles/owncloudsync.dir/propagatedownload.cpp.o cd /tmp/B.LDs7so/BUILD/owncloudclient-2.3.3/build/src/libsync && /usr/bin/x86_64-pld-linux-g++ -DQT_CONCURRENT_LIB -DQT_CORE_LIB -DQT_DBUS_LIB -DQT_DISABLE_DEPRECATED_BEFORE=0 -DQT_GUI_LIB -DQT_MESSAGELOGCONTEXT -DQT_NETWORK_LIB -DQT_NO_DEBUG -DQT_USE_QSTRINGBUILDER -DQT_WIDGETS_LIB -DUNICODE -DUSE_FDO_NOTIFICATIONS -D_UNICODE -Downcloudsync_EXPORTS -I/tmp/B.LDs7so/BUILD/owncloudclient-2.3.3/build/src/libsync/owncloudsync_autogen/include -I/tmp/B.LDs7so/BUILD/owncloudclient-2.3.3/build -I/tmp/B.LDs7so/BUILD/owncloudclient-2.3.3/src/libsync -I/tmp/B.LDs7so/BUILD/owncloudclient-2.3.3/build/src/libsync -I/tmp/B.LDs7so/BUILD/owncloudclient-2.3.3/csync/src -I/tmp/B.LDs7so/BUILD/owncloudclient-2.3.3/build/csync -I/tmp/B.LDs7so/BUILD/owncloudclient-2.3.3/build/csync/src -I/tmp/B.LDs7so/BUILD/owncloudclient-2.3.3/src/3rdparty/qjson -I/usr/include/qt5keychain -isystem /usr/include/qt5 -isystem /usr/include/qt5/QtWidgets -isystem /usr/include/qt5/QtGui -isystem /usr/include/qt5/QtCore -isystem /usr/lib64/qt5/./mkspecs/linux-g++ -isystem /usr/include/qt5/QtNetwork -isystem /usr/include/qt5/QtConcurrent -Wall -Wextra -pedantic -Wno-long-long -std=c++0x -Wpedantic -fPIC -O2 -fwrapv -pipe -Wformat -Werror=format-security -gdwarf-4 -fno-debug-types-section -fvar-tracking-assignments -g2 -Wp,-D_FORTIFY_SOURCE=2 -fstack-protector-strong --param=ssp-buffer-size=4 -fPIC -march=x86-64 -gdwarf-4 -fno-debug-types-section -fvar-tracking-assignments -g2 -DNDEBUG -DQT_NO_DEBUG -fPIC -fPIC -std=gnu++11 -o CMakeFiles/owncloudsync.dir/propagatedownload.cpp.o -c /tmp/B.LDs7so/BUILD/owncloudclient-2.3.3/src/libsync/propagatedownload.cpp /tmp/B.LDs7so/BUILD/owncloudclient-2.3.3/src/libsync/propagatedownload.cpp: In function 'void OCC::{anonymous}::preserveGroupOwnership(const QString&, const QFileInfo&)': /tmp/B.LDs7so/BUILD/owncloudclient-2.3.3/src/libsync/propagatedownload.cpp:676:10: warning: ignoring return value of 'int chown(const char*, __uid_t, __gid_t)', declared with attribute warn_unused_result [-Wunused-result] chown(fileName.toLocal8Bit().constData(), -1, fi.groupId()); ~~~~~^~~~~~~~~~~~~~~~~~~~~~~~~~~~~~~~~~~~~~~~~~~~~~~~~~~~~~ make[2]: Leaving directory '/tmp/B.LDs7so/BUILD/owncloudclient-2.3.3/build' make[2]: Entering directory '/tmp/B.LDs7so/BUILD/owncloudclient-2.3.3/build' [ 23%] Building CXX object src/libsync/CMakeFiles/owncloudsync.dir/propagateremotedelete.cpp.o cd /tmp/B.LDs7so/BUILD/owncloudclient-2.3.3/build/src/libsync && /usr/bin/x86_64-pld-linux-g++ -DQT_CONCURRENT_LIB -DQT_CORE_LIB -DQT_DBUS_LIB -DQT_DISABLE_DEPRECATED_BEFORE=0 -DQT_GUI_LIB -DQT_MESSAGELOGCONTEXT -DQT_NETWORK_LIB -DQT_NO_DEBUG -DQT_USE_QSTRINGBUILDER -DQT_WIDGETS_LIB -DUNICODE -DUSE_FDO_NOTIFICATIONS -D_UNICODE -Downcloudsync_EXPORTS -I/tmp/B.LDs7so/BUILD/owncloudclient-2.3.3/build/src/libsync/owncloudsync_autogen/include -I/tmp/B.LDs7so/BUILD/owncloudclient-2.3.3/build -I/tmp/B.LDs7so/BUILD/owncloudclient-2.3.3/src/libsync -I/tmp/B.LDs7so/BUILD/owncloudclient-2.3.3/build/src/libsync -I/tmp/B.LDs7so/BUILD/owncloudclient-2.3.3/csync/src -I/tmp/B.LDs7so/BUILD/owncloudclient-2.3.3/build/csync -I/tmp/B.LDs7so/BUILD/owncloudclient-2.3.3/build/csync/src -I/tmp/B.LDs7so/BUILD/owncloudclient-2.3.3/src/3rdparty/qjson -I/usr/include/qt5keychain -isystem /usr/include/qt5 -isystem /usr/include/qt5/QtWidgets -isystem /usr/include/qt5/QtGui -isystem /usr/include/qt5/QtCore -isystem /usr/lib64/qt5/./mkspecs/linux-g++ -isystem /usr/include/qt5/QtNetwork -isystem /usr/include/qt5/QtConcurrent -Wall -Wextra -pedantic -Wno-long-long -std=c++0x -Wpedantic -fPIC -O2 -fwrapv -pipe -Wformat -Werror=format-security -gdwarf-4 -fno-debug-types-section -fvar-tracking-assignments -g2 -Wp,-D_FORTIFY_SOURCE=2 -fstack-protector-strong --param=ssp-buffer-size=4 -fPIC -march=x86-64 -gdwarf-4 -fno-debug-types-section -fvar-tracking-assignments -g2 -DNDEBUG -DQT_NO_DEBUG -fPIC -fPIC -std=gnu++11 -o CMakeFiles/owncloudsync.dir/propagateremotedelete.cpp.o -c /tmp/B.LDs7so/BUILD/owncloudclient-2.3.3/src/libsync/propagateremotedelete.cpp make[2]: Leaving directory '/tmp/B.LDs7so/BUILD/owncloudclient-2.3.3/build' make[2]: Entering directory '/tmp/B.LDs7so/BUILD/owncloudclient-2.3.3/build' [ 21%] Building CXX object src/libsync/CMakeFiles/owncloudsync.dir/propagateupload.cpp.o cd /tmp/B.LDs7so/BUILD/owncloudclient-2.3.3/build/src/libsync && /usr/bin/x86_64-pld-linux-g++ -DQT_CONCURRENT_LIB -DQT_CORE_LIB -DQT_DBUS_LIB -DQT_DISABLE_DEPRECATED_BEFORE=0 -DQT_GUI_LIB -DQT_MESSAGELOGCONTEXT -DQT_NETWORK_LIB -DQT_NO_DEBUG -DQT_USE_QSTRINGBUILDER -DQT_WIDGETS_LIB -DUNICODE -DUSE_FDO_NOTIFICATIONS -D_UNICODE -Downcloudsync_EXPORTS -I/tmp/B.LDs7so/BUILD/owncloudclient-2.3.3/build/src/libsync/owncloudsync_autogen/include -I/tmp/B.LDs7so/BUILD/owncloudclient-2.3.3/build -I/tmp/B.LDs7so/BUILD/owncloudclient-2.3.3/src/libsync -I/tmp/B.LDs7so/BUILD/owncloudclient-2.3.3/build/src/libsync -I/tmp/B.LDs7so/BUILD/owncloudclient-2.3.3/csync/src -I/tmp/B.LDs7so/BUILD/owncloudclient-2.3.3/build/csync -I/tmp/B.LDs7so/BUILD/owncloudclient-2.3.3/build/csync/src -I/tmp/B.LDs7so/BUILD/owncloudclient-2.3.3/src/3rdparty/qjson -I/usr/include/qt5keychain -isystem /usr/include/qt5 -isystem /usr/include/qt5/QtWidgets -isystem /usr/include/qt5/QtGui -isystem /usr/include/qt5/QtCore -isystem /usr/lib64/qt5/./mkspecs/linux-g++ -isystem /usr/include/qt5/QtNetwork -isystem /usr/include/qt5/QtConcurrent -Wall -Wextra -pedantic -Wno-long-long -std=c++0x -Wpedantic -fPIC -O2 -fwrapv -pipe -Wformat -Werror=format-security -gdwarf-4 -fno-debug-types-section -fvar-tracking-assignments -g2 -Wp,-D_FORTIFY_SOURCE=2 -fstack-protector-strong --param=ssp-buffer-size=4 -fPIC -march=x86-64 -gdwarf-4 -fno-debug-types-section -fvar-tracking-assignments -g2 -DNDEBUG -DQT_NO_DEBUG -fPIC -fPIC -std=gnu++11 -o CMakeFiles/owncloudsync.dir/propagateupload.cpp.o -c /tmp/B.LDs7so/BUILD/owncloudclient-2.3.3/src/libsync/propagateupload.cpp make[2]: Leaving directory '/tmp/B.LDs7so/BUILD/owncloudclient-2.3.3/build' make[2]: Entering directory '/tmp/B.LDs7so/BUILD/owncloudclient-2.3.3/build' [ 22%] Building CXX object src/libsync/CMakeFiles/owncloudsync.dir/propagateuploadv1.cpp.o cd /tmp/B.LDs7so/BUILD/owncloudclient-2.3.3/build/src/libsync && /usr/bin/x86_64-pld-linux-g++ -DQT_CONCURRENT_LIB -DQT_CORE_LIB -DQT_DBUS_LIB -DQT_DISABLE_DEPRECATED_BEFORE=0 -DQT_GUI_LIB -DQT_MESSAGELOGCONTEXT -DQT_NETWORK_LIB -DQT_NO_DEBUG -DQT_USE_QSTRINGBUILDER -DQT_WIDGETS_LIB -DUNICODE -DUSE_FDO_NOTIFICATIONS -D_UNICODE -Downcloudsync_EXPORTS -I/tmp/B.LDs7so/BUILD/owncloudclient-2.3.3/build/src/libsync/owncloudsync_autogen/include -I/tmp/B.LDs7so/BUILD/owncloudclient-2.3.3/build -I/tmp/B.LDs7so/BUILD/owncloudclient-2.3.3/src/libsync -I/tmp/B.LDs7so/BUILD/owncloudclient-2.3.3/build/src/libsync -I/tmp/B.LDs7so/BUILD/owncloudclient-2.3.3/csync/src -I/tmp/B.LDs7so/BUILD/owncloudclient-2.3.3/build/csync -I/tmp/B.LDs7so/BUILD/owncloudclient-2.3.3/build/csync/src -I/tmp/B.LDs7so/BUILD/owncloudclient-2.3.3/src/3rdparty/qjson -I/usr/include/qt5keychain -isystem /usr/include/qt5 -isystem /usr/include/qt5/QtWidgets -isystem /usr/include/qt5/QtGui -isystem /usr/include/qt5/QtCore -isystem /usr/lib64/qt5/./mkspecs/linux-g++ -isystem /usr/include/qt5/QtNetwork -isystem /usr/include/qt5/QtConcurrent -Wall -Wextra -pedantic -Wno-long-long -std=c++0x -Wpedantic -fPIC -O2 -fwrapv -pipe -Wformat -Werror=format-security -gdwarf-4 -fno-debug-types-section -fvar-tracking-assignments -g2 -Wp,-D_FORTIFY_SOURCE=2 -fstack-protector-strong --param=ssp-buffer-size=4 -fPIC -march=x86-64 -gdwarf-4 -fno-debug-types-section -fvar-tracking-assignments -g2 -DNDEBUG -DQT_NO_DEBUG -fPIC -fPIC -std=gnu++11 -o CMakeFiles/owncloudsync.dir/propagateuploadv1.cpp.o -c /tmp/B.LDs7so/BUILD/owncloudclient-2.3.3/src/libsync/propagateuploadv1.cpp make[2]: Leaving directory '/tmp/B.LDs7so/BUILD/owncloudclient-2.3.3/build' make[2]: Entering directory '/tmp/B.LDs7so/BUILD/owncloudclient-2.3.3/build' [ 22%] Building CXX object src/libsync/CMakeFiles/owncloudsync.dir/propagateuploadng.cpp.o cd /tmp/B.LDs7so/BUILD/owncloudclient-2.3.3/build/src/libsync && /usr/bin/x86_64-pld-linux-g++ -DQT_CONCURRENT_LIB -DQT_CORE_LIB -DQT_DBUS_LIB -DQT_DISABLE_DEPRECATED_BEFORE=0 -DQT_GUI_LIB -DQT_MESSAGELOGCONTEXT -DQT_NETWORK_LIB -DQT_NO_DEBUG -DQT_USE_QSTRINGBUILDER -DQT_WIDGETS_LIB -DUNICODE -DUSE_FDO_NOTIFICATIONS -D_UNICODE -Downcloudsync_EXPORTS -I/tmp/B.LDs7so/BUILD/owncloudclient-2.3.3/build/src/libsync/owncloudsync_autogen/include -I/tmp/B.LDs7so/BUILD/owncloudclient-2.3.3/build -I/tmp/B.LDs7so/BUILD/owncloudclient-2.3.3/src/libsync -I/tmp/B.LDs7so/BUILD/owncloudclient-2.3.3/build/src/libsync -I/tmp/B.LDs7so/BUILD/owncloudclient-2.3.3/csync/src -I/tmp/B.LDs7so/BUILD/owncloudclient-2.3.3/build/csync -I/tmp/B.LDs7so/BUILD/owncloudclient-2.3.3/build/csync/src -I/tmp/B.LDs7so/BUILD/owncloudclient-2.3.3/src/3rdparty/qjson -I/usr/include/qt5keychain -isystem /usr/include/qt5 -isystem /usr/include/qt5/QtWidgets -isystem /usr/include/qt5/QtGui -isystem /usr/include/qt5/QtCore -isystem /usr/lib64/qt5/./mkspecs/linux-g++ -isystem /usr/include/qt5/QtNetwork -isystem /usr/include/qt5/QtConcurrent -Wall -Wextra -pedantic -Wno-long-long -std=c++0x -Wpedantic -fPIC -O2 -fwrapv -pipe -Wformat -Werror=format-security -gdwarf-4 -fno-debug-types-section -fvar-tracking-assignments -g2 -Wp,-D_FORTIFY_SOURCE=2 -fstack-protector-strong --param=ssp-buffer-size=4 -fPIC -march=x86-64 -gdwarf-4 -fno-debug-types-section -fvar-tracking-assignments -g2 -DNDEBUG -DQT_NO_DEBUG -fPIC -fPIC -std=gnu++11 -o CMakeFiles/owncloudsync.dir/propagateuploadng.cpp.o -c /tmp/B.LDs7so/BUILD/owncloudclient-2.3.3/src/libsync/propagateuploadng.cpp make[2]: Leaving directory '/tmp/B.LDs7so/BUILD/owncloudclient-2.3.3/build' make[2]: Entering directory '/tmp/B.LDs7so/BUILD/owncloudclient-2.3.3/build' [ 24%] Building CXX object src/libsync/CMakeFiles/owncloudsync.dir/syncfilestatus.cpp.o cd /tmp/B.LDs7so/BUILD/owncloudclient-2.3.3/build/src/libsync && /usr/bin/x86_64-pld-linux-g++ -DQT_CONCURRENT_LIB -DQT_CORE_LIB -DQT_DBUS_LIB -DQT_DISABLE_DEPRECATED_BEFORE=0 -DQT_GUI_LIB -DQT_MESSAGELOGCONTEXT -DQT_NETWORK_LIB -DQT_NO_DEBUG -DQT_USE_QSTRINGBUILDER -DQT_WIDGETS_LIB -DUNICODE -DUSE_FDO_NOTIFICATIONS -D_UNICODE -Downcloudsync_EXPORTS -I/tmp/B.LDs7so/BUILD/owncloudclient-2.3.3/build/src/libsync/owncloudsync_autogen/include -I/tmp/B.LDs7so/BUILD/owncloudclient-2.3.3/build -I/tmp/B.LDs7so/BUILD/owncloudclient-2.3.3/src/libsync -I/tmp/B.LDs7so/BUILD/owncloudclient-2.3.3/build/src/libsync -I/tmp/B.LDs7so/BUILD/owncloudclient-2.3.3/csync/src -I/tmp/B.LDs7so/BUILD/owncloudclient-2.3.3/build/csync -I/tmp/B.LDs7so/BUILD/owncloudclient-2.3.3/build/csync/src -I/tmp/B.LDs7so/BUILD/owncloudclient-2.3.3/src/3rdparty/qjson -I/usr/include/qt5keychain -isystem /usr/include/qt5 -isystem /usr/include/qt5/QtWidgets -isystem /usr/include/qt5/QtGui -isystem /usr/include/qt5/QtCore -isystem /usr/lib64/qt5/./mkspecs/linux-g++ -isystem /usr/include/qt5/QtNetwork -isystem /usr/include/qt5/QtConcurrent -Wall -Wextra -pedantic -Wno-long-long -std=c++0x -Wpedantic -fPIC -O2 -fwrapv -pipe -Wformat -Werror=format-security -gdwarf-4 -fno-debug-types-section -fvar-tracking-assignments -g2 -Wp,-D_FORTIFY_SOURCE=2 -fstack-protector-strong --param=ssp-buffer-size=4 -fPIC -march=x86-64 -gdwarf-4 -fno-debug-types-section -fvar-tracking-assignments -g2 -DNDEBUG -DQT_NO_DEBUG -fPIC -fPIC -std=gnu++11 -o CMakeFiles/owncloudsync.dir/syncfilestatus.cpp.o -c /tmp/B.LDs7so/BUILD/owncloudclient-2.3.3/src/libsync/syncfilestatus.cpp make[2]: Leaving directory '/tmp/B.LDs7so/BUILD/owncloudclient-2.3.3/build' make[2]: Entering directory '/tmp/B.LDs7so/BUILD/owncloudclient-2.3.3/build' [ 23%] Building CXX object src/libsync/CMakeFiles/owncloudsync.dir/propagateremotemkdir.cpp.o cd /tmp/B.LDs7so/BUILD/owncloudclient-2.3.3/build/src/libsync && /usr/bin/x86_64-pld-linux-g++ -DQT_CONCURRENT_LIB -DQT_CORE_LIB -DQT_DBUS_LIB -DQT_DISABLE_DEPRECATED_BEFORE=0 -DQT_GUI_LIB -DQT_MESSAGELOGCONTEXT -DQT_NETWORK_LIB -DQT_NO_DEBUG -DQT_USE_QSTRINGBUILDER -DQT_WIDGETS_LIB -DUNICODE -DUSE_FDO_NOTIFICATIONS -D_UNICODE -Downcloudsync_EXPORTS -I/tmp/B.LDs7so/BUILD/owncloudclient-2.3.3/build/src/libsync/owncloudsync_autogen/include -I/tmp/B.LDs7so/BUILD/owncloudclient-2.3.3/build -I/tmp/B.LDs7so/BUILD/owncloudclient-2.3.3/src/libsync -I/tmp/B.LDs7so/BUILD/owncloudclient-2.3.3/build/src/libsync -I/tmp/B.LDs7so/BUILD/owncloudclient-2.3.3/csync/src -I/tmp/B.LDs7so/BUILD/owncloudclient-2.3.3/build/csync -I/tmp/B.LDs7so/BUILD/owncloudclient-2.3.3/build/csync/src -I/tmp/B.LDs7so/BUILD/owncloudclient-2.3.3/src/3rdparty/qjson -I/usr/include/qt5keychain -isystem /usr/include/qt5 -isystem /usr/include/qt5/QtWidgets -isystem /usr/include/qt5/QtGui -isystem /usr/include/qt5/QtCore -isystem /usr/lib64/qt5/./mkspecs/linux-g++ -isystem /usr/include/qt5/QtNetwork -isystem /usr/include/qt5/QtConcurrent -Wall -Wextra -pedantic -Wno-long-long -std=c++0x -Wpedantic -fPIC -O2 -fwrapv -pipe -Wformat -Werror=format-security -gdwarf-4 -fno-debug-types-section -fvar-tracking-assignments -g2 -Wp,-D_FORTIFY_SOURCE=2 -fstack-protector-strong --param=ssp-buffer-size=4 -fPIC -march=x86-64 -gdwarf-4 -fno-debug-types-section -fvar-tracking-assignments -g2 -DNDEBUG -DQT_NO_DEBUG -fPIC -fPIC -std=gnu++11 -o CMakeFiles/owncloudsync.dir/propagateremotemkdir.cpp.o -c /tmp/B.LDs7so/BUILD/owncloudclient-2.3.3/src/libsync/propagateremotemkdir.cpp make[2]: Leaving directory '/tmp/B.LDs7so/BUILD/owncloudclient-2.3.3/build' make[2]: Entering directory '/tmp/B.LDs7so/BUILD/owncloudclient-2.3.3/build' [ 23%] Building CXX object src/libsync/CMakeFiles/owncloudsync.dir/propagateremotemove.cpp.o cd /tmp/B.LDs7so/BUILD/owncloudclient-2.3.3/build/src/libsync && /usr/bin/x86_64-pld-linux-g++ -DQT_CONCURRENT_LIB -DQT_CORE_LIB -DQT_DBUS_LIB -DQT_DISABLE_DEPRECATED_BEFORE=0 -DQT_GUI_LIB -DQT_MESSAGELOGCONTEXT -DQT_NETWORK_LIB -DQT_NO_DEBUG -DQT_USE_QSTRINGBUILDER -DQT_WIDGETS_LIB -DUNICODE -DUSE_FDO_NOTIFICATIONS -D_UNICODE -Downcloudsync_EXPORTS -I/tmp/B.LDs7so/BUILD/owncloudclient-2.3.3/build/src/libsync/owncloudsync_autogen/include -I/tmp/B.LDs7so/BUILD/owncloudclient-2.3.3/build -I/tmp/B.LDs7so/BUILD/owncloudclient-2.3.3/src/libsync -I/tmp/B.LDs7so/BUILD/owncloudclient-2.3.3/build/src/libsync -I/tmp/B.LDs7so/BUILD/owncloudclient-2.3.3/csync/src -I/tmp/B.LDs7so/BUILD/owncloudclient-2.3.3/build/csync -I/tmp/B.LDs7so/BUILD/owncloudclient-2.3.3/build/csync/src -I/tmp/B.LDs7so/BUILD/owncloudclient-2.3.3/src/3rdparty/qjson -I/usr/include/qt5keychain -isystem /usr/include/qt5 -isystem /usr/include/qt5/QtWidgets -isystem /usr/include/qt5/QtGui -isystem /usr/include/qt5/QtCore -isystem /usr/lib64/qt5/./mkspecs/linux-g++ -isystem /usr/include/qt5/QtNetwork -isystem /usr/include/qt5/QtConcurrent -Wall -Wextra -pedantic -Wno-long-long -std=c++0x -Wpedantic -fPIC -O2 -fwrapv -pipe -Wformat -Werror=format-security -gdwarf-4 -fno-debug-types-section -fvar-tracking-assignments -g2 -Wp,-D_FORTIFY_SOURCE=2 -fstack-protector-strong --param=ssp-buffer-size=4 -fPIC -march=x86-64 -gdwarf-4 -fno-debug-types-section -fvar-tracking-assignments -g2 -DNDEBUG -DQT_NO_DEBUG -fPIC -fPIC -std=gnu++11 -o CMakeFiles/owncloudsync.dir/propagateremotemove.cpp.o -c /tmp/B.LDs7so/BUILD/owncloudclient-2.3.3/src/libsync/propagateremotemove.cpp make[2]: Leaving directory '/tmp/B.LDs7so/BUILD/owncloudclient-2.3.3/build' make[2]: Entering directory '/tmp/B.LDs7so/BUILD/owncloudclient-2.3.3/build' [ 25%] Building CXX object src/libsync/CMakeFiles/owncloudsync.dir/syncfilestatustracker.cpp.o cd /tmp/B.LDs7so/BUILD/owncloudclient-2.3.3/build/src/libsync && /usr/bin/x86_64-pld-linux-g++ -DQT_CONCURRENT_LIB -DQT_CORE_LIB -DQT_DBUS_LIB -DQT_DISABLE_DEPRECATED_BEFORE=0 -DQT_GUI_LIB -DQT_MESSAGELOGCONTEXT -DQT_NETWORK_LIB -DQT_NO_DEBUG -DQT_USE_QSTRINGBUILDER -DQT_WIDGETS_LIB -DUNICODE -DUSE_FDO_NOTIFICATIONS -D_UNICODE -Downcloudsync_EXPORTS -I/tmp/B.LDs7so/BUILD/owncloudclient-2.3.3/build/src/libsync/owncloudsync_autogen/include -I/tmp/B.LDs7so/BUILD/owncloudclient-2.3.3/build -I/tmp/B.LDs7so/BUILD/owncloudclient-2.3.3/src/libsync -I/tmp/B.LDs7so/BUILD/owncloudclient-2.3.3/build/src/libsync -I/tmp/B.LDs7so/BUILD/owncloudclient-2.3.3/csync/src -I/tmp/B.LDs7so/BUILD/owncloudclient-2.3.3/build/csync -I/tmp/B.LDs7so/BUILD/owncloudclient-2.3.3/build/csync/src -I/tmp/B.LDs7so/BUILD/owncloudclient-2.3.3/src/3rdparty/qjson -I/usr/include/qt5keychain -isystem /usr/include/qt5 -isystem /usr/include/qt5/QtWidgets -isystem /usr/include/qt5/QtGui -isystem /usr/include/qt5/QtCore -isystem /usr/lib64/qt5/./mkspecs/linux-g++ -isystem /usr/include/qt5/QtNetwork -isystem /usr/include/qt5/QtConcurrent -Wall -Wextra -pedantic -Wno-long-long -std=c++0x -Wpedantic -fPIC -O2 -fwrapv -pipe -Wformat -Werror=format-security -gdwarf-4 -fno-debug-types-section -fvar-tracking-assignments -g2 -Wp,-D_FORTIFY_SOURCE=2 -fstack-protector-strong --param=ssp-buffer-size=4 -fPIC -march=x86-64 -gdwarf-4 -fno-debug-types-section -fvar-tracking-assignments -g2 -DNDEBUG -DQT_NO_DEBUG -fPIC -fPIC -std=gnu++11 -o CMakeFiles/owncloudsync.dir/syncfilestatustracker.cpp.o -c /tmp/B.LDs7so/BUILD/owncloudclient-2.3.3/src/libsync/syncfilestatustracker.cpp make[2]: Leaving directory '/tmp/B.LDs7so/BUILD/owncloudclient-2.3.3/build' make[2]: Entering directory '/tmp/B.LDs7so/BUILD/owncloudclient-2.3.3/build' [ 26%] Building CXX object src/libsync/CMakeFiles/owncloudsync.dir/syncjournalfilerecord.cpp.o cd /tmp/B.LDs7so/BUILD/owncloudclient-2.3.3/build/src/libsync && /usr/bin/x86_64-pld-linux-g++ -DQT_CONCURRENT_LIB -DQT_CORE_LIB -DQT_DBUS_LIB -DQT_DISABLE_DEPRECATED_BEFORE=0 -DQT_GUI_LIB -DQT_MESSAGELOGCONTEXT -DQT_NETWORK_LIB -DQT_NO_DEBUG -DQT_USE_QSTRINGBUILDER -DQT_WIDGETS_LIB -DUNICODE -DUSE_FDO_NOTIFICATIONS -D_UNICODE -Downcloudsync_EXPORTS -I/tmp/B.LDs7so/BUILD/owncloudclient-2.3.3/build/src/libsync/owncloudsync_autogen/include -I/tmp/B.LDs7so/BUILD/owncloudclient-2.3.3/build -I/tmp/B.LDs7so/BUILD/owncloudclient-2.3.3/src/libsync -I/tmp/B.LDs7so/BUILD/owncloudclient-2.3.3/build/src/libsync -I/tmp/B.LDs7so/BUILD/owncloudclient-2.3.3/csync/src -I/tmp/B.LDs7so/BUILD/owncloudclient-2.3.3/build/csync -I/tmp/B.LDs7so/BUILD/owncloudclient-2.3.3/build/csync/src -I/tmp/B.LDs7so/BUILD/owncloudclient-2.3.3/src/3rdparty/qjson -I/usr/include/qt5keychain -isystem /usr/include/qt5 -isystem /usr/include/qt5/QtWidgets -isystem /usr/include/qt5/QtGui -isystem /usr/include/qt5/QtCore -isystem /usr/lib64/qt5/./mkspecs/linux-g++ -isystem /usr/include/qt5/QtNetwork -isystem /usr/include/qt5/QtConcurrent -Wall -Wextra -pedantic -Wno-long-long -std=c++0x -Wpedantic -fPIC -O2 -fwrapv -pipe -Wformat -Werror=format-security -gdwarf-4 -fno-debug-types-section -fvar-tracking-assignments -g2 -Wp,-D_FORTIFY_SOURCE=2 -fstack-protector-strong --param=ssp-buffer-size=4 -fPIC -march=x86-64 -gdwarf-4 -fno-debug-types-section -fvar-tracking-assignments -g2 -DNDEBUG -DQT_NO_DEBUG -fPIC -fPIC -std=gnu++11 -o CMakeFiles/owncloudsync.dir/syncjournalfilerecord.cpp.o -c /tmp/B.LDs7so/BUILD/owncloudclient-2.3.3/src/libsync/syncjournalfilerecord.cpp make[2]: Leaving directory '/tmp/B.LDs7so/BUILD/owncloudclient-2.3.3/build' make[2]: Entering directory '/tmp/B.LDs7so/BUILD/owncloudclient-2.3.3/build' [ 26%] Building CXX object src/libsync/CMakeFiles/owncloudsync.dir/syncresult.cpp.o cd /tmp/B.LDs7so/BUILD/owncloudclient-2.3.3/build/src/libsync && /usr/bin/x86_64-pld-linux-g++ -DQT_CONCURRENT_LIB -DQT_CORE_LIB -DQT_DBUS_LIB -DQT_DISABLE_DEPRECATED_BEFORE=0 -DQT_GUI_LIB -DQT_MESSAGELOGCONTEXT -DQT_NETWORK_LIB -DQT_NO_DEBUG -DQT_USE_QSTRINGBUILDER -DQT_WIDGETS_LIB -DUNICODE -DUSE_FDO_NOTIFICATIONS -D_UNICODE -Downcloudsync_EXPORTS -I/tmp/B.LDs7so/BUILD/owncloudclient-2.3.3/build/src/libsync/owncloudsync_autogen/include -I/tmp/B.LDs7so/BUILD/owncloudclient-2.3.3/build -I/tmp/B.LDs7so/BUILD/owncloudclient-2.3.3/src/libsync -I/tmp/B.LDs7so/BUILD/owncloudclient-2.3.3/build/src/libsync -I/tmp/B.LDs7so/BUILD/owncloudclient-2.3.3/csync/src -I/tmp/B.LDs7so/BUILD/owncloudclient-2.3.3/build/csync -I/tmp/B.LDs7so/BUILD/owncloudclient-2.3.3/build/csync/src -I/tmp/B.LDs7so/BUILD/owncloudclient-2.3.3/src/3rdparty/qjson -I/usr/include/qt5keychain -isystem /usr/include/qt5 -isystem /usr/include/qt5/QtWidgets -isystem /usr/include/qt5/QtGui -isystem /usr/include/qt5/QtCore -isystem /usr/lib64/qt5/./mkspecs/linux-g++ -isystem /usr/include/qt5/QtNetwork -isystem /usr/include/qt5/QtConcurrent -Wall -Wextra -pedantic -Wno-long-long -std=c++0x -Wpedantic -fPIC -O2 -fwrapv -pipe -Wformat -Werror=format-security -gdwarf-4 -fno-debug-types-section -fvar-tracking-assignments -g2 -Wp,-D_FORTIFY_SOURCE=2 -fstack-protector-strong --param=ssp-buffer-size=4 -fPIC -march=x86-64 -gdwarf-4 -fno-debug-types-section -fvar-tracking-assignments -g2 -DNDEBUG -DQT_NO_DEBUG -fPIC -fPIC -std=gnu++11 -o CMakeFiles/owncloudsync.dir/syncresult.cpp.o -c /tmp/B.LDs7so/BUILD/owncloudclient-2.3.3/src/libsync/syncresult.cpp make[2]: Leaving directory '/tmp/B.LDs7so/BUILD/owncloudclient-2.3.3/build' make[2]: Entering directory '/tmp/B.LDs7so/BUILD/owncloudclient-2.3.3/build' [ 25%] Building CXX object src/libsync/CMakeFiles/owncloudsync.dir/syncjournaldb.cpp.o cd /tmp/B.LDs7so/BUILD/owncloudclient-2.3.3/build/src/libsync && /usr/bin/x86_64-pld-linux-g++ -DQT_CONCURRENT_LIB -DQT_CORE_LIB -DQT_DBUS_LIB -DQT_DISABLE_DEPRECATED_BEFORE=0 -DQT_GUI_LIB -DQT_MESSAGELOGCONTEXT -DQT_NETWORK_LIB -DQT_NO_DEBUG -DQT_USE_QSTRINGBUILDER -DQT_WIDGETS_LIB -DUNICODE -DUSE_FDO_NOTIFICATIONS -D_UNICODE -Downcloudsync_EXPORTS -I/tmp/B.LDs7so/BUILD/owncloudclient-2.3.3/build/src/libsync/owncloudsync_autogen/include -I/tmp/B.LDs7so/BUILD/owncloudclient-2.3.3/build -I/tmp/B.LDs7so/BUILD/owncloudclient-2.3.3/src/libsync -I/tmp/B.LDs7so/BUILD/owncloudclient-2.3.3/build/src/libsync -I/tmp/B.LDs7so/BUILD/owncloudclient-2.3.3/csync/src -I/tmp/B.LDs7so/BUILD/owncloudclient-2.3.3/build/csync -I/tmp/B.LDs7so/BUILD/owncloudclient-2.3.3/build/csync/src -I/tmp/B.LDs7so/BUILD/owncloudclient-2.3.3/src/3rdparty/qjson -I/usr/include/qt5keychain -isystem /usr/include/qt5 -isystem /usr/include/qt5/QtWidgets -isystem /usr/include/qt5/QtGui -isystem /usr/include/qt5/QtCore -isystem /usr/lib64/qt5/./mkspecs/linux-g++ -isystem /usr/include/qt5/QtNetwork -isystem /usr/include/qt5/QtConcurrent -Wall -Wextra -pedantic -Wno-long-long -std=c++0x -Wpedantic -fPIC -O2 -fwrapv -pipe -Wformat -Werror=format-security -gdwarf-4 -fno-debug-types-section -fvar-tracking-assignments -g2 -Wp,-D_FORTIFY_SOURCE=2 -fstack-protector-strong --param=ssp-buffer-size=4 -fPIC -march=x86-64 -gdwarf-4 -fno-debug-types-section -fvar-tracking-assignments -g2 -DNDEBUG -DQT_NO_DEBUG -fPIC -fPIC -std=gnu++11 -o CMakeFiles/owncloudsync.dir/syncjournaldb.cpp.o -c /tmp/B.LDs7so/BUILD/owncloudclient-2.3.3/src/libsync/syncjournaldb.cpp In file included from /tmp/B.LDs7so/BUILD/owncloudclient-2.3.3/src/libsync/syncjournaldb.cpp:33:0: /tmp/B.LDs7so/BUILD/owncloudclient-2.3.3/src/libsync/../../csync/src/std/c_jhash.h: In function 'uint64_t c_jhash64(const uint8_t*, uint64_t, uint64_t)': /tmp/B.LDs7so/BUILD/owncloudclient-2.3.3/src/libsync/../../csync/src/std/c_jhash.h:210:15: warning: this statement may fall through [-Wimplicit-fallthrough=] case 23: c+=((uint64_t)k[22]<<56); ~^~~~~~~~~~~~~~~~~~~~~~~ /tmp/B.LDs7so/BUILD/owncloudclient-2.3.3/src/libsync/../../csync/src/std/c_jhash.h:211:5: note: here case 22: c+=((uint64_t)k[21]<<48); ^~~~ /tmp/B.LDs7so/BUILD/owncloudclient-2.3.3/src/libsync/../../csync/src/std/c_jhash.h:211:15: warning: this statement may fall through [-Wimplicit-fallthrough=] case 22: c+=((uint64_t)k[21]<<48); ~^~~~~~~~~~~~~~~~~~~~~~~ /tmp/B.LDs7so/BUILD/owncloudclient-2.3.3/src/libsync/../../csync/src/std/c_jhash.h:212:5: note: here case 21: c+=((uint64_t)k[20]<<40); ^~~~ /tmp/B.LDs7so/BUILD/owncloudclient-2.3.3/src/libsync/../../csync/src/std/c_jhash.h:212:15: warning: this statement may fall through [-Wimplicit-fallthrough=] case 21: c+=((uint64_t)k[20]<<40); ~^~~~~~~~~~~~~~~~~~~~~~~ /tmp/B.LDs7so/BUILD/owncloudclient-2.3.3/src/libsync/../../csync/src/std/c_jhash.h:213:5: note: here case 20: c+=((uint64_t)k[19]<<32); ^~~~ /tmp/B.LDs7so/BUILD/owncloudclient-2.3.3/src/libsync/../../csync/src/std/c_jhash.h:213:15: warning: this statement may fall through [-Wimplicit-fallthrough=] case 20: c+=((uint64_t)k[19]<<32); ~^~~~~~~~~~~~~~~~~~~~~~~ /tmp/B.LDs7so/BUILD/owncloudclient-2.3.3/src/libsync/../../csync/src/std/c_jhash.h:214:5: note: here case 19: c+=((uint64_t)k[18]<<24); ^~~~ /tmp/B.LDs7so/BUILD/owncloudclient-2.3.3/src/libsync/../../csync/src/std/c_jhash.h:214:15: warning: this statement may fall through [-Wimplicit-fallthrough=] case 19: c+=((uint64_t)k[18]<<24); ~^~~~~~~~~~~~~~~~~~~~~~~ /tmp/B.LDs7so/BUILD/owncloudclient-2.3.3/src/libsync/../../csync/src/std/c_jhash.h:215:5: note: here case 18: c+=((uint64_t)k[17]<<16); ^~~~ /tmp/B.LDs7so/BUILD/owncloudclient-2.3.3/src/libsync/../../csync/src/std/c_jhash.h:215:15: warning: this statement may fall through [-Wimplicit-fallthrough=] case 18: c+=((uint64_t)k[17]<<16); ~^~~~~~~~~~~~~~~~~~~~~~~ /tmp/B.LDs7so/BUILD/owncloudclient-2.3.3/src/libsync/../../csync/src/std/c_jhash.h:216:5: note: here case 17: c+=((uint64_t)k[16]<<8); ^~~~ /tmp/B.LDs7so/BUILD/owncloudclient-2.3.3/src/libsync/../../csync/src/std/c_jhash.h:216:15: warning: this statement may fall through [-Wimplicit-fallthrough=] case 17: c+=((uint64_t)k[16]<<8); ~^~~~~~~~~~~~~~~~~~~~~~ /tmp/B.LDs7so/BUILD/owncloudclient-2.3.3/src/libsync/../../csync/src/std/c_jhash.h:218:5: note: here case 16: b+=((uint64_t)k[15]<<56); ^~~~ /tmp/B.LDs7so/BUILD/owncloudclient-2.3.3/src/libsync/../../csync/src/std/c_jhash.h:218:15: warning: this statement may fall through [-Wimplicit-fallthrough=] case 16: b+=((uint64_t)k[15]<<56); ~^~~~~~~~~~~~~~~~~~~~~~~ /tmp/B.LDs7so/BUILD/owncloudclient-2.3.3/src/libsync/../../csync/src/std/c_jhash.h:219:5: note: here case 15: b+=((uint64_t)k[14]<<48); ^~~~ /tmp/B.LDs7so/BUILD/owncloudclient-2.3.3/src/libsync/../../csync/src/std/c_jhash.h:219:15: warning: this statement may fall through [-Wimplicit-fallthrough=] case 15: b+=((uint64_t)k[14]<<48); ~^~~~~~~~~~~~~~~~~~~~~~~ /tmp/B.LDs7so/BUILD/owncloudclient-2.3.3/src/libsync/../../csync/src/std/c_jhash.h:220:5: note: here case 14: b+=((uint64_t)k[13]<<40); ^~~~ /tmp/B.LDs7so/BUILD/owncloudclient-2.3.3/src/libsync/../../csync/src/std/c_jhash.h:220:15: warning: this statement may fall through [-Wimplicit-fallthrough=] case 14: b+=((uint64_t)k[13]<<40); ~^~~~~~~~~~~~~~~~~~~~~~~ /tmp/B.LDs7so/BUILD/owncloudclient-2.3.3/src/libsync/../../csync/src/std/c_jhash.h:221:5: note: here case 13: b+=((uint64_t)k[12]<<32); ^~~~ /tmp/B.LDs7so/BUILD/owncloudclient-2.3.3/src/libsync/../../csync/src/std/c_jhash.h:221:15: warning: this statement may fall through [-Wimplicit-fallthrough=] case 13: b+=((uint64_t)k[12]<<32); ~^~~~~~~~~~~~~~~~~~~~~~~ /tmp/B.LDs7so/BUILD/owncloudclient-2.3.3/src/libsync/../../csync/src/std/c_jhash.h:222:5: note: here case 12: b+=((uint64_t)k[11]<<24); ^~~~ /tmp/B.LDs7so/BUILD/owncloudclient-2.3.3/src/libsync/../../csync/src/std/c_jhash.h:222:15: warning: this statement may fall through [-Wimplicit-fallthrough=] case 12: b+=((uint64_t)k[11]<<24); ~^~~~~~~~~~~~~~~~~~~~~~~ /tmp/B.LDs7so/BUILD/owncloudclient-2.3.3/src/libsync/../../csync/src/std/c_jhash.h:223:5: note: here case 11: b+=((uint64_t)k[10]<<16); ^~~~ /tmp/B.LDs7so/BUILD/owncloudclient-2.3.3/src/libsync/../../csync/src/std/c_jhash.h:223:15: warning: this statement may fall through [-Wimplicit-fallthrough=] case 11: b+=((uint64_t)k[10]<<16); ~^~~~~~~~~~~~~~~~~~~~~~~ /tmp/B.LDs7so/BUILD/owncloudclient-2.3.3/src/libsync/../../csync/src/std/c_jhash.h:224:5: note: here case 10: b+=((uint64_t)k[ 9]<<8); ^~~~ /tmp/B.LDs7so/BUILD/owncloudclient-2.3.3/src/libsync/../../csync/src/std/c_jhash.h:224:15: warning: this statement may fall through [-Wimplicit-fallthrough=] case 10: b+=((uint64_t)k[ 9]<<8); ~^~~~~~~~~~~~~~~~~~~~~~ /tmp/B.LDs7so/BUILD/owncloudclient-2.3.3/src/libsync/../../csync/src/std/c_jhash.h:225:5: note: here case 9: b+=((uint64_t)k[ 8]); ^~~~ /tmp/B.LDs7so/BUILD/owncloudclient-2.3.3/src/libsync/../../csync/src/std/c_jhash.h:225:15: warning: this statement may fall through [-Wimplicit-fallthrough=] case 9: b+=((uint64_t)k[ 8]); ~^~~~~~~~~~~~~~~~~~~ /tmp/B.LDs7so/BUILD/owncloudclient-2.3.3/src/libsync/../../csync/src/std/c_jhash.h:226:5: note: here case 8: a+=((uint64_t)k[ 7]<<56); ^~~~ /tmp/B.LDs7so/BUILD/owncloudclient-2.3.3/src/libsync/../../csync/src/std/c_jhash.h:226:15: warning: this statement may fall through [-Wimplicit-fallthrough=] case 8: a+=((uint64_t)k[ 7]<<56); ~^~~~~~~~~~~~~~~~~~~~~~~ /tmp/B.LDs7so/BUILD/owncloudclient-2.3.3/src/libsync/../../csync/src/std/c_jhash.h:227:5: note: here case 7: a+=((uint64_t)k[ 6]<<48); ^~~~ /tmp/B.LDs7so/BUILD/owncloudclient-2.3.3/src/libsync/../../csync/src/std/c_jhash.h:227:15: warning: this statement may fall through [-Wimplicit-fallthrough=] case 7: a+=((uint64_t)k[ 6]<<48); ~^~~~~~~~~~~~~~~~~~~~~~~ /tmp/B.LDs7so/BUILD/owncloudclient-2.3.3/src/libsync/../../csync/src/std/c_jhash.h:228:5: note: here case 6: a+=((uint64_t)k[ 5]<<40); ^~~~ /tmp/B.LDs7so/BUILD/owncloudclient-2.3.3/src/libsync/../../csync/src/std/c_jhash.h:228:15: warning: this statement may fall through [-Wimplicit-fallthrough=] case 6: a+=((uint64_t)k[ 5]<<40); ~^~~~~~~~~~~~~~~~~~~~~~~ /tmp/B.LDs7so/BUILD/owncloudclient-2.3.3/src/libsync/../../csync/src/std/c_jhash.h:229:5: note: here case 5: a+=((uint64_t)k[ 4]<<32); ^~~~ /tmp/B.LDs7so/BUILD/owncloudclient-2.3.3/src/libsync/../../csync/src/std/c_jhash.h:229:15: warning: this statement may fall through [-Wimplicit-fallthrough=] case 5: a+=((uint64_t)k[ 4]<<32); ~^~~~~~~~~~~~~~~~~~~~~~~ /tmp/B.LDs7so/BUILD/owncloudclient-2.3.3/src/libsync/../../csync/src/std/c_jhash.h:230:5: note: here case 4: a+=((uint64_t)k[ 3]<<24); ^~~~ /tmp/B.LDs7so/BUILD/owncloudclient-2.3.3/src/libsync/../../csync/src/std/c_jhash.h:230:15: warning: this statement may fall through [-Wimplicit-fallthrough=] case 4: a+=((uint64_t)k[ 3]<<24); ~^~~~~~~~~~~~~~~~~~~~~~~ /tmp/B.LDs7so/BUILD/owncloudclient-2.3.3/src/libsync/../../csync/src/std/c_jhash.h:231:5: note: here case 3: a+=((uint64_t)k[ 2]<<16); ^~~~ /tmp/B.LDs7so/BUILD/owncloudclient-2.3.3/src/libsync/../../csync/src/std/c_jhash.h:231:15: warning: this statement may fall through [-Wimplicit-fallthrough=] case 3: a+=((uint64_t)k[ 2]<<16); ~^~~~~~~~~~~~~~~~~~~~~~~ /tmp/B.LDs7so/BUILD/owncloudclient-2.3.3/src/libsync/../../csync/src/std/c_jhash.h:232:5: note: here case 2: a+=((uint64_t)k[ 1]<<8); ^~~~ /tmp/B.LDs7so/BUILD/owncloudclient-2.3.3/src/libsync/../../csync/src/std/c_jhash.h:232:15: warning: this statement may fall through [-Wimplicit-fallthrough=] case 2: a+=((uint64_t)k[ 1]<<8); ~^~~~~~~~~~~~~~~~~~~~~~ /tmp/B.LDs7so/BUILD/owncloudclient-2.3.3/src/libsync/../../csync/src/std/c_jhash.h:233:5: note: here case 1: a+=((uint64_t)k[ 0]); ^~~~ make[2]: Leaving directory '/tmp/B.LDs7so/BUILD/owncloudclient-2.3.3/build' make[2]: Entering directory '/tmp/B.LDs7so/BUILD/owncloudclient-2.3.3/build' [ 24%] Building CXX object src/libsync/CMakeFiles/owncloudsync.dir/syncengine.cpp.o cd /tmp/B.LDs7so/BUILD/owncloudclient-2.3.3/build/src/libsync && /usr/bin/x86_64-pld-linux-g++ -DQT_CONCURRENT_LIB -DQT_CORE_LIB -DQT_DBUS_LIB -DQT_DISABLE_DEPRECATED_BEFORE=0 -DQT_GUI_LIB -DQT_MESSAGELOGCONTEXT -DQT_NETWORK_LIB -DQT_NO_DEBUG -DQT_USE_QSTRINGBUILDER -DQT_WIDGETS_LIB -DUNICODE -DUSE_FDO_NOTIFICATIONS -D_UNICODE -Downcloudsync_EXPORTS -I/tmp/B.LDs7so/BUILD/owncloudclient-2.3.3/build/src/libsync/owncloudsync_autogen/include -I/tmp/B.LDs7so/BUILD/owncloudclient-2.3.3/build -I/tmp/B.LDs7so/BUILD/owncloudclient-2.3.3/src/libsync -I/tmp/B.LDs7so/BUILD/owncloudclient-2.3.3/build/src/libsync -I/tmp/B.LDs7so/BUILD/owncloudclient-2.3.3/csync/src -I/tmp/B.LDs7so/BUILD/owncloudclient-2.3.3/build/csync -I/tmp/B.LDs7so/BUILD/owncloudclient-2.3.3/build/csync/src -I/tmp/B.LDs7so/BUILD/owncloudclient-2.3.3/src/3rdparty/qjson -I/usr/include/qt5keychain -isystem /usr/include/qt5 -isystem /usr/include/qt5/QtWidgets -isystem /usr/include/qt5/QtGui -isystem /usr/include/qt5/QtCore -isystem /usr/lib64/qt5/./mkspecs/linux-g++ -isystem /usr/include/qt5/QtNetwork -isystem /usr/include/qt5/QtConcurrent -Wall -Wextra -pedantic -Wno-long-long -std=c++0x -Wpedantic -fPIC -O2 -fwrapv -pipe -Wformat -Werror=format-security -gdwarf-4 -fno-debug-types-section -fvar-tracking-assignments -g2 -Wp,-D_FORTIFY_SOURCE=2 -fstack-protector-strong --param=ssp-buffer-size=4 -fPIC -march=x86-64 -gdwarf-4 -fno-debug-types-section -fvar-tracking-assignments -g2 -DNDEBUG -DQT_NO_DEBUG -fPIC -fPIC -std=gnu++11 -o CMakeFiles/owncloudsync.dir/syncengine.cpp.o -c /tmp/B.LDs7so/BUILD/owncloudclient-2.3.3/src/libsync/syncengine.cpp make[2]: Leaving directory '/tmp/B.LDs7so/BUILD/owncloudclient-2.3.3/build' make[2]: Entering directory '/tmp/B.LDs7so/BUILD/owncloudclient-2.3.3/build' [ 28%] Building CXX object src/libsync/CMakeFiles/owncloudsync.dir/ownsql.cpp.o cd /tmp/B.LDs7so/BUILD/owncloudclient-2.3.3/build/src/libsync && /usr/bin/x86_64-pld-linux-g++ -DQT_CONCURRENT_LIB -DQT_CORE_LIB -DQT_DBUS_LIB -DQT_DISABLE_DEPRECATED_BEFORE=0 -DQT_GUI_LIB -DQT_MESSAGELOGCONTEXT -DQT_NETWORK_LIB -DQT_NO_DEBUG -DQT_USE_QSTRINGBUILDER -DQT_WIDGETS_LIB -DUNICODE -DUSE_FDO_NOTIFICATIONS -D_UNICODE -Downcloudsync_EXPORTS -I/tmp/B.LDs7so/BUILD/owncloudclient-2.3.3/build/src/libsync/owncloudsync_autogen/include -I/tmp/B.LDs7so/BUILD/owncloudclient-2.3.3/build -I/tmp/B.LDs7so/BUILD/owncloudclient-2.3.3/src/libsync -I/tmp/B.LDs7so/BUILD/owncloudclient-2.3.3/build/src/libsync -I/tmp/B.LDs7so/BUILD/owncloudclient-2.3.3/csync/src -I/tmp/B.LDs7so/BUILD/owncloudclient-2.3.3/build/csync -I/tmp/B.LDs7so/BUILD/owncloudclient-2.3.3/build/csync/src -I/tmp/B.LDs7so/BUILD/owncloudclient-2.3.3/src/3rdparty/qjson -I/usr/include/qt5keychain -isystem /usr/include/qt5 -isystem /usr/include/qt5/QtWidgets -isystem /usr/include/qt5/QtGui -isystem /usr/include/qt5/QtCore -isystem /usr/lib64/qt5/./mkspecs/linux-g++ -isystem /usr/include/qt5/QtNetwork -isystem /usr/include/qt5/QtConcurrent -Wall -Wextra -pedantic -Wno-long-long -std=c++0x -Wpedantic -fPIC -O2 -fwrapv -pipe -Wformat -Werror=format-security -gdwarf-4 -fno-debug-types-section -fvar-tracking-assignments -g2 -Wp,-D_FORTIFY_SOURCE=2 -fstack-protector-strong --param=ssp-buffer-size=4 -fPIC -march=x86-64 -gdwarf-4 -fno-debug-types-section -fvar-tracking-assignments -g2 -DNDEBUG -DQT_NO_DEBUG -fPIC -fPIC -std=gnu++11 -o CMakeFiles/owncloudsync.dir/ownsql.cpp.o -c /tmp/B.LDs7so/BUILD/owncloudclient-2.3.3/src/libsync/ownsql.cpp make[2]: Leaving directory '/tmp/B.LDs7so/BUILD/owncloudclient-2.3.3/build' make[2]: Entering directory '/tmp/B.LDs7so/BUILD/owncloudclient-2.3.3/build' [ 27%] Building CXX object src/libsync/CMakeFiles/owncloudsync.dir/theme.cpp.o cd /tmp/B.LDs7so/BUILD/owncloudclient-2.3.3/build/src/libsync && /usr/bin/x86_64-pld-linux-g++ -DQT_CONCURRENT_LIB -DQT_CORE_LIB -DQT_DBUS_LIB -DQT_DISABLE_DEPRECATED_BEFORE=0 -DQT_GUI_LIB -DQT_MESSAGELOGCONTEXT -DQT_NETWORK_LIB -DQT_NO_DEBUG -DQT_USE_QSTRINGBUILDER -DQT_WIDGETS_LIB -DUNICODE -DUSE_FDO_NOTIFICATIONS -D_UNICODE -Downcloudsync_EXPORTS -I/tmp/B.LDs7so/BUILD/owncloudclient-2.3.3/build/src/libsync/owncloudsync_autogen/include -I/tmp/B.LDs7so/BUILD/owncloudclient-2.3.3/build -I/tmp/B.LDs7so/BUILD/owncloudclient-2.3.3/src/libsync -I/tmp/B.LDs7so/BUILD/owncloudclient-2.3.3/build/src/libsync -I/tmp/B.LDs7so/BUILD/owncloudclient-2.3.3/csync/src -I/tmp/B.LDs7so/BUILD/owncloudclient-2.3.3/build/csync -I/tmp/B.LDs7so/BUILD/owncloudclient-2.3.3/build/csync/src -I/tmp/B.LDs7so/BUILD/owncloudclient-2.3.3/src/3rdparty/qjson -I/usr/include/qt5keychain -isystem /usr/include/qt5 -isystem /usr/include/qt5/QtWidgets -isystem /usr/include/qt5/QtGui -isystem /usr/include/qt5/QtCore -isystem /usr/lib64/qt5/./mkspecs/linux-g++ -isystem /usr/include/qt5/QtNetwork -isystem /usr/include/qt5/QtConcurrent -Wall -Wextra -pedantic -Wno-long-long -std=c++0x -Wpedantic -fPIC -O2 -fwrapv -pipe -Wformat -Werror=format-security -gdwarf-4 -fno-debug-types-section -fvar-tracking-assignments -g2 -Wp,-D_FORTIFY_SOURCE=2 -fstack-protector-strong --param=ssp-buffer-size=4 -fPIC -march=x86-64 -gdwarf-4 -fno-debug-types-section -fvar-tracking-assignments -g2 -DNDEBUG -DQT_NO_DEBUG -fPIC -fPIC -std=gnu++11 -o CMakeFiles/owncloudsync.dir/theme.cpp.o -c /tmp/B.LDs7so/BUILD/owncloudclient-2.3.3/src/libsync/theme.cpp make[2]: Leaving directory '/tmp/B.LDs7so/BUILD/owncloudclient-2.3.3/build' make[2]: Entering directory '/tmp/B.LDs7so/BUILD/owncloudclient-2.3.3/build' [ 29%] Building CXX object src/libsync/CMakeFiles/owncloudsync.dir/excludedfiles.cpp.o cd /tmp/B.LDs7so/BUILD/owncloudclient-2.3.3/build/src/libsync && /usr/bin/x86_64-pld-linux-g++ -DQT_CONCURRENT_LIB -DQT_CORE_LIB -DQT_DBUS_LIB -DQT_DISABLE_DEPRECATED_BEFORE=0 -DQT_GUI_LIB -DQT_MESSAGELOGCONTEXT -DQT_NETWORK_LIB -DQT_NO_DEBUG -DQT_USE_QSTRINGBUILDER -DQT_WIDGETS_LIB -DUNICODE -DUSE_FDO_NOTIFICATIONS -D_UNICODE -Downcloudsync_EXPORTS -I/tmp/B.LDs7so/BUILD/owncloudclient-2.3.3/build/src/libsync/owncloudsync_autogen/include -I/tmp/B.LDs7so/BUILD/owncloudclient-2.3.3/build -I/tmp/B.LDs7so/BUILD/owncloudclient-2.3.3/src/libsync -I/tmp/B.LDs7so/BUILD/owncloudclient-2.3.3/build/src/libsync -I/tmp/B.LDs7so/BUILD/owncloudclient-2.3.3/csync/src -I/tmp/B.LDs7so/BUILD/owncloudclient-2.3.3/build/csync -I/tmp/B.LDs7so/BUILD/owncloudclient-2.3.3/build/csync/src -I/tmp/B.LDs7so/BUILD/owncloudclient-2.3.3/src/3rdparty/qjson -I/usr/include/qt5keychain -isystem /usr/include/qt5 -isystem /usr/include/qt5/QtWidgets -isystem /usr/include/qt5/QtGui -isystem /usr/include/qt5/QtCore -isystem /usr/lib64/qt5/./mkspecs/linux-g++ -isystem /usr/include/qt5/QtNetwork -isystem /usr/include/qt5/QtConcurrent -Wall -Wextra -pedantic -Wno-long-long -std=c++0x -Wpedantic -fPIC -O2 -fwrapv -pipe -Wformat -Werror=format-security -gdwarf-4 -fno-debug-types-section -fvar-tracking-assignments -g2 -Wp,-D_FORTIFY_SOURCE=2 -fstack-protector-strong --param=ssp-buffer-size=4 -fPIC -march=x86-64 -gdwarf-4 -fno-debug-types-section -fvar-tracking-assignments -g2 -DNDEBUG -DQT_NO_DEBUG -fPIC -fPIC -std=gnu++11 -o CMakeFiles/owncloudsync.dir/excludedfiles.cpp.o -c /tmp/B.LDs7so/BUILD/owncloudclient-2.3.3/src/libsync/excludedfiles.cpp make[2]: Leaving directory '/tmp/B.LDs7so/BUILD/owncloudclient-2.3.3/build' make[2]: Entering directory '/tmp/B.LDs7so/BUILD/owncloudclient-2.3.3/build' [ 29%] Building CXX object src/libsync/CMakeFiles/owncloudsync.dir/creds/dummycredentials.cpp.o cd /tmp/B.LDs7so/BUILD/owncloudclient-2.3.3/build/src/libsync && /usr/bin/x86_64-pld-linux-g++ -DQT_CONCURRENT_LIB -DQT_CORE_LIB -DQT_DBUS_LIB -DQT_DISABLE_DEPRECATED_BEFORE=0 -DQT_GUI_LIB -DQT_MESSAGELOGCONTEXT -DQT_NETWORK_LIB -DQT_NO_DEBUG -DQT_USE_QSTRINGBUILDER -DQT_WIDGETS_LIB -DUNICODE -DUSE_FDO_NOTIFICATIONS -D_UNICODE -Downcloudsync_EXPORTS -I/tmp/B.LDs7so/BUILD/owncloudclient-2.3.3/build/src/libsync/owncloudsync_autogen/include -I/tmp/B.LDs7so/BUILD/owncloudclient-2.3.3/build -I/tmp/B.LDs7so/BUILD/owncloudclient-2.3.3/src/libsync -I/tmp/B.LDs7so/BUILD/owncloudclient-2.3.3/build/src/libsync -I/tmp/B.LDs7so/BUILD/owncloudclient-2.3.3/csync/src -I/tmp/B.LDs7so/BUILD/owncloudclient-2.3.3/build/csync -I/tmp/B.LDs7so/BUILD/owncloudclient-2.3.3/build/csync/src -I/tmp/B.LDs7so/BUILD/owncloudclient-2.3.3/src/3rdparty/qjson -I/usr/include/qt5keychain -isystem /usr/include/qt5 -isystem /usr/include/qt5/QtWidgets -isystem /usr/include/qt5/QtGui -isystem /usr/include/qt5/QtCore -isystem /usr/lib64/qt5/./mkspecs/linux-g++ -isystem /usr/include/qt5/QtNetwork -isystem /usr/include/qt5/QtConcurrent -Wall -Wextra -pedantic -Wno-long-long -std=c++0x -Wpedantic -fPIC -O2 -fwrapv -pipe -Wformat -Werror=format-security -gdwarf-4 -fno-debug-types-section -fvar-tracking-assignments -g2 -Wp,-D_FORTIFY_SOURCE=2 -fstack-protector-strong --param=ssp-buffer-size=4 -fPIC -march=x86-64 -gdwarf-4 -fno-debug-types-section -fvar-tracking-assignments -g2 -DNDEBUG -DQT_NO_DEBUG -fPIC -fPIC -std=gnu++11 -o CMakeFiles/owncloudsync.dir/creds/dummycredentials.cpp.o -c /tmp/B.LDs7so/BUILD/owncloudclient-2.3.3/src/libsync/creds/dummycredentials.cpp make[2]: Leaving directory '/tmp/B.LDs7so/BUILD/owncloudclient-2.3.3/build' make[2]: Entering directory '/tmp/B.LDs7so/BUILD/owncloudclient-2.3.3/build' [ 27%] Building CXX object src/libsync/CMakeFiles/owncloudsync.dir/utility.cpp.o cd /tmp/B.LDs7so/BUILD/owncloudclient-2.3.3/build/src/libsync && /usr/bin/x86_64-pld-linux-g++ -DQT_CONCURRENT_LIB -DQT_CORE_LIB -DQT_DBUS_LIB -DQT_DISABLE_DEPRECATED_BEFORE=0 -DQT_GUI_LIB -DQT_MESSAGELOGCONTEXT -DQT_NETWORK_LIB -DQT_NO_DEBUG -DQT_USE_QSTRINGBUILDER -DQT_WIDGETS_LIB -DUNICODE -DUSE_FDO_NOTIFICATIONS -D_UNICODE -Downcloudsync_EXPORTS -I/tmp/B.LDs7so/BUILD/owncloudclient-2.3.3/build/src/libsync/owncloudsync_autogen/include -I/tmp/B.LDs7so/BUILD/owncloudclient-2.3.3/build -I/tmp/B.LDs7so/BUILD/owncloudclient-2.3.3/src/libsync -I/tmp/B.LDs7so/BUILD/owncloudclient-2.3.3/build/src/libsync -I/tmp/B.LDs7so/BUILD/owncloudclient-2.3.3/csync/src -I/tmp/B.LDs7so/BUILD/owncloudclient-2.3.3/build/csync -I/tmp/B.LDs7so/BUILD/owncloudclient-2.3.3/build/csync/src -I/tmp/B.LDs7so/BUILD/owncloudclient-2.3.3/src/3rdparty/qjson -I/usr/include/qt5keychain -isystem /usr/include/qt5 -isystem /usr/include/qt5/QtWidgets -isystem /usr/include/qt5/QtGui -isystem /usr/include/qt5/QtCore -isystem /usr/lib64/qt5/./mkspecs/linux-g++ -isystem /usr/include/qt5/QtNetwork -isystem /usr/include/qt5/QtConcurrent -Wall -Wextra -pedantic -Wno-long-long -std=c++0x -Wpedantic -fPIC -O2 -fwrapv -pipe -Wformat -Werror=format-security -gdwarf-4 -fno-debug-types-section -fvar-tracking-assignments -g2 -Wp,-D_FORTIFY_SOURCE=2 -fstack-protector-strong --param=ssp-buffer-size=4 -fPIC -march=x86-64 -gdwarf-4 -fno-debug-types-section -fvar-tracking-assignments -g2 -DNDEBUG -DQT_NO_DEBUG -fPIC -fPIC -std=gnu++11 -o CMakeFiles/owncloudsync.dir/utility.cpp.o -c /tmp/B.LDs7so/BUILD/owncloudclient-2.3.3/src/libsync/utility.cpp make[2]: Leaving directory '/tmp/B.LDs7so/BUILD/owncloudclient-2.3.3/build' make[2]: Entering directory '/tmp/B.LDs7so/BUILD/owncloudclient-2.3.3/build' [ 28%] Building CXX object src/libsync/CMakeFiles/owncloudsync.dir/checksums.cpp.o cd /tmp/B.LDs7so/BUILD/owncloudclient-2.3.3/build/src/libsync && /usr/bin/x86_64-pld-linux-g++ -DQT_CONCURRENT_LIB -DQT_CORE_LIB -DQT_DBUS_LIB -DQT_DISABLE_DEPRECATED_BEFORE=0 -DQT_GUI_LIB -DQT_MESSAGELOGCONTEXT -DQT_NETWORK_LIB -DQT_NO_DEBUG -DQT_USE_QSTRINGBUILDER -DQT_WIDGETS_LIB -DUNICODE -DUSE_FDO_NOTIFICATIONS -D_UNICODE -Downcloudsync_EXPORTS -I/tmp/B.LDs7so/BUILD/owncloudclient-2.3.3/build/src/libsync/owncloudsync_autogen/include -I/tmp/B.LDs7so/BUILD/owncloudclient-2.3.3/build -I/tmp/B.LDs7so/BUILD/owncloudclient-2.3.3/src/libsync -I/tmp/B.LDs7so/BUILD/owncloudclient-2.3.3/build/src/libsync -I/tmp/B.LDs7so/BUILD/owncloudclient-2.3.3/csync/src -I/tmp/B.LDs7so/BUILD/owncloudclient-2.3.3/build/csync -I/tmp/B.LDs7so/BUILD/owncloudclient-2.3.3/build/csync/src -I/tmp/B.LDs7so/BUILD/owncloudclient-2.3.3/src/3rdparty/qjson -I/usr/include/qt5keychain -isystem /usr/include/qt5 -isystem /usr/include/qt5/QtWidgets -isystem /usr/include/qt5/QtGui -isystem /usr/include/qt5/QtCore -isystem /usr/lib64/qt5/./mkspecs/linux-g++ -isystem /usr/include/qt5/QtNetwork -isystem /usr/include/qt5/QtConcurrent -Wall -Wextra -pedantic -Wno-long-long -std=c++0x -Wpedantic -fPIC -O2 -fwrapv -pipe -Wformat -Werror=format-security -gdwarf-4 -fno-debug-types-section -fvar-tracking-assignments -g2 -Wp,-D_FORTIFY_SOURCE=2 -fstack-protector-strong --param=ssp-buffer-size=4 -fPIC -march=x86-64 -gdwarf-4 -fno-debug-types-section -fvar-tracking-assignments -g2 -DNDEBUG -DQT_NO_DEBUG -fPIC -fPIC -std=gnu++11 -o CMakeFiles/owncloudsync.dir/checksums.cpp.o -c /tmp/B.LDs7so/BUILD/owncloudclient-2.3.3/src/libsync/checksums.cpp make[2]: Leaving directory '/tmp/B.LDs7so/BUILD/owncloudclient-2.3.3/build' make[2]: *** No rule to make target '/usr/lib64/libqt5keychain.so', needed by 'src/libsync/libowncloudsync.so.2.3.3'. Stop. make[2]: *** Waiting for unfinished jobs.... make[2]: Entering directory '/tmp/B.LDs7so/BUILD/owncloudclient-2.3.3/build' [ 30%] Building CXX object src/libsync/CMakeFiles/owncloudsync.dir/creds/abstractcredentials.cpp.o cd /tmp/B.LDs7so/BUILD/owncloudclient-2.3.3/build/src/libsync && /usr/bin/x86_64-pld-linux-g++ -DQT_CONCURRENT_LIB -DQT_CORE_LIB -DQT_DBUS_LIB -DQT_DISABLE_DEPRECATED_BEFORE=0 -DQT_GUI_LIB -DQT_MESSAGELOGCONTEXT -DQT_NETWORK_LIB -DQT_NO_DEBUG -DQT_USE_QSTRINGBUILDER -DQT_WIDGETS_LIB -DUNICODE -DUSE_FDO_NOTIFICATIONS -D_UNICODE -Downcloudsync_EXPORTS -I/tmp/B.LDs7so/BUILD/owncloudclient-2.3.3/build/src/libsync/owncloudsync_autogen/include -I/tmp/B.LDs7so/BUILD/owncloudclient-2.3.3/build -I/tmp/B.LDs7so/BUILD/owncloudclient-2.3.3/src/libsync -I/tmp/B.LDs7so/BUILD/owncloudclient-2.3.3/build/src/libsync -I/tmp/B.LDs7so/BUILD/owncloudclient-2.3.3/csync/src -I/tmp/B.LDs7so/BUILD/owncloudclient-2.3.3/build/csync -I/tmp/B.LDs7so/BUILD/owncloudclient-2.3.3/build/csync/src -I/tmp/B.LDs7so/BUILD/owncloudclient-2.3.3/src/3rdparty/qjson -I/usr/include/qt5keychain -isystem /usr/include/qt5 -isystem /usr/include/qt5/QtWidgets -isystem /usr/include/qt5/QtGui -isystem /usr/include/qt5/QtCore -isystem /usr/lib64/qt5/./mkspecs/linux-g++ -isystem /usr/include/qt5/QtNetwork -isystem /usr/include/qt5/QtConcurrent -Wall -Wextra -pedantic -Wno-long-long -std=c++0x -Wpedantic -fPIC -O2 -fwrapv -pipe -Wformat -Werror=format-security -gdwarf-4 -fno-debug-types-section -fvar-tracking-assignments -g2 -Wp,-D_FORTIFY_SOURCE=2 -fstack-protector-strong --param=ssp-buffer-size=4 -fPIC -march=x86-64 -gdwarf-4 -fno-debug-types-section -fvar-tracking-assignments -g2 -DNDEBUG -DQT_NO_DEBUG -fPIC -fPIC -std=gnu++11 -o CMakeFiles/owncloudsync.dir/creds/abstractcredentials.cpp.o -c /tmp/B.LDs7so/BUILD/owncloudclient-2.3.3/src/libsync/creds/abstractcredentials.cpp make[2]: Leaving directory '/tmp/B.LDs7so/BUILD/owncloudclient-2.3.3/build' make[2]: Entering directory '/tmp/B.LDs7so/BUILD/owncloudclient-2.3.3/build' [ 30%] Building CXX object src/libsync/CMakeFiles/owncloudsync.dir/creds/credentialscommon.cpp.o cd /tmp/B.LDs7so/BUILD/owncloudclient-2.3.3/build/src/libsync && /usr/bin/x86_64-pld-linux-g++ -DQT_CONCURRENT_LIB -DQT_CORE_LIB -DQT_DBUS_LIB -DQT_DISABLE_DEPRECATED_BEFORE=0 -DQT_GUI_LIB -DQT_MESSAGELOGCONTEXT -DQT_NETWORK_LIB -DQT_NO_DEBUG -DQT_USE_QSTRINGBUILDER -DQT_WIDGETS_LIB -DUNICODE -DUSE_FDO_NOTIFICATIONS -D_UNICODE -Downcloudsync_EXPORTS -I/tmp/B.LDs7so/BUILD/owncloudclient-2.3.3/build/src/libsync/owncloudsync_autogen/include -I/tmp/B.LDs7so/BUILD/owncloudclient-2.3.3/build -I/tmp/B.LDs7so/BUILD/owncloudclient-2.3.3/src/libsync -I/tmp/B.LDs7so/BUILD/owncloudclient-2.3.3/build/src/libsync -I/tmp/B.LDs7so/BUILD/owncloudclient-2.3.3/csync/src -I/tmp/B.LDs7so/BUILD/owncloudclient-2.3.3/build/csync -I/tmp/B.LDs7so/BUILD/owncloudclient-2.3.3/build/csync/src -I/tmp/B.LDs7so/BUILD/owncloudclient-2.3.3/src/3rdparty/qjson -I/usr/include/qt5keychain -isystem /usr/include/qt5 -isystem /usr/include/qt5/QtWidgets -isystem /usr/include/qt5/QtGui -isystem /usr/include/qt5/QtCore -isystem /usr/lib64/qt5/./mkspecs/linux-g++ -isystem /usr/include/qt5/QtNetwork -isystem /usr/include/qt5/QtConcurrent -Wall -Wextra -pedantic -Wno-long-long -std=c++0x -Wpedantic -fPIC -O2 -fwrapv -pipe -Wformat -Werror=format-security -gdwarf-4 -fno-debug-types-section -fvar-tracking-assignments -g2 -Wp,-D_FORTIFY_SOURCE=2 -fstack-protector-strong --param=ssp-buffer-size=4 -fPIC -march=x86-64 -gdwarf-4 -fno-debug-types-section -fvar-tracking-assignments -g2 -DNDEBUG -DQT_NO_DEBUG -fPIC -fPIC -std=gnu++11 -o CMakeFiles/owncloudsync.dir/creds/credentialscommon.cpp.o -c /tmp/B.LDs7so/BUILD/owncloudclient-2.3.3/src/libsync/creds/credentialscommon.cpp make[2]: Leaving directory '/tmp/B.LDs7so/BUILD/owncloudclient-2.3.3/build' make[2]: Entering directory '/tmp/B.LDs7so/BUILD/owncloudclient-2.3.3/build' [ 31%] Building CXX object src/libsync/CMakeFiles/owncloudsync.dir/__/3rdparty/qjson/json.cpp.o cd /tmp/B.LDs7so/BUILD/owncloudclient-2.3.3/build/src/libsync && /usr/bin/x86_64-pld-linux-g++ -DQT_CONCURRENT_LIB -DQT_CORE_LIB -DQT_DBUS_LIB -DQT_DISABLE_DEPRECATED_BEFORE=0 -DQT_GUI_LIB -DQT_MESSAGELOGCONTEXT -DQT_NETWORK_LIB -DQT_NO_DEBUG -DQT_USE_QSTRINGBUILDER -DQT_WIDGETS_LIB -DUNICODE -DUSE_FDO_NOTIFICATIONS -D_UNICODE -Downcloudsync_EXPORTS -I/tmp/B.LDs7so/BUILD/owncloudclient-2.3.3/build/src/libsync/owncloudsync_autogen/include -I/tmp/B.LDs7so/BUILD/owncloudclient-2.3.3/build -I/tmp/B.LDs7so/BUILD/owncloudclient-2.3.3/src/libsync -I/tmp/B.LDs7so/BUILD/owncloudclient-2.3.3/build/src/libsync -I/tmp/B.LDs7so/BUILD/owncloudclient-2.3.3/csync/src -I/tmp/B.LDs7so/BUILD/owncloudclient-2.3.3/build/csync -I/tmp/B.LDs7so/BUILD/owncloudclient-2.3.3/build/csync/src -I/tmp/B.LDs7so/BUILD/owncloudclient-2.3.3/src/3rdparty/qjson -I/usr/include/qt5keychain -isystem /usr/include/qt5 -isystem /usr/include/qt5/QtWidgets -isystem /usr/include/qt5/QtGui -isystem /usr/include/qt5/QtCore -isystem /usr/lib64/qt5/./mkspecs/linux-g++ -isystem /usr/include/qt5/QtNetwork -isystem /usr/include/qt5/QtConcurrent -Wall -Wextra -pedantic -Wno-long-long -std=c++0x -Wpedantic -fPIC -O2 -fwrapv -pipe -Wformat -Werror=format-security -gdwarf-4 -fno-debug-types-section -fvar-tracking-assignments -g2 -Wp,-D_FORTIFY_SOURCE=2 -fstack-protector-strong --param=ssp-buffer-size=4 -fPIC -march=x86-64 -gdwarf-4 -fno-debug-types-section -fvar-tracking-assignments -g2 -DNDEBUG -DQT_NO_DEBUG -fPIC -fPIC -std=gnu++11 -o CMakeFiles/owncloudsync.dir/__/3rdparty/qjson/json.cpp.o -c /tmp/B.LDs7so/BUILD/owncloudclient-2.3.3/src/3rdparty/qjson/json.cpp make[2]: Leaving directory '/tmp/B.LDs7so/BUILD/owncloudclient-2.3.3/build' make[2]: Entering directory '/tmp/B.LDs7so/BUILD/owncloudclient-2.3.3/build' [ 31%] Building CXX object src/libsync/CMakeFiles/owncloudsync.dir/creds/httpcredentials.cpp.o cd /tmp/B.LDs7so/BUILD/owncloudclient-2.3.3/build/src/libsync && /usr/bin/x86_64-pld-linux-g++ -DQT_CONCURRENT_LIB -DQT_CORE_LIB -DQT_DBUS_LIB -DQT_DISABLE_DEPRECATED_BEFORE=0 -DQT_GUI_LIB -DQT_MESSAGELOGCONTEXT -DQT_NETWORK_LIB -DQT_NO_DEBUG -DQT_USE_QSTRINGBUILDER -DQT_WIDGETS_LIB -DUNICODE -DUSE_FDO_NOTIFICATIONS -D_UNICODE -Downcloudsync_EXPORTS -I/tmp/B.LDs7so/BUILD/owncloudclient-2.3.3/build/src/libsync/owncloudsync_autogen/include -I/tmp/B.LDs7so/BUILD/owncloudclient-2.3.3/build -I/tmp/B.LDs7so/BUILD/owncloudclient-2.3.3/src/libsync -I/tmp/B.LDs7so/BUILD/owncloudclient-2.3.3/build/src/libsync -I/tmp/B.LDs7so/BUILD/owncloudclient-2.3.3/csync/src -I/tmp/B.LDs7so/BUILD/owncloudclient-2.3.3/build/csync -I/tmp/B.LDs7so/BUILD/owncloudclient-2.3.3/build/csync/src -I/tmp/B.LDs7so/BUILD/owncloudclient-2.3.3/src/3rdparty/qjson -I/usr/include/qt5keychain -isystem /usr/include/qt5 -isystem /usr/include/qt5/QtWidgets -isystem /usr/include/qt5/QtGui -isystem /usr/include/qt5/QtCore -isystem /usr/lib64/qt5/./mkspecs/linux-g++ -isystem /usr/include/qt5/QtNetwork -isystem /usr/include/qt5/QtConcurrent -Wall -Wextra -pedantic -Wno-long-long -std=c++0x -Wpedantic -fPIC -O2 -fwrapv -pipe -Wformat -Werror=format-security -gdwarf-4 -fno-debug-types-section -fvar-tracking-assignments -g2 -Wp,-D_FORTIFY_SOURCE=2 -fstack-protector-strong --param=ssp-buffer-size=4 -fPIC -march=x86-64 -gdwarf-4 -fno-debug-types-section -fvar-tracking-assignments -g2 -DNDEBUG -DQT_NO_DEBUG -fPIC -fPIC -std=gnu++11 -o CMakeFiles/owncloudsync.dir/creds/httpcredentials.cpp.o -c /tmp/B.LDs7so/BUILD/owncloudclient-2.3.3/src/libsync/creds/httpcredentials.cpp make[2]: Leaving directory '/tmp/B.LDs7so/BUILD/owncloudclient-2.3.3/build' make[2]: Entering directory '/tmp/B.LDs7so/BUILD/owncloudclient-2.3.3/build' [ 32%] Building CXX object src/libsync/CMakeFiles/owncloudsync.dir/owncloudsync_autogen/moc_compilation.cpp.o cd /tmp/B.LDs7so/BUILD/owncloudclient-2.3.3/build/src/libsync && /usr/bin/x86_64-pld-linux-g++ -DQT_CONCURRENT_LIB -DQT_CORE_LIB -DQT_DBUS_LIB -DQT_DISABLE_DEPRECATED_BEFORE=0 -DQT_GUI_LIB -DQT_MESSAGELOGCONTEXT -DQT_NETWORK_LIB -DQT_NO_DEBUG -DQT_USE_QSTRINGBUILDER -DQT_WIDGETS_LIB -DUNICODE -DUSE_FDO_NOTIFICATIONS -D_UNICODE -Downcloudsync_EXPORTS -I/tmp/B.LDs7so/BUILD/owncloudclient-2.3.3/build/src/libsync/owncloudsync_autogen/include -I/tmp/B.LDs7so/BUILD/owncloudclient-2.3.3/build -I/tmp/B.LDs7so/BUILD/owncloudclient-2.3.3/src/libsync -I/tmp/B.LDs7so/BUILD/owncloudclient-2.3.3/build/src/libsync -I/tmp/B.LDs7so/BUILD/owncloudclient-2.3.3/csync/src -I/tmp/B.LDs7so/BUILD/owncloudclient-2.3.3/build/csync -I/tmp/B.LDs7so/BUILD/owncloudclient-2.3.3/build/csync/src -I/tmp/B.LDs7so/BUILD/owncloudclient-2.3.3/src/3rdparty/qjson -I/usr/include/qt5keychain -isystem /usr/include/qt5 -isystem /usr/include/qt5/QtWidgets -isystem /usr/include/qt5/QtGui -isystem /usr/include/qt5/QtCore -isystem /usr/lib64/qt5/./mkspecs/linux-g++ -isystem /usr/include/qt5/QtNetwork -isystem /usr/include/qt5/QtConcurrent -Wall -Wextra -pedantic -Wno-long-long -std=c++0x -Wpedantic -fPIC -O2 -fwrapv -pipe -Wformat -Werror=format-security -gdwarf-4 -fno-debug-types-section -fvar-tracking-assignments -g2 -Wp,-D_FORTIFY_SOURCE=2 -fstack-protector-strong --param=ssp-buffer-size=4 -fPIC -march=x86-64 -gdwarf-4 -fno-debug-types-section -fvar-tracking-assignments -g2 -DNDEBUG -DQT_NO_DEBUG -fPIC -fPIC -std=gnu++11 -o CMakeFiles/owncloudsync.dir/owncloudsync_autogen/moc_compilation.cpp.o -c /tmp/B.LDs7so/BUILD/owncloudclient-2.3.3/build/src/libsync/owncloudsync_autogen/moc_compilation.cpp make[2]: Leaving directory '/tmp/B.LDs7so/BUILD/owncloudclient-2.3.3/build' make[1]: *** [CMakeFiles/Makefile2:246: src/libsync/CMakeFiles/owncloudsync.dir/all] Error 2 make: *** [Makefile:155: all] Error 2 error: Bad exit status from /tmp/B.LDs7so/BUILD/tmp/rpm-tmp.84468 (%build) RPM build errors: Bad exit status from /tmp/B.LDs7so/BUILD/tmp/rpm-tmp.84468 (%build) ended at: Mon Sep 25 20:59:08 2017, done in 0:00:45.927904 error: No files produced. mesg: ttyname failed: Inappropriate ioctl for device + chmod -R u+rwX /tmp/B.LDs7so/BUILD + rm -rf /tmp/B.LDs7so/tmp /tmp/B.LDs7so/BUILD mesg: ttyname failed: Inappropriate ioctl for device + rm -rf /tmp/B.LDs7so Begin-PLD-Builder-Info Build-Time: user:120.69s sys:12.25s real:94.58s (faults io:126 non-io:3328056) End-PLD-Builder-Info
[Back to list of logs] [View rpm -qa of builder]