FailedOk

th/SRPMS[OK]
th/x32[OK]
th/i686[OK]
th/x86_64[OK]

ac/SRPMS[OK]
ac/i386[OK]
ac/i586[OK]
ac/i686[OK]
ac/alpha[OK]
ac/amd64[OK]
ac/athlon[OK]
ac/ppc[OK]
ac/sparc[OK]
ac/sparc64[OK]

Advanced Search
main()
Powered by PLD Linux
(c) 2002-2020 PLD Team
$Revision: 1.37 $
Powered by ufo.
Your IP: 3.228.220.31

pcl e93c04e6-5499-4414-ae94-5f146cd24d1e

Status:Failed
Source URL:https://buildlogs.pld-linux.org/pld/th/x86_64/FAIL/pcl,e93c04e6-5499-4414-ae94-5f146cd24d1e.bz2
text/plain URL:View!
full text:View!
rpm -qa of builder:View!
Date:2020/08/01 11:05:53
Runtime:0:00:10.782187

Toc:

  • error 1
  • /tmp/B.t7FewF/BUILD/pcl-pcl-1.9.1/common/include/pcl/PCLPointCloud2.h:11:10: fatal error: boost/detail/endian.hpp: No such file or directory
  • error 2
  • compilation terminated.
  • error 3
  • make[2]: *** [common/CMakeFiles/pcl_common.dir/build.make:99: common/CMakeFiles/pcl_common.dir/src/pcl_base.cpp.o] Error 1
  • error 4
  • make[1]: *** [CMakeFiles/Makefile2:1075: common/CMakeFiles/pcl_common.dir/all] Error 2
  • error 5
  • error: Bad exit status from /tmp/B.t7FewF/BUILD/tmp/rpm-tmp.2538 (%build)
  • error 6
  • RPM build errors:
  • error 7
  • error: No files produced.

Content:

-- VTK_MAJOR_VERSION 8, rendering backend: OpenGL2
-- VTK found (include: /usr/include/vtk;/usr/include;/usr/include/freetype2;/usr/include/libxml2;/usr/include/python2.7;/usr/include/jsoncpp, lib: vtksys;vtkCommonCore;vtkCommonMath;vtkCommonMisc;vtkCommonSystem;vtkCommonTransforms;vtkCommonDataModel;vtkCommonColor;vtkCommonExecutionModel;vtkCommonComputationalGeometry;vtkFiltersCore;vtkFiltersGeneral;vtkImagingCore;vtkImagingFourier;vtkalglib;vtkFiltersStatistics;vtkFiltersExtraction;vtkInfovisCore;vtkFiltersGeometry;vtkFiltersSources;vtkRenderingCore;/usr/lib64/libz.so;/usr/lib64/libfreetype.so;vtkRenderingFreeType;vtkRenderingContext2D;vtkChartsCore;/usr/lib64/liblz4.so;vtkIOCore;vtkIOLegacy;/usr/lib64/libexpat.so;vtkIOXMLParser;vtkIOXML;/usr/lib64/libxml2.so;vtkIOInfovis;vtkglew;vtkRenderingOpenGL2;vtkRenderingContextOpenGL2;vtkDICOMParser;vtkmetaio;/usr/lib64/libjpeg.so;/usr/lib64/libpng.so;/usr/lib64/libtiff.so;vtkIOImage;vtkTestingRendering;vtkImagingSources;vtkFiltersHybrid;vtkFiltersModeling;vtkImagingColor;vtkImagingGeneral;vtkImagingHybrid;vtkInteractionStyle;vtkRenderingAnnotation;vtkRenderingVolume;vtkInteractionWidgets;vtkViewsCore;vtkViewsContext2D;vtkFiltersGeneric;vtkIOGeometry;vtkTestingGenericBridge;vtkDomainsChemistry;vtkDomainsChemistryOpenGL2;vtkParallelCore;vtkFiltersAMR;/usr/lib64/libhdf5.so;/usr/lib64/libsz.so;/usr/lib64/libdl.so;/usr/lib64/libm.so;/usr/lib64/libhdf5_hl.so;vtkIOAMR;/usr/lib64/libnetcdf.so;vtkexoIIc;vtkIOExodus;vtkImagingMath;vtkRenderingVolumeOpenGL2;vtkFiltersFlowPaths;vtkFiltersImaging;vtkRenderingLabel;vtkFiltersHyperTree;vtkImagingStencil;vtkFiltersParallel;vtkFiltersParallelImaging;vtkFiltersPoints;vtkFiltersProgrammable;/usr/lib64/libpython2.7.so;vtkWrappingTools;vtkWrappingPythonCore;vtkFiltersPython;vtkFiltersReebGraph;vtkFiltersSMP;vtkFiltersSelection;verdict;vtkFiltersVerdict;/usr/lib64/libnetcdf_c++.so;vtkIONetCDF;/usr/lib64/libjsoncpp.so;vtkIOParallel;vtkFiltersTexture;vtkFiltersTopology;vtkGUISupportQt;vtksqlite;vtkIOSQL;vtkGUISupportQtSQL;vtkInfovisLayout;vtkproj4;vtkGeovisCore;vtkViewsInfovis;vtkViewsGeovis;vtkIOEnSight;vtkgl2ps;vtkRenderingGL2PSOpenGL2;vtklibharu;vtkIOExport;vtkIOExportOpenGL2;vtkInteractionImage;/usr/lib64/libtheoraenc.so;/usr/lib64/libtheoradec.so;/usr/lib64/libogg.so;vtkIOMovie;vtkIOFFMPEG;vtkIOGDAL;vtkIOGeoJSON;vtkIOImport;vtkIOLSDyna;vtkIOMINC;vtkIOMySQL;vtkTestingIOSQL;vtkIOODBC;vtkIOPLY;vtkIOParallelExodus;vtkIOParallelLSDyna;vtkIOParallelXML;vtkIOPostgreSQL;vtkIOTecplotTable;VPIC;vtkIOVPIC;vtkIOVideo;vtkxdmf2;vtkIOXdmf2;vtkImagingStatistics;vtkRenderingImage;vtkImagingMorphological;vtkInfovisBoostGraphAlgorithms;vtkRenderingLOD;vtkPythonInterpreter;vtkRenderingMatplotlib;vtkRenderingFreeTypeFontConfig;vtkRenderingParallel;vtkRenderingQt;vtkViewsQt;vtkWrappingJava
-- Found PCAP: /usr/lib64/libpcap.so  
-- Looking for pthread.h
-- Looking for pthread.h - found
-- Performing Test CMAKE_HAVE_LIBC_PTHREAD
-- Performing Test CMAKE_HAVE_LIBC_PTHREAD - Success
-- Found Threads: TRUE  
-- Found Boost: /usr/include (found suitable version "1.73.0", minimum required is "1.47.0") found components: filesystem thread date_time iostreams chrono system atomic regex 
-- Found OpenGL: /usr/lib64/libGL.so   
-- Found Glew: /usr/lib64/libGLEW.so
-- Checking for module 'sphinx-build'
--   No package 'sphinx-build' found
-- Found PythonInterp: /usr/bin/python (found version "2.7.18") 
-- Found Sphinx: /usr/bin/sphinx-build  
-- Found Doxygen: /usr/bin/doxygen (found version "1.8.8") found components: doxygen dot 
-- DOXYGEN_FOUND YES
-- HTML_HELP_COMPILER 
-- The following subsystems will be built:
--   common
--   kdtree
--   octree
--   search
--   sample_consensus
--   filters
--   2d
--   geometry
--   io
--   features
--   ml
--   segmentation
--   visualization
--   surface
--   registration
--   keypoints
--   tracking
--   recognition
--   stereo
--   outofcore
--   people
--   tools
-- The following subsystems will not be built:
--   apps: No reason
--   examples: Code examples are disabled by default.
--   simulation: Disabled by default.
--   global_tests: No reason
-- Configuring done
-- Generating done
CMake Warning:
  Manually-specified variables were not used by the project:

    CMAKE_Fortran_FLAGS_PLD
    CMAKE_INSTALL_BINDIR
    CMAKE_INSTALL_DATADIR
    CMAKE_INSTALL_DATAROOTDIR
    CMAKE_INSTALL_DOCDIR
    CMAKE_INSTALL_INCLUDEDIR
    CMAKE_INSTALL_INFODIR
    CMAKE_INSTALL_LIBDIR
    CMAKE_INSTALL_LIBEXECDIR
    CMAKE_INSTALL_LOCALEDIR
    CMAKE_INSTALL_LOCALSTATEDIRPATH
    CMAKE_INSTALL_MANDIR
    CMAKE_INSTALL_OLDINCLUDEDIR
    CMAKE_INSTALL_SBINDIR
    CMAKE_INSTALL_SHAREDSTATEDIRPATH
    CMAKE_INSTALL_SYSCONFDIR
    FZAPI_DIR
    FZAPI_INCLUDE_DIR
    LIB_SUFFIX
    SYSCONF_INSTALL_DIR


-- Build files have been written to: /tmp/B.t7FewF/BUILD/pcl-pcl-1.9.1/build
+ /usr/bin/make -Otarget -j9 -j1
/usr/bin/cmake -S/tmp/B.t7FewF/BUILD/pcl-pcl-1.9.1 -B/tmp/B.t7FewF/BUILD/pcl-pcl-1.9.1/build --check-build-system CMakeFiles/Makefile.cmake 0
/usr/bin/cmake -E cmake_progress_start /tmp/B.t7FewF/BUILD/pcl-pcl-1.9.1/build/CMakeFiles /tmp/B.t7FewF/BUILD/pcl-pcl-1.9.1/build/CMakeFiles/progress.marks
/usr/bin/make  -f CMakeFiles/Makefile2 all
make[1]: Entering directory '/tmp/B.t7FewF/BUILD/pcl-pcl-1.9.1/build'
/usr/bin/make  -f common/CMakeFiles/pcl_common.dir/build.make common/CMakeFiles/pcl_common.dir/depend
make[2]: Entering directory '/tmp/B.t7FewF/BUILD/pcl-pcl-1.9.1/build'
cd /tmp/B.t7FewF/BUILD/pcl-pcl-1.9.1/build && /usr/bin/cmake -E cmake_depends "Unix Makefiles" /tmp/B.t7FewF/BUILD/pcl-pcl-1.9.1 /tmp/B.t7FewF/BUILD/pcl-pcl-1.9.1/common /tmp/B.t7FewF/BUILD/pcl-pcl-1.9.1/build /tmp/B.t7FewF/BUILD/pcl-pcl-1.9.1/build/common /tmp/B.t7FewF/BUILD/pcl-pcl-1.9.1/build/common/CMakeFiles/pcl_common.dir/DependInfo.cmake --color=
Scanning dependencies of target pcl_common
make[2]: Leaving directory '/tmp/B.t7FewF/BUILD/pcl-pcl-1.9.1/build'
/usr/bin/make  -f common/CMakeFiles/pcl_common.dir/build.make common/CMakeFiles/pcl_common.dir/build
make[2]: Entering directory '/tmp/B.t7FewF/BUILD/pcl-pcl-1.9.1/build'
[  0%] Building CXX object common/CMakeFiles/pcl_common.dir/src/point_types.cpp.o
cd /tmp/B.t7FewF/BUILD/pcl-pcl-1.9.1/build/common && /usr/bin/x86_64-pld-linux-g++  -DPCLAPI_EXPORTS -DQT_CONCURRENT_LIB -DQT_CORE_LIB -DQT_GUI_LIB -DQT_OPENGL_LIB -DQT_WIDGETS_LIB -Dqh_QHpointer -DvtkDomainsChemistry_AUTOINIT="1(vtkDomainsChemistryOpenGL2)" -DvtkIOExodus_AUTOINIT="1(vtkIOParallelExodus)" -DvtkIOExport_AUTOINIT="1(vtkIOExportOpenGL2)" -DvtkIOSQL_AUTOINIT="2(vtkIOMySQL,vtkIOPostgreSQL)" -DvtkRenderingContext2D_AUTOINIT="1(vtkRenderingContextOpenGL2)" -DvtkRenderingCore_AUTOINIT="3(vtkInteractionStyle,vtkRenderingFreeType,vtkRenderingOpenGL2)" -DvtkRenderingFreeType_AUTOINIT="2(vtkRenderingFreeTypeFontConfig,vtkRenderingMatplotlib)" -DvtkRenderingOpenGL2_AUTOINIT="1(vtkRenderingGL2PSOpenGL2)" -DvtkRenderingVolume_AUTOINIT="1(vtkRenderingVolumeOpenGL2)" -I/tmp/B.t7FewF/BUILD/pcl-pcl-1.9.1/recognition/include/pcl/recognition/3rdparty -I/usr/include/qt5 -I/usr/include/qt5/QtCore -I/usr/lib64/qt5/./mkspecs/linux-g++ -I/usr/include/qt5/QtGui -I/usr/include/qt5/QtWidgets -I/usr/include/qt5/QtConcurrent -I/usr/include/qt5/QtOpenGL -I/usr/include/vtk -I/usr/include/freetype2 -I/usr/include/libxml2 -I/usr/include/python2.7 -I/usr/include/jsoncpp -I/tmp/B.t7FewF/BUILD/pcl-pcl-1.9.1/build/include -I/tmp/B.t7FewF/BUILD/pcl-pcl-1.9.1/common/include -isystem /usr/include/eigen3 -isystem /usr/include/ni -isystem /usr/include/openni2  -Wall -Wextra -Wno-unknown-pragmas -fno-strict-aliasing -Wno-format-extra-args -Wno-sign-compare -Wno-invalid-offsetof -Wno-conversion  -Wabi -pthread -fopenmp       -O2 -fwrapv -pipe -Wformat -Werror=format-security -Wp,-D_FORTIFY_SOURCE=2 -fstack-protector-strong --param=ssp-buffer-size=4 -Werror=trampolines -fPIC -march=x86-64  -DNDEBUG -DQT_NO_DEBUG -fPIC   -o CMakeFiles/pcl_common.dir/src/point_types.cpp.o -c /tmp/B.t7FewF/BUILD/pcl-pcl-1.9.1/common/src/point_types.cpp
cc1plus: warning: '-Wabi' won't warn about anything [-Wabi]
cc1plus: note: '-Wabi' warns about differences from the most up-to-date ABI, which is also used by default
cc1plus: note: use e.g. '-Wabi=11' to warn about changes from GCC 7
[  0%] Building CXX object common/CMakeFiles/pcl_common.dir/src/pcl_base.cpp.o
cd /tmp/B.t7FewF/BUILD/pcl-pcl-1.9.1/build/common && /usr/bin/x86_64-pld-linux-g++  -DPCLAPI_EXPORTS -DQT_CONCURRENT_LIB -DQT_CORE_LIB -DQT_GUI_LIB -DQT_OPENGL_LIB -DQT_WIDGETS_LIB -Dqh_QHpointer -DvtkDomainsChemistry_AUTOINIT="1(vtkDomainsChemistryOpenGL2)" -DvtkIOExodus_AUTOINIT="1(vtkIOParallelExodus)" -DvtkIOExport_AUTOINIT="1(vtkIOExportOpenGL2)" -DvtkIOSQL_AUTOINIT="2(vtkIOMySQL,vtkIOPostgreSQL)" -DvtkRenderingContext2D_AUTOINIT="1(vtkRenderingContextOpenGL2)" -DvtkRenderingCore_AUTOINIT="3(vtkInteractionStyle,vtkRenderingFreeType,vtkRenderingOpenGL2)" -DvtkRenderingFreeType_AUTOINIT="2(vtkRenderingFreeTypeFontConfig,vtkRenderingMatplotlib)" -DvtkRenderingOpenGL2_AUTOINIT="1(vtkRenderingGL2PSOpenGL2)" -DvtkRenderingVolume_AUTOINIT="1(vtkRenderingVolumeOpenGL2)" -I/tmp/B.t7FewF/BUILD/pcl-pcl-1.9.1/recognition/include/pcl/recognition/3rdparty -I/usr/include/qt5 -I/usr/include/qt5/QtCore -I/usr/lib64/qt5/./mkspecs/linux-g++ -I/usr/include/qt5/QtGui -I/usr/include/qt5/QtWidgets -I/usr/include/qt5/QtConcurrent -I/usr/include/qt5/QtOpenGL -I/usr/include/vtk -I/usr/include/freetype2 -I/usr/include/libxml2 -I/usr/include/python2.7 -I/usr/include/jsoncpp -I/tmp/B.t7FewF/BUILD/pcl-pcl-1.9.1/build/include -I/tmp/B.t7FewF/BUILD/pcl-pcl-1.9.1/common/include -isystem /usr/include/eigen3 -isystem /usr/include/ni -isystem /usr/include/openni2  -Wall -Wextra -Wno-unknown-pragmas -fno-strict-aliasing -Wno-format-extra-args -Wno-sign-compare -Wno-invalid-offsetof -Wno-conversion  -Wabi -pthread -fopenmp       -O2 -fwrapv -pipe -Wformat -Werror=format-security -Wp,-D_FORTIFY_SOURCE=2 -fstack-protector-strong --param=ssp-buffer-size=4 -Werror=trampolines -fPIC -march=x86-64  -DNDEBUG -DQT_NO_DEBUG -fPIC   -o CMakeFiles/pcl_common.dir/src/pcl_base.cpp.o -c /tmp/B.t7FewF/BUILD/pcl-pcl-1.9.1/common/src/pcl_base.cpp
cc1plus: warning: '-Wabi' won't warn about anything [-Wabi]
cc1plus: note: '-Wabi' warns about differences from the most up-to-date ABI, which is also used by default
cc1plus: note: use e.g. '-Wabi=11' to warn about changes from GCC 7
In file included from /tmp/B.t7FewF/BUILD/pcl-pcl-1.9.1/common/include/pcl/pcl_base.h:55,
                 from /tmp/B.t7FewF/BUILD/pcl-pcl-1.9.1/common/include/pcl/impl/pcl_base.hpp:40,
                 from /tmp/B.t7FewF/BUILD/pcl-pcl-1.9.1/common/src/pcl_base.cpp:39:
/tmp/B.t7FewF/BUILD/pcl-pcl-1.9.1/common/include/pcl/PCLPointCloud2.h:11:10: fatal error: boost/detail/endian.hpp: No such file or directory
   11 | #include <boost/detail/endian.hpp>
      |          ^~~~~~~~~~~~~~~~~~~~~~~~~
compilation terminated.
make[2]: *** [common/CMakeFiles/pcl_common.dir/build.make:99: common/CMakeFiles/pcl_common.dir/src/pcl_base.cpp.o] Error 1
make[2]: Leaving directory '/tmp/B.t7FewF/BUILD/pcl-pcl-1.9.1/build'
make[1]: *** [CMakeFiles/Makefile2:1075: common/CMakeFiles/pcl_common.dir/all] Error 2
make[1]: Leaving directory '/tmp/B.t7FewF/BUILD/pcl-pcl-1.9.1/build'
make: *** [Makefile:164: all] Error 2
error: Bad exit status from /tmp/B.t7FewF/BUILD/tmp/rpm-tmp.2538 (%build)


RPM build errors:
    Bad exit status from /tmp/B.t7FewF/BUILD/tmp/rpm-tmp.2538 (%build)
ended at: Sat Aug  1 11:05:52 2020, done in 0:00:10.782187
error: No files produced.
+ chmod -R u+rwX /tmp/B.t7FewF/BUILD
+ rm -rf /tmp/B.t7FewF/tmp /tmp/B.t7FewF/BUILD
+ rm -rf /tmp/B.t7FewF
Begin-PLD-Builder-Info
Build-Time: user:10.45s sys:2.52s real:21.47s (faults io:0 non-io:360945)

End-PLD-Builder-Info
[Back to list of logs] [View rpm -qa of builder]