FailedOk

th/SRPMS[OK]
th/x32[OK]
th/i686[OK]
th/x86_64[OK]

ac/SRPMS[OK]
ac/i386[OK]
ac/i586[OK]
ac/i686[OK]
ac/alpha[OK]
ac/amd64[OK]
ac/athlon[OK]
ac/ppc[OK]
ac/sparc[OK]
ac/sparc64[OK]

Advanced Search
main()
Powered by PLD Linux
(c) 2002-2020 PLD Team
$Revision: 1.37 $
Powered by Unix conspiracy.
Your IP: 52.54.53.222

performous 180c8379-8da4-4cca-929b-aba69e6f3d12

Status:Failed
Source URL:https://buildlogs.pld-linux.org/pld/th/x86_64/FAIL/performous,180c8379-8da4-4cca-929b-aba69e6f3d12.bz2
text/plain URL:View!
full text:View!
rpm -qa of builder:View!
Date:2020/07/28 19:46:18
Runtime:0:01:22.894488

Toc:

  • error 1
  • /tmp/B.Kwc8NJ/BUILD/performous-1.1/game/surface.cc:138:60: error: '_1' was not declared in this scope
  • error 2
  • make[2]: *** [game/CMakeFiles/performous.dir/build.make:801: game/CMakeFiles/performous.dir/surface.cc.o] Error 1
  • error 3
  • make[1]: *** [CMakeFiles/Makefile2:686: game/CMakeFiles/performous.dir/all] Error 2
  • error 4
  • error: Bad exit status from /tmp/B.Kwc8NJ/BUILD/tmp/rpm-tmp.93655 (%build)
  • error 5
  • RPM build errors:
  • error 6
  • error: No files produced.

Content:

      |                            ^~~~~~~~
In file included from /usr/include/libxml++-2.6/libxml++/libxml++.h:54,
                 from /tmp/B.Kwc8NJ/BUILD/performous-1.1/game/songparser-xml.cc:19:
/usr/include/libxml++-2.6/libxml++/parsers/textreader.h:260:10: warning: 'template<class> class std::auto_ptr' is deprecated [-Wdeprecated-declarations]
  260 |     std::auto_ptr<PropertyReader> propertyreader;
      |          ^~~~~~~~
In file included from /usr/include/c++/10.2.0/memory:83,
                 from /usr/include/boost/system/detail/std_interoperability.hpp:12,
                 from /usr/include/boost/system/error_code.hpp:963,
                 from /usr/include/boost/filesystem/path_traits.hpp:22,
                 from /usr/include/boost/filesystem/path.hpp:26,
                 from /tmp/B.Kwc8NJ/BUILD/performous-1.1/game/fs.hh:3,
                 from /tmp/B.Kwc8NJ/BUILD/performous-1.1/game/song.hh:3,
                 from /tmp/B.Kwc8NJ/BUILD/performous-1.1/game/songparser.hh:3,
                 from /tmp/B.Kwc8NJ/BUILD/performous-1.1/game/songparser-xml.cc:1:
/usr/include/c++/10.2.0/bits/unique_ptr.h:57:28: note: declared here
   57 |   template<typename> class auto_ptr;
      |                            ^~~~~~~~
In file included from /usr/include/libxml++-2.6/libxml++/libxml++.h:69,
                 from /tmp/B.Kwc8NJ/BUILD/performous-1.1/game/songparser-xml.cc:19:
/usr/include/libxml++-2.6/libxml++/relaxngschema.h:108:8: warning: 'template<class> class std::auto_ptr' is deprecated [-Wdeprecated-declarations]
  108 |   std::auto_ptr<Impl> pimpl_;
      |        ^~~~~~~~
In file included from /usr/include/c++/10.2.0/memory:83,
                 from /usr/include/boost/system/detail/std_interoperability.hpp:12,
                 from /usr/include/boost/system/error_code.hpp:963,
                 from /usr/include/boost/filesystem/path_traits.hpp:22,
                 from /usr/include/boost/filesystem/path.hpp:26,
                 from /tmp/B.Kwc8NJ/BUILD/performous-1.1/game/fs.hh:3,
                 from /tmp/B.Kwc8NJ/BUILD/performous-1.1/game/song.hh:3,
                 from /tmp/B.Kwc8NJ/BUILD/performous-1.1/game/songparser.hh:3,
                 from /tmp/B.Kwc8NJ/BUILD/performous-1.1/game/songparser-xml.cc:1:
/usr/include/c++/10.2.0/bits/unique_ptr.h:57:28: note: declared here
   57 |   template<typename> class auto_ptr;
      |                            ^~~~~~~~
In file included from /usr/include/libxml++-2.6/libxml++/libxml++.h:70,
                 from /tmp/B.Kwc8NJ/BUILD/performous-1.1/game/songparser-xml.cc:19:
/usr/include/libxml++-2.6/libxml++/xsdschema.h:99:8: warning: 'template<class> class std::auto_ptr' is deprecated [-Wdeprecated-declarations]
   99 |   std::auto_ptr<Impl> pimpl_;
      |        ^~~~~~~~
In file included from /usr/include/c++/10.2.0/memory:83,
                 from /usr/include/boost/system/detail/std_interoperability.hpp:12,
                 from /usr/include/boost/system/error_code.hpp:963,
                 from /usr/include/boost/filesystem/path_traits.hpp:22,
                 from /usr/include/boost/filesystem/path.hpp:26,
                 from /tmp/B.Kwc8NJ/BUILD/performous-1.1/game/fs.hh:3,
                 from /tmp/B.Kwc8NJ/BUILD/performous-1.1/game/song.hh:3,
                 from /tmp/B.Kwc8NJ/BUILD/performous-1.1/game/songparser.hh:3,
                 from /tmp/B.Kwc8NJ/BUILD/performous-1.1/game/songparser-xml.cc:1:
/usr/include/c++/10.2.0/bits/unique_ptr.h:57:28: note: declared here
   57 |   template<typename> class auto_ptr;
      |                            ^~~~~~~~
In file included from /usr/include/libxml++-2.6/libxml++/libxml++.h:73,
                 from /tmp/B.Kwc8NJ/BUILD/performous-1.1/game/songparser-xml.cc:19:
/usr/include/libxml++-2.6/libxml++/validators/relaxngvalidator.h:159:8: warning: 'template<class> class std::auto_ptr' is deprecated [-Wdeprecated-declarations]
  159 |   std::auto_ptr<Impl> pimpl_;
      |        ^~~~~~~~
In file included from /usr/include/c++/10.2.0/memory:83,
                 from /usr/include/boost/system/detail/std_interoperability.hpp:12,
                 from /usr/include/boost/system/error_code.hpp:963,
                 from /usr/include/boost/filesystem/path_traits.hpp:22,
                 from /usr/include/boost/filesystem/path.hpp:26,
                 from /tmp/B.Kwc8NJ/BUILD/performous-1.1/game/fs.hh:3,
                 from /tmp/B.Kwc8NJ/BUILD/performous-1.1/game/song.hh:3,
                 from /tmp/B.Kwc8NJ/BUILD/performous-1.1/game/songparser.hh:3,
                 from /tmp/B.Kwc8NJ/BUILD/performous-1.1/game/songparser-xml.cc:1:
/usr/include/c++/10.2.0/bits/unique_ptr.h:57:28: note: declared here
   57 |   template<typename> class auto_ptr;
      |                            ^~~~~~~~
In file included from /usr/include/libxml++-2.6/libxml++/libxml++.h:75,
                 from /tmp/B.Kwc8NJ/BUILD/performous-1.1/game/songparser-xml.cc:19:
/usr/include/libxml++-2.6/libxml++/validators/xsdvalidator.h:149:8: warning: 'template<class> class std::auto_ptr' is deprecated [-Wdeprecated-declarations]
  149 |   std::auto_ptr<Impl> pimpl_;
      |        ^~~~~~~~
In file included from /usr/include/c++/10.2.0/memory:83,
                 from /usr/include/boost/system/detail/std_interoperability.hpp:12,
                 from /usr/include/boost/system/error_code.hpp:963,
                 from /usr/include/boost/filesystem/path_traits.hpp:22,
                 from /usr/include/boost/filesystem/path.hpp:26,
                 from /tmp/B.Kwc8NJ/BUILD/performous-1.1/game/fs.hh:3,
                 from /tmp/B.Kwc8NJ/BUILD/performous-1.1/game/song.hh:3,
                 from /tmp/B.Kwc8NJ/BUILD/performous-1.1/game/songparser.hh:3,
                 from /tmp/B.Kwc8NJ/BUILD/performous-1.1/game/songparser-xml.cc:1:
/usr/include/c++/10.2.0/bits/unique_ptr.h:57:28: note: declared here
   57 |   template<typename> class auto_ptr;
      |                            ^~~~~~~~
make[2]: Leaving directory '/tmp/B.Kwc8NJ/BUILD/performous-1.1/build'
make[2]: Entering directory '/tmp/B.Kwc8NJ/BUILD/performous-1.1/build'
[ 94%] Building CXX object game/CMakeFiles/performous.dir/svg.cc.o
cd /tmp/B.Kwc8NJ/BUILD/performous-1.1/build/game && /usr/bin/x86_64-pld-linux-g++  -DNDEBUG -DUSE_GETTEXT -DUSE_OPENCV -DUSE_PORTMIDI -I/usr/include/SDL2 -I/usr/include/pango-1.0 -I/usr/include/cairo -I/usr/include/freetype2 -I/usr/include/glib-2.0 -I/usr/lib64/glib-2.0/include -I/usr/include/librsvg-2.0 -I/usr/include/gdk-pixbuf-2.0 -I/usr/lib64/libxml++-2.6/include -I/usr/include/libxml++-2.6 -I/usr/include/libxml2 -I/usr/lib64/glibmm-2.4/include -I/usr/include/glibmm-2.4 -I/usr/include/sigc++-2.0 -I/usr/lib64/sigc++-2.0/include -I/usr/include/harfbuzz -I/tmp/B.Kwc8NJ/BUILD/performous-1.1/build/game -isystem /usr/include/opencv  -std=c++11 -Wall -Wextra -fcx-limited-range  -pthread -O2 -fwrapv -pipe -Wformat -Werror=format-security -gdwarf-4 -fno-debug-types-section -fvar-tracking-assignments -g2 -Wp,-D_FORTIFY_SOURCE=2 -fstack-protector-strong --param=ssp-buffer-size=4 -Werror=trampolines -fPIC -march=x86-64 -gdwarf-4 -fno-debug-types-section -fvar-tracking-assignments -g2  -std=gnu++11   -o CMakeFiles/performous.dir/svg.cc.o -c /tmp/B.Kwc8NJ/BUILD/performous-1.1/game/svg.cc
make[2]: Leaving directory '/tmp/B.Kwc8NJ/BUILD/performous-1.1/build'
make[2]: Entering directory '/tmp/B.Kwc8NJ/BUILD/performous-1.1/build'
[ 95%] Building CXX object game/CMakeFiles/performous.dir/unicode.cc.o
cd /tmp/B.Kwc8NJ/BUILD/performous-1.1/build/game && /usr/bin/x86_64-pld-linux-g++  -DNDEBUG -DUSE_GETTEXT -DUSE_OPENCV -DUSE_PORTMIDI -I/usr/include/SDL2 -I/usr/include/pango-1.0 -I/usr/include/cairo -I/usr/include/freetype2 -I/usr/include/glib-2.0 -I/usr/lib64/glib-2.0/include -I/usr/include/librsvg-2.0 -I/usr/include/gdk-pixbuf-2.0 -I/usr/lib64/libxml++-2.6/include -I/usr/include/libxml++-2.6 -I/usr/include/libxml2 -I/usr/lib64/glibmm-2.4/include -I/usr/include/glibmm-2.4 -I/usr/include/sigc++-2.0 -I/usr/lib64/sigc++-2.0/include -I/usr/include/harfbuzz -I/tmp/B.Kwc8NJ/BUILD/performous-1.1/build/game -isystem /usr/include/opencv  -std=c++11 -Wall -Wextra -fcx-limited-range  -pthread -O2 -fwrapv -pipe -Wformat -Werror=format-security -gdwarf-4 -fno-debug-types-section -fvar-tracking-assignments -g2 -Wp,-D_FORTIFY_SOURCE=2 -fstack-protector-strong --param=ssp-buffer-size=4 -Werror=trampolines -fPIC -march=x86-64 -gdwarf-4 -fno-debug-types-section -fvar-tracking-assignments -g2  -std=gnu++11   -o CMakeFiles/performous.dir/unicode.cc.o -c /tmp/B.Kwc8NJ/BUILD/performous-1.1/game/unicode.cc
make[2]: Leaving directory '/tmp/B.Kwc8NJ/BUILD/performous-1.1/build'
make[2]: Entering directory '/tmp/B.Kwc8NJ/BUILD/performous-1.1/build'
[ 93%] Building CXX object game/CMakeFiles/performous.dir/surface.cc.o
cd /tmp/B.Kwc8NJ/BUILD/performous-1.1/build/game && /usr/bin/x86_64-pld-linux-g++  -DNDEBUG -DUSE_GETTEXT -DUSE_OPENCV -DUSE_PORTMIDI -I/usr/include/SDL2 -I/usr/include/pango-1.0 -I/usr/include/cairo -I/usr/include/freetype2 -I/usr/include/glib-2.0 -I/usr/lib64/glib-2.0/include -I/usr/include/librsvg-2.0 -I/usr/include/gdk-pixbuf-2.0 -I/usr/lib64/libxml++-2.6/include -I/usr/include/libxml++-2.6 -I/usr/include/libxml2 -I/usr/lib64/glibmm-2.4/include -I/usr/include/glibmm-2.4 -I/usr/include/sigc++-2.0 -I/usr/lib64/sigc++-2.0/include -I/usr/include/harfbuzz -I/tmp/B.Kwc8NJ/BUILD/performous-1.1/build/game -isystem /usr/include/opencv  -std=c++11 -Wall -Wextra -fcx-limited-range  -pthread -O2 -fwrapv -pipe -Wformat -Werror=format-security -gdwarf-4 -fno-debug-types-section -fvar-tracking-assignments -g2 -Wp,-D_FORTIFY_SOURCE=2 -fstack-protector-strong --param=ssp-buffer-size=4 -Werror=trampolines -fPIC -march=x86-64 -gdwarf-4 -fno-debug-types-section -fvar-tracking-assignments -g2  -std=gnu++11   -o CMakeFiles/performous.dir/surface.cc.o -c /tmp/B.Kwc8NJ/BUILD/performous-1.1/game/surface.cc
/tmp/B.Kwc8NJ/BUILD/performous-1.1/game/surface.cc: In function 'void loader(T*, const boost::filesystem::path&)':
/tmp/B.Kwc8NJ/BUILD/performous-1.1/game/surface.cc:138:60: error: '_1' was not declared in this scope
  138 |  ldr->push(target, Job(name, boost::bind(&T::load, target, _1)));
      |                                                            ^~
/tmp/B.Kwc8NJ/BUILD/performous-1.1/game/surface.cc:138:60: note: suggested alternatives:
In file included from /usr/include/boost/mpl/aux_/include_preprocessed.hpp:37,
                 from /usr/include/boost/mpl/placeholders.hpp:43,
                 from /usr/include/boost/iterator/iterator_categories.hpp:16,
                 from /usr/include/boost/iterator/iterator_facade.hpp:13,
                 from /usr/include/boost/filesystem/path.hpp:29,
                 from /tmp/B.Kwc8NJ/BUILD/performous-1.1/game/../common/image.hh:3,
                 from /tmp/B.Kwc8NJ/BUILD/performous-1.1/game/surface.hh:4,
                 from /tmp/B.Kwc8NJ/BUILD/performous-1.1/game/surface.cc:1:
/usr/include/boost/mpl/aux_/preprocessed/gcc/placeholders.hpp:29:16: note:   'mpl_::_1'
   29 | typedef arg<1> _1;
      |                ^~
In file included from /usr/include/boost/system/error_code.hpp:19,
                 from /usr/include/boost/filesystem/path_traits.hpp:22,
                 from /usr/include/boost/filesystem/path.hpp:26,
                 from /tmp/B.Kwc8NJ/BUILD/performous-1.1/game/../common/image.hh:3,
                 from /tmp/B.Kwc8NJ/BUILD/performous-1.1/game/surface.hh:4,
                 from /tmp/B.Kwc8NJ/BUILD/performous-1.1/game/surface.cc:1:
/usr/include/c++/10.2.0/functional:221:34: note:   'std::placeholders::_1'
  221 |     extern const _Placeholder<1> _1;
      |                                  ^~
In file included from /usr/include/boost/mpl/aux_/include_preprocessed.hpp:37,
                 from /usr/include/boost/mpl/placeholders.hpp:43,
                 from /usr/include/boost/iterator/iterator_categories.hpp:16,
                 from /usr/include/boost/iterator/iterator_facade.hpp:13,
                 from /usr/include/boost/filesystem/path.hpp:29,
                 from /tmp/B.Kwc8NJ/BUILD/performous-1.1/game/../common/image.hh:3,
                 from /tmp/B.Kwc8NJ/BUILD/performous-1.1/game/surface.hh:4,
                 from /tmp/B.Kwc8NJ/BUILD/performous-1.1/game/surface.cc:1:
/usr/include/boost/mpl/aux_/preprocessed/gcc/placeholders.hpp:29:16: note:   'mpl_::_1'
   29 | typedef arg<1> _1;
      |                ^~
In file included from /usr/include/boost/bind/bind.hpp:2356,
                 from /usr/include/boost/thread/detail/thread.hpp:33,
                 from /usr/include/boost/thread/thread_only.hpp:22,
                 from /usr/include/boost/thread/thread.hpp:12,
                 from /tmp/B.Kwc8NJ/BUILD/performous-1.1/game/surface.cc:11:
/usr/include/boost/bind/placeholders.hpp:46:38: note:   'boost::placeholders::_1'
   46 | BOOST_STATIC_CONSTEXPR boost::arg<1> _1;
      |                                      ^~
In file included from /usr/include/boost/mpl/aux_/include_preprocessed.hpp:37,
                 from /usr/include/boost/mpl/placeholders.hpp:43,
                 from /usr/include/boost/iterator/iterator_categories.hpp:16,
                 from /usr/include/boost/iterator/iterator_facade.hpp:13,
                 from /usr/include/boost/filesystem/path.hpp:29,
                 from /tmp/B.Kwc8NJ/BUILD/performous-1.1/game/../common/image.hh:3,
                 from /tmp/B.Kwc8NJ/BUILD/performous-1.1/game/surface.hh:4,
                 from /tmp/B.Kwc8NJ/BUILD/performous-1.1/game/surface.cc:1:
/usr/include/boost/mpl/aux_/preprocessed/gcc/placeholders.hpp:29:16: note:   'mpl_::_1'
   29 | typedef arg<1> _1;
      |                ^~
make[2]: *** [game/CMakeFiles/performous.dir/build.make:801: game/CMakeFiles/performous.dir/surface.cc.o] Error 1
make[2]: Leaving directory '/tmp/B.Kwc8NJ/BUILD/performous-1.1/build'
make[2]: *** Waiting for unfinished jobs....
make[2]: Entering directory '/tmp/B.Kwc8NJ/BUILD/performous-1.1/build'
[ 91%] Building CXX object game/CMakeFiles/performous.dir/songparser.cc.o
cd /tmp/B.Kwc8NJ/BUILD/performous-1.1/build/game && /usr/bin/x86_64-pld-linux-g++  -DNDEBUG -DUSE_GETTEXT -DUSE_OPENCV -DUSE_PORTMIDI -I/usr/include/SDL2 -I/usr/include/pango-1.0 -I/usr/include/cairo -I/usr/include/freetype2 -I/usr/include/glib-2.0 -I/usr/lib64/glib-2.0/include -I/usr/include/librsvg-2.0 -I/usr/include/gdk-pixbuf-2.0 -I/usr/lib64/libxml++-2.6/include -I/usr/include/libxml++-2.6 -I/usr/include/libxml2 -I/usr/lib64/glibmm-2.4/include -I/usr/include/glibmm-2.4 -I/usr/include/sigc++-2.0 -I/usr/lib64/sigc++-2.0/include -I/usr/include/harfbuzz -I/tmp/B.Kwc8NJ/BUILD/performous-1.1/build/game -isystem /usr/include/opencv  -std=c++11 -Wall -Wextra -fcx-limited-range  -pthread -O2 -fwrapv -pipe -Wformat -Werror=format-security -gdwarf-4 -fno-debug-types-section -fvar-tracking-assignments -g2 -Wp,-D_FORTIFY_SOURCE=2 -fstack-protector-strong --param=ssp-buffer-size=4 -Werror=trampolines -fPIC -march=x86-64 -gdwarf-4 -fno-debug-types-section -fvar-tracking-assignments -g2  -std=gnu++11   -o CMakeFiles/performous.dir/songparser.cc.o -c /tmp/B.Kwc8NJ/BUILD/performous-1.1/game/songparser.cc
make[2]: Leaving directory '/tmp/B.Kwc8NJ/BUILD/performous-1.1/build'
make[2]: Entering directory '/tmp/B.Kwc8NJ/BUILD/performous-1.1/build'
[ 97%] Building CXX object game/CMakeFiles/performous.dir/video.cc.o
cd /tmp/B.Kwc8NJ/BUILD/performous-1.1/build/game && /usr/bin/x86_64-pld-linux-g++  -DNDEBUG -DUSE_GETTEXT -DUSE_OPENCV -DUSE_PORTMIDI -I/usr/include/SDL2 -I/usr/include/pango-1.0 -I/usr/include/cairo -I/usr/include/freetype2 -I/usr/include/glib-2.0 -I/usr/lib64/glib-2.0/include -I/usr/include/librsvg-2.0 -I/usr/include/gdk-pixbuf-2.0 -I/usr/lib64/libxml++-2.6/include -I/usr/include/libxml++-2.6 -I/usr/include/libxml2 -I/usr/lib64/glibmm-2.4/include -I/usr/include/glibmm-2.4 -I/usr/include/sigc++-2.0 -I/usr/lib64/sigc++-2.0/include -I/usr/include/harfbuzz -I/tmp/B.Kwc8NJ/BUILD/performous-1.1/build/game -isystem /usr/include/opencv  -std=c++11 -Wall -Wextra -fcx-limited-range  -pthread -O2 -fwrapv -pipe -Wformat -Werror=format-security -gdwarf-4 -fno-debug-types-section -fvar-tracking-assignments -g2 -Wp,-D_FORTIFY_SOURCE=2 -fstack-protector-strong --param=ssp-buffer-size=4 -Werror=trampolines -fPIC -march=x86-64 -gdwarf-4 -fno-debug-types-section -fvar-tracking-assignments -g2  -std=gnu++11   -o CMakeFiles/performous.dir/video.cc.o -c /tmp/B.Kwc8NJ/BUILD/performous-1.1/game/video.cc
make[2]: Leaving directory '/tmp/B.Kwc8NJ/BUILD/performous-1.1/build'
make[2]: Entering directory '/tmp/B.Kwc8NJ/BUILD/performous-1.1/build'
[ 94%] Building CXX object game/CMakeFiles/performous.dir/theme.cc.o
cd /tmp/B.Kwc8NJ/BUILD/performous-1.1/build/game && /usr/bin/x86_64-pld-linux-g++  -DNDEBUG -DUSE_GETTEXT -DUSE_OPENCV -DUSE_PORTMIDI -I/usr/include/SDL2 -I/usr/include/pango-1.0 -I/usr/include/cairo -I/usr/include/freetype2 -I/usr/include/glib-2.0 -I/usr/lib64/glib-2.0/include -I/usr/include/librsvg-2.0 -I/usr/include/gdk-pixbuf-2.0 -I/usr/lib64/libxml++-2.6/include -I/usr/include/libxml++-2.6 -I/usr/include/libxml2 -I/usr/lib64/glibmm-2.4/include -I/usr/include/glibmm-2.4 -I/usr/include/sigc++-2.0 -I/usr/lib64/sigc++-2.0/include -I/usr/include/harfbuzz -I/tmp/B.Kwc8NJ/BUILD/performous-1.1/build/game -isystem /usr/include/opencv  -std=c++11 -Wall -Wextra -fcx-limited-range  -pthread -O2 -fwrapv -pipe -Wformat -Werror=format-security -gdwarf-4 -fno-debug-types-section -fvar-tracking-assignments -g2 -Wp,-D_FORTIFY_SOURCE=2 -fstack-protector-strong --param=ssp-buffer-size=4 -Werror=trampolines -fPIC -march=x86-64 -gdwarf-4 -fno-debug-types-section -fvar-tracking-assignments -g2  -std=gnu++11   -o CMakeFiles/performous.dir/theme.cc.o -c /tmp/B.Kwc8NJ/BUILD/performous-1.1/game/theme.cc
make[2]: Leaving directory '/tmp/B.Kwc8NJ/BUILD/performous-1.1/build'
make[2]: Entering directory '/tmp/B.Kwc8NJ/BUILD/performous-1.1/build'
[ 99%] Building CXX object game/CMakeFiles/performous.dir/webcam.cc.o
cd /tmp/B.Kwc8NJ/BUILD/performous-1.1/build/game && /usr/bin/x86_64-pld-linux-g++  -DNDEBUG -DUSE_GETTEXT -DUSE_OPENCV -DUSE_PORTMIDI -I/usr/include/SDL2 -I/usr/include/pango-1.0 -I/usr/include/cairo -I/usr/include/freetype2 -I/usr/include/glib-2.0 -I/usr/lib64/glib-2.0/include -I/usr/include/librsvg-2.0 -I/usr/include/gdk-pixbuf-2.0 -I/usr/lib64/libxml++-2.6/include -I/usr/include/libxml++-2.6 -I/usr/include/libxml2 -I/usr/lib64/glibmm-2.4/include -I/usr/include/glibmm-2.4 -I/usr/include/sigc++-2.0 -I/usr/lib64/sigc++-2.0/include -I/usr/include/harfbuzz -I/tmp/B.Kwc8NJ/BUILD/performous-1.1/build/game -isystem /usr/include/opencv  -std=c++11 -Wall -Wextra -fcx-limited-range  -pthread -O2 -fwrapv -pipe -Wformat -Werror=format-security -gdwarf-4 -fno-debug-types-section -fvar-tracking-assignments -g2 -Wp,-D_FORTIFY_SOURCE=2 -fstack-protector-strong --param=ssp-buffer-size=4 -Werror=trampolines -fPIC -march=x86-64 -gdwarf-4 -fno-debug-types-section -fvar-tracking-assignments -g2  -std=gnu++11   -o CMakeFiles/performous.dir/webcam.cc.o -c /tmp/B.Kwc8NJ/BUILD/performous-1.1/game/webcam.cc
make[2]: Leaving directory '/tmp/B.Kwc8NJ/BUILD/performous-1.1/build'
make[2]: Entering directory '/tmp/B.Kwc8NJ/BUILD/performous-1.1/build'
[ 98%] Building CXX object game/CMakeFiles/performous.dir/video_driver.cc.o
cd /tmp/B.Kwc8NJ/BUILD/performous-1.1/build/game && /usr/bin/x86_64-pld-linux-g++  -DNDEBUG -DUSE_GETTEXT -DUSE_OPENCV -DUSE_PORTMIDI -I/usr/include/SDL2 -I/usr/include/pango-1.0 -I/usr/include/cairo -I/usr/include/freetype2 -I/usr/include/glib-2.0 -I/usr/lib64/glib-2.0/include -I/usr/include/librsvg-2.0 -I/usr/include/gdk-pixbuf-2.0 -I/usr/lib64/libxml++-2.6/include -I/usr/include/libxml++-2.6 -I/usr/include/libxml2 -I/usr/lib64/glibmm-2.4/include -I/usr/include/glibmm-2.4 -I/usr/include/sigc++-2.0 -I/usr/lib64/sigc++-2.0/include -I/usr/include/harfbuzz -I/tmp/B.Kwc8NJ/BUILD/performous-1.1/build/game -isystem /usr/include/opencv  -std=c++11 -Wall -Wextra -fcx-limited-range  -pthread -O2 -fwrapv -pipe -Wformat -Werror=format-security -gdwarf-4 -fno-debug-types-section -fvar-tracking-assignments -g2 -Wp,-D_FORTIFY_SOURCE=2 -fstack-protector-strong --param=ssp-buffer-size=4 -Werror=trampolines -fPIC -march=x86-64 -gdwarf-4 -fno-debug-types-section -fvar-tracking-assignments -g2  -std=gnu++11   -o CMakeFiles/performous.dir/video_driver.cc.o -c /tmp/B.Kwc8NJ/BUILD/performous-1.1/game/video_driver.cc
make[2]: Leaving directory '/tmp/B.Kwc8NJ/BUILD/performous-1.1/build'
make[2]: Entering directory '/tmp/B.Kwc8NJ/BUILD/performous-1.1/build'
[ 92%] Building CXX object game/CMakeFiles/performous.dir/songs.cc.o
cd /tmp/B.Kwc8NJ/BUILD/performous-1.1/build/game && /usr/bin/x86_64-pld-linux-g++  -DNDEBUG -DUSE_GETTEXT -DUSE_OPENCV -DUSE_PORTMIDI -I/usr/include/SDL2 -I/usr/include/pango-1.0 -I/usr/include/cairo -I/usr/include/freetype2 -I/usr/include/glib-2.0 -I/usr/lib64/glib-2.0/include -I/usr/include/librsvg-2.0 -I/usr/include/gdk-pixbuf-2.0 -I/usr/lib64/libxml++-2.6/include -I/usr/include/libxml++-2.6 -I/usr/include/libxml2 -I/usr/lib64/glibmm-2.4/include -I/usr/include/glibmm-2.4 -I/usr/include/sigc++-2.0 -I/usr/lib64/sigc++-2.0/include -I/usr/include/harfbuzz -I/tmp/B.Kwc8NJ/BUILD/performous-1.1/build/game -isystem /usr/include/opencv  -std=c++11 -Wall -Wextra -fcx-limited-range  -pthread -O2 -fwrapv -pipe -Wformat -Werror=format-security -gdwarf-4 -fno-debug-types-section -fvar-tracking-assignments -g2 -Wp,-D_FORTIFY_SOURCE=2 -fstack-protector-strong --param=ssp-buffer-size=4 -Werror=trampolines -fPIC -march=x86-64 -gdwarf-4 -fno-debug-types-section -fvar-tracking-assignments -g2  -std=gnu++11   -o CMakeFiles/performous.dir/songs.cc.o -c /tmp/B.Kwc8NJ/BUILD/performous-1.1/game/songs.cc
In file included from /usr/include/boost/bind.hpp:30,
                 from /tmp/B.Kwc8NJ/BUILD/performous-1.1/game/songs.cc:10:
/usr/include/boost/bind.hpp:36:1: note: '#pragma message: The practice of declaring the Bind placeholders (_1, _2, ...) in the global namespace is deprecated. Please use <boost/bind/bind.hpp> + using namespace boost::placeholders, or define BOOST_BIND_GLOBAL_PLACEHOLDERS to retain the current behavior.'
   36 | BOOST_PRAGMA_MESSAGE(
      | ^~~~~~~~~~~~~~~~~~~~
In file included from /usr/include/libxml++-2.6/libxml++/libxml++.h:53,
                 from /tmp/B.Kwc8NJ/BUILD/performous-1.1/game/songs.cc:15:
/usr/include/libxml++-2.6/libxml++/parsers/saxparser.h:224:8: warning: 'template<class> class std::auto_ptr' is deprecated [-Wdeprecated-declarations]
  224 |   std::auto_ptr<_xmlSAXHandler> sax_handler_;
      |        ^~~~~~~~
In file included from /usr/include/c++/10.2.0/memory:83,
                 from /usr/include/boost/config/no_tr1/memory.hpp:21,
                 from /usr/include/boost/smart_ptr/shared_ptr.hpp:23,
                 from /usr/include/boost/shared_ptr.hpp:17,
                 from /usr/include/boost/date_time/time_clock.hpp:17,
                 from /usr/include/boost/thread/thread_time.hpp:9,
                 from /usr/include/boost/thread/xtime.hpp:15,
                 from /tmp/B.Kwc8NJ/BUILD/performous-1.1/game/xtime.hh:4,
                 from /tmp/B.Kwc8NJ/BUILD/performous-1.1/game/animvalue.hh:7,
                 from /tmp/B.Kwc8NJ/BUILD/performous-1.1/game/songs.hh:3,
                 from /tmp/B.Kwc8NJ/BUILD/performous-1.1/game/songs.cc:1:
/usr/include/c++/10.2.0/bits/unique_ptr.h:57:28: note: declared here
   57 |   template<typename> class auto_ptr;
      |                            ^~~~~~~~
In file included from /usr/include/libxml++-2.6/libxml++/libxml++.h:54,
                 from /tmp/B.Kwc8NJ/BUILD/performous-1.1/game/songs.cc:15:
/usr/include/libxml++-2.6/libxml++/parsers/textreader.h:260:10: warning: 'template<class> class std::auto_ptr' is deprecated [-Wdeprecated-declarations]
  260 |     std::auto_ptr<PropertyReader> propertyreader;
      |          ^~~~~~~~
In file included from /usr/include/c++/10.2.0/memory:83,
                 from /usr/include/boost/config/no_tr1/memory.hpp:21,
                 from /usr/include/boost/smart_ptr/shared_ptr.hpp:23,
                 from /usr/include/boost/shared_ptr.hpp:17,
                 from /usr/include/boost/date_time/time_clock.hpp:17,
                 from /usr/include/boost/thread/thread_time.hpp:9,
                 from /usr/include/boost/thread/xtime.hpp:15,
                 from /tmp/B.Kwc8NJ/BUILD/performous-1.1/game/xtime.hh:4,
                 from /tmp/B.Kwc8NJ/BUILD/performous-1.1/game/animvalue.hh:7,
                 from /tmp/B.Kwc8NJ/BUILD/performous-1.1/game/songs.hh:3,
                 from /tmp/B.Kwc8NJ/BUILD/performous-1.1/game/songs.cc:1:
/usr/include/c++/10.2.0/bits/unique_ptr.h:57:28: note: declared here
   57 |   template<typename> class auto_ptr;
      |                            ^~~~~~~~
In file included from /usr/include/libxml++-2.6/libxml++/libxml++.h:69,
                 from /tmp/B.Kwc8NJ/BUILD/performous-1.1/game/songs.cc:15:
/usr/include/libxml++-2.6/libxml++/relaxngschema.h:108:8: warning: 'template<class> class std::auto_ptr' is deprecated [-Wdeprecated-declarations]
  108 |   std::auto_ptr<Impl> pimpl_;
      |        ^~~~~~~~
In file included from /usr/include/c++/10.2.0/memory:83,
                 from /usr/include/boost/config/no_tr1/memory.hpp:21,
                 from /usr/include/boost/smart_ptr/shared_ptr.hpp:23,
                 from /usr/include/boost/shared_ptr.hpp:17,
                 from /usr/include/boost/date_time/time_clock.hpp:17,
                 from /usr/include/boost/thread/thread_time.hpp:9,
                 from /usr/include/boost/thread/xtime.hpp:15,
                 from /tmp/B.Kwc8NJ/BUILD/performous-1.1/game/xtime.hh:4,
                 from /tmp/B.Kwc8NJ/BUILD/performous-1.1/game/animvalue.hh:7,
                 from /tmp/B.Kwc8NJ/BUILD/performous-1.1/game/songs.hh:3,
                 from /tmp/B.Kwc8NJ/BUILD/performous-1.1/game/songs.cc:1:
/usr/include/c++/10.2.0/bits/unique_ptr.h:57:28: note: declared here
   57 |   template<typename> class auto_ptr;
      |                            ^~~~~~~~
In file included from /usr/include/libxml++-2.6/libxml++/libxml++.h:70,
                 from /tmp/B.Kwc8NJ/BUILD/performous-1.1/game/songs.cc:15:
/usr/include/libxml++-2.6/libxml++/xsdschema.h:99:8: warning: 'template<class> class std::auto_ptr' is deprecated [-Wdeprecated-declarations]
   99 |   std::auto_ptr<Impl> pimpl_;
      |        ^~~~~~~~
In file included from /usr/include/c++/10.2.0/memory:83,
                 from /usr/include/boost/config/no_tr1/memory.hpp:21,
                 from /usr/include/boost/smart_ptr/shared_ptr.hpp:23,
                 from /usr/include/boost/shared_ptr.hpp:17,
                 from /usr/include/boost/date_time/time_clock.hpp:17,
                 from /usr/include/boost/thread/thread_time.hpp:9,
                 from /usr/include/boost/thread/xtime.hpp:15,
                 from /tmp/B.Kwc8NJ/BUILD/performous-1.1/game/xtime.hh:4,
                 from /tmp/B.Kwc8NJ/BUILD/performous-1.1/game/animvalue.hh:7,
                 from /tmp/B.Kwc8NJ/BUILD/performous-1.1/game/songs.hh:3,
                 from /tmp/B.Kwc8NJ/BUILD/performous-1.1/game/songs.cc:1:
/usr/include/c++/10.2.0/bits/unique_ptr.h:57:28: note: declared here
   57 |   template<typename> class auto_ptr;
      |                            ^~~~~~~~
In file included from /usr/include/libxml++-2.6/libxml++/libxml++.h:73,
                 from /tmp/B.Kwc8NJ/BUILD/performous-1.1/game/songs.cc:15:
/usr/include/libxml++-2.6/libxml++/validators/relaxngvalidator.h:159:8: warning: 'template<class> class std::auto_ptr' is deprecated [-Wdeprecated-declarations]
  159 |   std::auto_ptr<Impl> pimpl_;
      |        ^~~~~~~~
In file included from /usr/include/c++/10.2.0/memory:83,
                 from /usr/include/boost/config/no_tr1/memory.hpp:21,
                 from /usr/include/boost/smart_ptr/shared_ptr.hpp:23,
                 from /usr/include/boost/shared_ptr.hpp:17,
                 from /usr/include/boost/date_time/time_clock.hpp:17,
                 from /usr/include/boost/thread/thread_time.hpp:9,
                 from /usr/include/boost/thread/xtime.hpp:15,
                 from /tmp/B.Kwc8NJ/BUILD/performous-1.1/game/xtime.hh:4,
                 from /tmp/B.Kwc8NJ/BUILD/performous-1.1/game/animvalue.hh:7,
                 from /tmp/B.Kwc8NJ/BUILD/performous-1.1/game/songs.hh:3,
                 from /tmp/B.Kwc8NJ/BUILD/performous-1.1/game/songs.cc:1:
/usr/include/c++/10.2.0/bits/unique_ptr.h:57:28: note: declared here
   57 |   template<typename> class auto_ptr;
      |                            ^~~~~~~~
In file included from /usr/include/libxml++-2.6/libxml++/libxml++.h:75,
                 from /tmp/B.Kwc8NJ/BUILD/performous-1.1/game/songs.cc:15:
/usr/include/libxml++-2.6/libxml++/validators/xsdvalidator.h:149:8: warning: 'template<class> class std::auto_ptr' is deprecated [-Wdeprecated-declarations]
  149 |   std::auto_ptr<Impl> pimpl_;
      |        ^~~~~~~~
In file included from /usr/include/c++/10.2.0/memory:83,
                 from /usr/include/boost/config/no_tr1/memory.hpp:21,
                 from /usr/include/boost/smart_ptr/shared_ptr.hpp:23,
                 from /usr/include/boost/shared_ptr.hpp:17,
                 from /usr/include/boost/date_time/time_clock.hpp:17,
                 from /usr/include/boost/thread/thread_time.hpp:9,
                 from /usr/include/boost/thread/xtime.hpp:15,
                 from /tmp/B.Kwc8NJ/BUILD/performous-1.1/game/xtime.hh:4,
                 from /tmp/B.Kwc8NJ/BUILD/performous-1.1/game/animvalue.hh:7,
                 from /tmp/B.Kwc8NJ/BUILD/performous-1.1/game/songs.hh:3,
                 from /tmp/B.Kwc8NJ/BUILD/performous-1.1/game/songs.cc:1:
/usr/include/c++/10.2.0/bits/unique_ptr.h:57:28: note: declared here
   57 |   template<typename> class auto_ptr;
      |                            ^~~~~~~~
make[2]: Leaving directory '/tmp/B.Kwc8NJ/BUILD/performous-1.1/build'
make[1]: *** [CMakeFiles/Makefile2:686: game/CMakeFiles/performous.dir/all] Error 2
make: *** [Makefile:175: all] Error 2
error: Bad exit status from /tmp/B.Kwc8NJ/BUILD/tmp/rpm-tmp.93655 (%build)


RPM build errors:
    Bad exit status from /tmp/B.Kwc8NJ/BUILD/tmp/rpm-tmp.93655 (%build)
ended at: Tue Jul 28 19:46:18 2020, done in 0:01:22.894488
error: No files produced.
+ chmod -R u+rwX /tmp/B.Kwc8NJ/BUILD
+ rm -rf /tmp/B.Kwc8NJ/tmp /tmp/B.Kwc8NJ/BUILD
+ rm -rf /tmp/B.Kwc8NJ
Begin-PLD-Builder-Info
Build-Time: user:558.74s sys:37.05s real:85.48s (faults io:0 non-io:7850099)

End-PLD-Builder-Info
[Back to list of logs] [View rpm -qa of builder]