FailedOk

th/SRPMS[OK]
th/x32[OK]
th/i686[OK]
th/x86_64[OK]

ac/SRPMS[OK]
ac/i386[OK]
ac/i586[OK]
ac/i686[OK]
ac/alpha[OK]
ac/amd64[OK]
ac/athlon[OK]
ac/ppc[OK]
ac/sparc[OK]
ac/sparc64[OK]

Advanced Search
main()
Powered by PLD Linux
(c) 2002-2018 PLD Team
$Revision: 1.37 $
Powered by Parallel thinking.
Your IP: 54.221.75.115

perl-Mail-SPF 6ddd930d-169e-4b8c-8864-7b7be1938ea1

Status:Failed
Source URL:ftp://buildlogs.pld-linux.org/th/x86_64/FAIL/perl-Mail-SPF,6ddd930d-169e-4b8c-8864-7b7be1938ea1.bz2
text/plain URL:View!
full text:View!
rpm -qa of builder:View!
Date:2018/06/16 12:37:54
Runtime:0:00:02.936824

Toc:

  • error 1
  • rpm: error: Failed build dependencies:
  • error 2
  • rpm: error: Failed build dependencies:
  • prep
  • Executing(%prep): /bin/sh -e /tmp/B.MqM7Th/BUILD/tmp/rpm-tmp.18920
  • build
  • Executing(%build): /bin/sh -e /tmp/B.MqM7Th/BUILD/tmp/rpm-tmp.18920
  • error 3
  • Parse errors: Bad plan. You planned 23 tests but ran 1.
  • error 4
  • Parse errors: Bad plan. You planned 12 tests but ran 1.
  • error 5
  • error: Bad exit status from /tmp/B.MqM7Th/BUILD/tmp/rpm-tmp.18920 (%build)
  • error 6
  • RPM build errors:
  • error 7
  • error: No files produced.

Content:

checking if we should skip the build
started at: Sat Jun 16 12:37:38 2018
killing old processes on a builder
mesg: ttyname failed: Inappropriate ioctl for device
sending signal 9 to pid -1
Killed
fetching https://srcbuilder.pld-linux.org/th//srpms/6ddd930d-169e-4b8c-8864-7b7be1938ea1/perl-Mail-SPF-2.9.0-2.src.rpm
fetched 113860 bytes, 284.6 K/s
installing srpm: perl-Mail-SPF-2.9.0-2.src.rpm
mesg: ttyname failed: Inappropriate ioctl for device
+ install -d /tmp/B.MqM7Th/BUILD /tmp/B.MqM7Th/RPMS
+ LC_ALL=en_US.UTF-8
+ rpm -qp --changelog perl-Mail-SPF-2.9.0-2.src.rpm
* Sat Jun 16 2018 PLD Linux Team <feedback@pld-linux.org>
- For complete changelog see: http://git.pld-linux.org/?p=packages/perl-Mail-SPF.git;a=log;h=master
* Mon May 28 2018 Marcin Krol <hawk@tld-linux.org> 653876a
- noautoreq Mail::SPF::GlobalMod, its part of Mail::SPF::Mod * Mon May 28 2018 Marcin Krol <hawk@tld-linux.org> ec7e92a
- updated to 2.9.0 + rpm -Uhv --nodeps --define '_topdir /tmp/B.MqM7Th' --define '_specdir %{_topdir}' --define '_sourcedir %{_specdir}' --define '_rpmdir %{_topdir}/RPMS' --define '_builddir %{_topdir}/BUILD' perl-Mail-SPF-2.9.0-2.src.rpm Preparing... ################################################## perl-Mail-SPF ################################################## + rm -f perl-Mail-SPF-2.9.0-2.src.rpm mesg: ttyname failed: Inappropriate ioctl for device + install -m 700 -d /tmp/B.MqM7Th/BUILD/tmp mesg: ttyname failed: Inappropriate ioctl for device + TMPDIR=/tmp/B.MqM7Th/BUILD/tmp + exec nice -n 0 rpmbuild -bp --short-circuit --nodeps --define '_topdir /tmp/B.MqM7Th' --define '_specdir %{_topdir}' --define '_sourcedir %{_specdir}' --define '_rpmdir %{_topdir}/RPMS' --define '_builddir %{_topdir}/BUILD' --target x86_64-pld-linux --define 'prep exit 0' /tmp/B.MqM7Th/perl-Mail-SPF.spec Building target platforms: x86_64-pld-linux checking BuildConflict-ing packages no BuildConflicts found checking BR rpm: error: Failed build dependencies: rpm: perl-Net-DNS-Resolver-Programmable is needed by perl-Mail-SPF-2.9.0-2.src rpm: Building target platforms: x86_64-pld-linux updating poldek cache... ready is up to date Retrieving th::packages.ndir.md... th is up to date Retrieving th::packages.ndir.md... th is up to date Retrieving th-ready::packages.ndir.md... th-ready is up to date Retrieving th-ready::packages.ndir.md... th-ready is up to date Retrieving th-test::packages.ndir.md... th-test is up to date Retrieving th-test::packages.ndir.md... th-test is up to date checking conflicting packages in BRed packages poldek: Loading [pndir]ready... poldek: Loading [pndir]th-test... poldek: Loading [pndir]th-test... poldek: Loading [pndir]th-ready... poldek: Loading [pndir]th-ready... poldek: Loading [pndir]th... poldek: Loading [pndir]th... poldek: 28505 packages read poldek: Removed 1642 duplicate packages from available set poldek: Processing dependencies... poldek: There are 1 package to install: poldek: I perl-Net-DNS-Resolver-Programmable-0.002.2-2.noarch poldek: This operation will use 12.7KB of disk space. poldek: Need to get 12.3KB of archives (12.3KB to download). poldek: poldek: Retrieving th::perl-Net-DNS-Resolver-Programmable-0.002.2-2.noarch.rpm... poldek: ..............................done poldek: Executing pm-command.sh --upgrade -vh --test --root / --define _check_dirname_deps 1... poldek: Preparing... ################################################## no conflicts found checking BR rpm: error: Failed build dependencies: rpm: perl-Net-DNS-Resolver-Programmable is needed by perl-Mail-SPF-2.9.0-2.src rpm: Building target platforms: x86_64-pld-linux installing BR: perl\-Net\-DNS\-Resolver\-Programmable + poldek --noask --caplookup -Q -v '--ignore=hhvm-*' '--ignore=php4-*' '--ignore=php52-*' '--ignore=php54-*' '--ignore=php55-*' '--ignore=php56-*' '--ignore=php70-*' '--ignore=php71-*' '--ignore=php72-*' --upgrade perl-Net-DNS-Resolver-Programmable Loading [pndir]ready... Loading [pndir]th-test... Loading [pndir]th-test... Loading [pndir]th-ready... Loading [pndir]th-ready... Loading [pndir]th... Loading [pndir]th... 28505 packages read Removed 1642 duplicate packages from available set Processing dependencies... There are 1 package to install: I perl-Net-DNS-Resolver-Programmable-0.002.2-2.noarch This operation will use 12.7KB of disk space. Need to get 12.3KB of archives. Executing pm-command.sh --upgrade -vh --root / --define _check_dirname_deps 1... Preparing... ################################################## perl-Net-DNS-Resolver-Progra################################################## building RPM using: set -ex; : build-id: 6ddd930d-169e-4b8c-8864-7b7be1938ea1; TMPDIR=/tmp/B.MqM7Th/BUILD/tmp exec nice -n 0 rpmbuild -bb --define '_smp_mflags -j9' --define '_make_opts -Otarget' --define '_pld_builder 1' --define '_topdir /tmp/B.MqM7Th' --define '_specdir %{_topdir}' --define '_sourcedir %{_specdir}' --define '_rpmdir %{_topdir}/RPMS' --define '_builddir %{_topdir}/BUILD' --target x86_64-pld-linux /tmp/B.MqM7Th/perl-Mail-SPF.spec mesg: ttyname failed: Inappropriate ioctl for device + : build-id: 6ddd930d-169e-4b8c-8864-7b7be1938ea1 + TMPDIR=/tmp/B.MqM7Th/BUILD/tmp + exec nice -n 0 rpmbuild -bb --define '_smp_mflags -j9' --define '_make_opts -Otarget' --define '_pld_builder 1' --define '_topdir /tmp/B.MqM7Th' --define '_specdir %{_topdir}' --define '_sourcedir %{_specdir}' --define '_rpmdir %{_topdir}/RPMS' --define '_builddir %{_topdir}/BUILD' --target x86_64-pld-linux /tmp/B.MqM7Th/perl-Mail-SPF.spec Building target platforms: x86_64-pld-linux Executing(%prep): /bin/sh -e /tmp/B.MqM7Th/BUILD/tmp/rpm-tmp.18920 + umask 022 + cd /tmp/B.MqM7Th/BUILD + cd /tmp/B.MqM7Th/BUILD + rm -rf Mail-SPF-v2.9.0 + /usr/bin/gzip -dc /tmp/B.MqM7Th/Mail-SPF-v2.9.0.tar.gz + /bin/tar -xf - + STATUS=0 + '[' 0 -ne 0 ']' + cd Mail-SPF-v2.9.0 + /bin/id -u + '[' 1000 '=' 0 ']' + /bin/id -u + '[' 1000 '=' 0 ']' + /bin/chmod -Rf a+rX,u+w,g-w,o-w . + echo 'Patch #0 (tests-fix.patch):' Patch #0 (tests-fix.patch): + '[' -f /tmp/B.MqM7Th/tests-fix.patch ']' + /bin/cat /tmp/B.MqM7Th/tests-fix.patch + /usr/bin/patch -s -p1 + exit 0 Executing(%build): /bin/sh -e /tmp/B.MqM7Th/BUILD/tmp/rpm-tmp.18920 TMP=/home/users/builder/tmp HOME=/home/users/builder PATH=/home/users/builder/GNUstep/Tools:/usr/local/bin:/usr/bin:/bin:/home/users/builder/bin TMPDIR=/tmp/B.MqM7Th/BUILD/tmp + umask 022 + cd /tmp/B.MqM7Th/BUILD + cd Mail-SPF-v2.9.0 + /usr/bin/perl Makefile.PL 'INSTALLDIRS=vendor' # running Build.PL --installdirs vendor Checking prerequisites... build_requires: ! Net::DNS::Resolver::Programmable (0.002.2) is installed, but we need version >= 0.003 ERRORS/WARNINGS FOUND IN PREREQUISITES. You may wish to install the versions of the modules indicated above before proceeding with this installation Run 'Build installdeps' to install missing prerequisites. Created MYMETA.yml and MYMETA.json Creating new 'Build' script for 'Mail-SPF' version 'v2.9.0' + /usr/bin/make -Otarget -j9 /usr/bin/perl5.26.2 Build --makefile_env_macros 1 Building Mail-SPF + /usr/bin/make -Otarget -j9 test /usr/bin/perl5.26.2 Build --makefile_env_macros 1 test t/00.00-class-misc.t .......... ok t/00.01-class-util.t .......... ok t/00.02-class-request.t ....... ok t/00.03-class-result.t ........ ok Could not open /etc/resolv.conf: Permission denied at t/00.04-class-server.t line 11. # Looks like your test exited with 13 just after 1. t/00.04-class-server.t ........ Dubious, test returned 13 (wstat 3328, 0xd00) Failed 22/23 subtests Could not open /etc/resolv.conf: Permission denied at t/00.05-class-macrostring.t line 18. # Looks like your test exited with 13 just after 1. t/00.05-class-macrostring.t ... Dubious, test returned 13 (wstat 3328, 0xd00) Failed 11/12 subtests t/00.99-class-misc.t .......... ok t/10.00-rfc4408.t ............. skipped: Mail::SPF::Test required for testing Mail::SPF's RFC compliance t/10.01-rfc4406.t ............. skipped: Mail::SPF::Test required for testing Mail::SPF's RFC compliance t/90-author-pod-validation.t .. ok Test Summary Report ------------------- t/00.04-class-server.t (Wstat: 3328 Tests: 1 Failed: 0) Non-zero exit status: 13 Parse errors: Bad plan. You planned 23 tests but ran 1. t/00.05-class-macrostring.t (Wstat: 3328 Tests: 1 Failed: 0) Non-zero exit status: 13 Parse errors: Bad plan. You planned 12 tests but ran 1. Files=10, Tests=126, 1 wallclock secs ( 0.04 usr 0.03 sys + 1.36 cusr 0.13 csys = 1.56 CPU) Result: FAIL Failed 2/10 test programs. 0/126 subtests failed. make: *** [Makefile:103: test] Error 255 error: Bad exit status from /tmp/B.MqM7Th/BUILD/tmp/rpm-tmp.18920 (%build) RPM build errors: Bad exit status from /tmp/B.MqM7Th/BUILD/tmp/rpm-tmp.18920 (%build) ended at: Sat Jun 16 12:37:54 2018, done in 0:00:02.936824 error: No files produced. mesg: ttyname failed: Inappropriate ioctl for device + chmod -R u+rwX /tmp/B.MqM7Th/BUILD + rm -rf /tmp/B.MqM7Th/tmp /tmp/B.MqM7Th/BUILD mesg: ttyname failed: Inappropriate ioctl for device + rm -rf /tmp/B.MqM7Th Begin-PLD-Builder-Info Build-Time: user:10.16s sys:1.59s real:16.56s (faults io:3 non-io:424296) End-PLD-Builder-Info
[Back to list of logs] [View rpm -qa of builder]