FailedOk

th/SRPMS[OK]
th/x32[OK]
th/i686[OK]
th/x86_64[OK]

ac/SRPMS[OK]
ac/i386[OK]
ac/i586[OK]
ac/i686[OK]
ac/alpha[OK]
ac/amd64[OK]
ac/athlon[OK]
ac/ppc[OK]
ac/sparc[OK]
ac/sparc64[OK]

Advanced Search
main()
Powered by PLD Linux
(c) 2002-2019 PLD Team
$Revision: 1.37 $
Powered by Leppe'.
Your IP: 35.175.120.174

php 359d213b-1a99-41ff-bec6-802213ce6fe6

Status:Failed
Source URL:ftp://buildlogs.pld-linux.org/th/x86_64/FAIL/php,359d213b-1a99-41ff-bec6-802213ce6fe6.bz2
text/plain URL:View!
full text:View!
rpm -qa of builder:View!
Date:2019/10/19 18:36:39
Runtime:0:02:49.302797

Toc:

  • error 1
  • /usr/include/unicode/ubrk.h:353:1: error: conflicting declaration of C function 'void icu_65::swap(icu_65::LocalUBreakIteratorPointer&, icu_65::LocalUBreakIteratorPointer&)'
  • error 2
  • /usr/include/unicode/umsg.h:428:1: error: conflicting declaration of C function 'void icu_65::swap(icu_65::LocalUMessageFormatPointer&, icu_65::LocalUMessageFormatPointer&)'
  • error 3
  • /usr/include/unicode/umsg.h:428:1: error: conflicting declaration of C function 'void icu_65::swap(icu_65::LocalUMessageFormatPointer&, icu_65::LocalUMessageFormatPointer&)'
  • error 4
  • error: Bad exit status from /tmp/B.fBDQFx/BUILD/tmp/rpm-tmp.55091 (%build)
  • error 5
  • RPM build errors:
  • error 6
  • error: No files produced.

Content:

/tmp/B.fBDQFx/BUILD/php-5.3.29/Zend/zend_API.h:229:40: note: declared here
  229 | ZEND_API ZEND_ATTRIBUTE_DEPRECATED int zend_get_parameters_ex(int param_count, ...);
      |                                        ^~~~~~~~~~~~~~~~~~~~~~
/tmp/B.fBDQFx/BUILD/php-5.3.29/ext/imap/php_imap.c: In function 'zif_imap_setannotation':
/tmp/B.fBDQFx/BUILD/php-5.3.29/ext/imap/php_imap.c:1664:2: warning: 'zend_get_parameters_ex' is deprecated [-Wdeprecated-declarations]
 1664 |  if (ZEND_NUM_ARGS() != 5 || zend_get_parameters_ex(5, &streamind, &mailbox, &entry, &attr, &value) == FAILURE) {
      |  ^~
In file included from /tmp/B.fBDQFx/BUILD/php-5.3.29/main/php.h:38,
                 from /tmp/B.fBDQFx/BUILD/php-5.3.29/ext/imap/php_imap.c:37:
/tmp/B.fBDQFx/BUILD/php-5.3.29/Zend/zend_API.h:229:40: note: declared here
  229 | ZEND_API ZEND_ATTRIBUTE_DEPRECATED int zend_get_parameters_ex(int param_count, ...);
      |                                        ^~~~~~~~~~~~~~~~~~~~~~
/tmp/B.fBDQFx/BUILD/php-5.3.29/ext/imap/php_imap.c: In function 'zif_imap_getannotation':
/tmp/B.fBDQFx/BUILD/php-5.3.29/ext/imap/php_imap.c:1712:2: warning: 'zend_get_parameters_ex' is deprecated [-Wdeprecated-declarations]
 1712 |  if(ZEND_NUM_ARGS() != 4 || zend_get_parameters_ex(4, &streamind, &mailbox, &entry, &attr) == FAILURE) {
      |  ^~
In file included from /tmp/B.fBDQFx/BUILD/php-5.3.29/main/php.h:38,
                 from /tmp/B.fBDQFx/BUILD/php-5.3.29/ext/imap/php_imap.c:37:
/tmp/B.fBDQFx/BUILD/php-5.3.29/Zend/zend_API.h:229:40: note: declared here
  229 | ZEND_API ZEND_ATTRIBUTE_DEPRECATED int zend_get_parameters_ex(int param_count, ...);
      |                                        ^~~~~~~~~~~~~~~~~~~~~~
/tmp/B.fBDQFx/BUILD/php-5.3.29/ext/imap/php_imap.c: In function 'zif_imap_status_current':
/tmp/B.fBDQFx/BUILD/php-5.3.29/ext/imap/php_imap.c:3455:3: warning: 'zend_get_parameters_ex' is deprecated [-Wdeprecated-declarations]
 3455 |   if (ZEND_NUM_ARGS() != 2 || zend_get_parameters_ex(2, &streamind, &pflags) == FAILURE) {
      |   ^~
In file included from /tmp/B.fBDQFx/BUILD/php-5.3.29/main/php.h:38,
                 from /tmp/B.fBDQFx/BUILD/php-5.3.29/ext/imap/php_imap.c:37:
/tmp/B.fBDQFx/BUILD/php-5.3.29/Zend/zend_API.h:229:40: note: declared here
  229 | ZEND_API ZEND_ATTRIBUTE_DEPRECATED int zend_get_parameters_ex(int param_count, ...);
      |                                        ^~~~~~~~~~~~~~~~~~~~~~
/bin/sh /tmp/B.fBDQFx/BUILD/php-5.3.29/libtool --silent --preserve-dup-deps --mode=compile x86_64-pld-linux-gcc -I/usr/include  -Iext/intl/ -I/tmp/B.fBDQFx/BUILD/php-5.3.29/ext/intl/ -DPHP_ATOM_INC -I/tmp/B.fBDQFx/BUILD/php-5.3.29/include -I/tmp/B.fBDQFx/BUILD/php-5.3.29/main -I/tmp/B.fBDQFx/BUILD/php-5.3.29 -I/tmp/B.fBDQFx/BUILD/php-5.3.29/ext/date/lib -I/usr/include/libxml2 -I/usr/include/enchant -I/usr/include/freetype2 -I/usr/include/imap -I/tmp/B.fBDQFx/BUILD/php-5.3.29/ext/mbstring/oniguruma -I/tmp/B.fBDQFx/BUILD/php-5.3.29/ext/mbstring/libmbfl -I/tmp/B.fBDQFx/BUILD/php-5.3.29/ext/mbstring/libmbfl/mbfl -I/usr/include/mysql -I/usr/include/pspell -I/usr/include/tidy -I/tmp/B.fBDQFx/BUILD/php-5.3.29/TSRM -I/tmp/B.fBDQFx/BUILD/php-5.3.29/Zend  -DDEBUG_FASTCGI -DHAVE_STRNDUP -DOPENSSL_NO_SSL2=1 -DOPENSSL_NO_SSL3=1 -I/usr/include/xmlrpc-epi  -I/usr/include -O2 -fwrapv -pipe -Wformat -Werror=format-security -gdwarf-4 -fno-debug-types-section -fvar-tracking-assignments -g2 -Wp,-D_FORTIFY_SOURCE=2 -fstack-protector-strong --param=ssp-buffer-size=4 -Werror=trampolines -fPIC -march=x86-64 -gdwarf-4 -fno-debug-types-section -fvar-tracking-assignments -g2   -c /tmp/B.fBDQFx/BUILD/php-5.3.29/ext/intl/msgformat/msgformat_attr.c -o ext/intl/msgformat/msgformat_attr.lo 
/bin/sh /tmp/B.fBDQFx/BUILD/php-5.3.29/libtool --silent --preserve-dup-deps --mode=compile x86_64-pld-linux-gcc -I/usr/include  -Iext/intl/ -I/tmp/B.fBDQFx/BUILD/php-5.3.29/ext/intl/ -DPHP_ATOM_INC -I/tmp/B.fBDQFx/BUILD/php-5.3.29/include -I/tmp/B.fBDQFx/BUILD/php-5.3.29/main -I/tmp/B.fBDQFx/BUILD/php-5.3.29 -I/tmp/B.fBDQFx/BUILD/php-5.3.29/ext/date/lib -I/usr/include/libxml2 -I/usr/include/enchant -I/usr/include/freetype2 -I/usr/include/imap -I/tmp/B.fBDQFx/BUILD/php-5.3.29/ext/mbstring/oniguruma -I/tmp/B.fBDQFx/BUILD/php-5.3.29/ext/mbstring/libmbfl -I/tmp/B.fBDQFx/BUILD/php-5.3.29/ext/mbstring/libmbfl/mbfl -I/usr/include/mysql -I/usr/include/pspell -I/usr/include/tidy -I/tmp/B.fBDQFx/BUILD/php-5.3.29/TSRM -I/tmp/B.fBDQFx/BUILD/php-5.3.29/Zend  -DDEBUG_FASTCGI -DHAVE_STRNDUP -DOPENSSL_NO_SSL2=1 -DOPENSSL_NO_SSL3=1 -I/usr/include/xmlrpc-epi  -I/usr/include -O2 -fwrapv -pipe -Wformat -Werror=format-security -gdwarf-4 -fno-debug-types-section -fvar-tracking-assignments -g2 -Wp,-D_FORTIFY_SOURCE=2 -fstack-protector-strong --param=ssp-buffer-size=4 -Werror=trampolines -fPIC -march=x86-64 -gdwarf-4 -fno-debug-types-section -fvar-tracking-assignments -g2   -c /tmp/B.fBDQFx/BUILD/php-5.3.29/ext/intl/msgformat/msgformat_class.c -o ext/intl/msgformat/msgformat_class.lo 
/bin/sh /tmp/B.fBDQFx/BUILD/php-5.3.29/libtool --silent --preserve-dup-deps --mode=compile x86_64-pld-linux-gcc -I/usr/include  -Iext/intl/ -I/tmp/B.fBDQFx/BUILD/php-5.3.29/ext/intl/ -DPHP_ATOM_INC -I/tmp/B.fBDQFx/BUILD/php-5.3.29/include -I/tmp/B.fBDQFx/BUILD/php-5.3.29/main -I/tmp/B.fBDQFx/BUILD/php-5.3.29 -I/tmp/B.fBDQFx/BUILD/php-5.3.29/ext/date/lib -I/usr/include/libxml2 -I/usr/include/enchant -I/usr/include/freetype2 -I/usr/include/imap -I/tmp/B.fBDQFx/BUILD/php-5.3.29/ext/mbstring/oniguruma -I/tmp/B.fBDQFx/BUILD/php-5.3.29/ext/mbstring/libmbfl -I/tmp/B.fBDQFx/BUILD/php-5.3.29/ext/mbstring/libmbfl/mbfl -I/usr/include/mysql -I/usr/include/pspell -I/usr/include/tidy -I/tmp/B.fBDQFx/BUILD/php-5.3.29/TSRM -I/tmp/B.fBDQFx/BUILD/php-5.3.29/Zend  -DDEBUG_FASTCGI -DHAVE_STRNDUP -DOPENSSL_NO_SSL2=1 -DOPENSSL_NO_SSL3=1 -I/usr/include/xmlrpc-epi  -I/usr/include -O2 -fwrapv -pipe -Wformat -Werror=format-security -gdwarf-4 -fno-debug-types-section -fvar-tracking-assignments -g2 -Wp,-D_FORTIFY_SOURCE=2 -fstack-protector-strong --param=ssp-buffer-size=4 -Werror=trampolines -fPIC -march=x86-64 -gdwarf-4 -fno-debug-types-section -fvar-tracking-assignments -g2   -c /tmp/B.fBDQFx/BUILD/php-5.3.29/ext/intl/msgformat/msgformat.c -o ext/intl/msgformat/msgformat.lo 
/bin/sh /tmp/B.fBDQFx/BUILD/php-5.3.29/libtool --silent --preserve-dup-deps --mode=compile x86_64-pld-linux-gcc -I/usr/include  -Iext/intl/ -I/tmp/B.fBDQFx/BUILD/php-5.3.29/ext/intl/ -DPHP_ATOM_INC -I/tmp/B.fBDQFx/BUILD/php-5.3.29/include -I/tmp/B.fBDQFx/BUILD/php-5.3.29/main -I/tmp/B.fBDQFx/BUILD/php-5.3.29 -I/tmp/B.fBDQFx/BUILD/php-5.3.29/ext/date/lib -I/usr/include/libxml2 -I/usr/include/enchant -I/usr/include/freetype2 -I/usr/include/imap -I/tmp/B.fBDQFx/BUILD/php-5.3.29/ext/mbstring/oniguruma -I/tmp/B.fBDQFx/BUILD/php-5.3.29/ext/mbstring/libmbfl -I/tmp/B.fBDQFx/BUILD/php-5.3.29/ext/mbstring/libmbfl/mbfl -I/usr/include/mysql -I/usr/include/pspell -I/usr/include/tidy -I/tmp/B.fBDQFx/BUILD/php-5.3.29/TSRM -I/tmp/B.fBDQFx/BUILD/php-5.3.29/Zend  -DDEBUG_FASTCGI -DHAVE_STRNDUP -DOPENSSL_NO_SSL2=1 -DOPENSSL_NO_SSL3=1 -I/usr/include/xmlrpc-epi  -I/usr/include -O2 -fwrapv -pipe -Wformat -Werror=format-security -gdwarf-4 -fno-debug-types-section -fvar-tracking-assignments -g2 -Wp,-D_FORTIFY_SOURCE=2 -fstack-protector-strong --param=ssp-buffer-size=4 -Werror=trampolines -fPIC -march=x86-64 -gdwarf-4 -fno-debug-types-section -fvar-tracking-assignments -g2   -c /tmp/B.fBDQFx/BUILD/php-5.3.29/ext/intl/locale/locale_methods.c -o ext/intl/locale/locale_methods.lo 
/bin/sh /tmp/B.fBDQFx/BUILD/php-5.3.29/libtool --silent --preserve-dup-deps --mode=compile x86_64-pld-linux-gcc -I/usr/include  -Iext/intl/ -I/tmp/B.fBDQFx/BUILD/php-5.3.29/ext/intl/ -DPHP_ATOM_INC -I/tmp/B.fBDQFx/BUILD/php-5.3.29/include -I/tmp/B.fBDQFx/BUILD/php-5.3.29/main -I/tmp/B.fBDQFx/BUILD/php-5.3.29 -I/tmp/B.fBDQFx/BUILD/php-5.3.29/ext/date/lib -I/usr/include/libxml2 -I/usr/include/enchant -I/usr/include/freetype2 -I/usr/include/imap -I/tmp/B.fBDQFx/BUILD/php-5.3.29/ext/mbstring/oniguruma -I/tmp/B.fBDQFx/BUILD/php-5.3.29/ext/mbstring/libmbfl -I/tmp/B.fBDQFx/BUILD/php-5.3.29/ext/mbstring/libmbfl/mbfl -I/usr/include/mysql -I/usr/include/pspell -I/usr/include/tidy -I/tmp/B.fBDQFx/BUILD/php-5.3.29/TSRM -I/tmp/B.fBDQFx/BUILD/php-5.3.29/Zend  -DDEBUG_FASTCGI -DHAVE_STRNDUP -DOPENSSL_NO_SSL2=1 -DOPENSSL_NO_SSL3=1 -I/usr/include/xmlrpc-epi  -I/usr/include -O2 -fwrapv -pipe -Wformat -Werror=format-security -gdwarf-4 -fno-debug-types-section -fvar-tracking-assignments -g2 -Wp,-D_FORTIFY_SOURCE=2 -fstack-protector-strong --param=ssp-buffer-size=4 -Werror=trampolines -fPIC -march=x86-64 -gdwarf-4 -fno-debug-types-section -fvar-tracking-assignments -g2   -c /tmp/B.fBDQFx/BUILD/php-5.3.29/ext/intl/msgformat/msgformat_data.c -o ext/intl/msgformat/msgformat_data.lo 
/bin/sh /tmp/B.fBDQFx/BUILD/php-5.3.29/libtool --silent --preserve-dup-deps --mode=compile x86_64-pld-linux-gcc -I/usr/include  -Iext/intl/ -I/tmp/B.fBDQFx/BUILD/php-5.3.29/ext/intl/ -DPHP_ATOM_INC -I/tmp/B.fBDQFx/BUILD/php-5.3.29/include -I/tmp/B.fBDQFx/BUILD/php-5.3.29/main -I/tmp/B.fBDQFx/BUILD/php-5.3.29 -I/tmp/B.fBDQFx/BUILD/php-5.3.29/ext/date/lib -I/usr/include/libxml2 -I/usr/include/enchant -I/usr/include/freetype2 -I/usr/include/imap -I/tmp/B.fBDQFx/BUILD/php-5.3.29/ext/mbstring/oniguruma -I/tmp/B.fBDQFx/BUILD/php-5.3.29/ext/mbstring/libmbfl -I/tmp/B.fBDQFx/BUILD/php-5.3.29/ext/mbstring/libmbfl/mbfl -I/usr/include/mysql -I/usr/include/pspell -I/usr/include/tidy -I/tmp/B.fBDQFx/BUILD/php-5.3.29/TSRM -I/tmp/B.fBDQFx/BUILD/php-5.3.29/Zend  -DDEBUG_FASTCGI -DHAVE_STRNDUP -DOPENSSL_NO_SSL2=1 -DOPENSSL_NO_SSL3=1 -I/usr/include/xmlrpc-epi  -I/usr/include -O2 -fwrapv -pipe -Wformat -Werror=format-security -gdwarf-4 -fno-debug-types-section -fvar-tracking-assignments -g2 -Wp,-D_FORTIFY_SOURCE=2 -fstack-protector-strong --param=ssp-buffer-size=4 -Werror=trampolines -fPIC -march=x86-64 -gdwarf-4 -fno-debug-types-section -fvar-tracking-assignments -g2   -c /tmp/B.fBDQFx/BUILD/php-5.3.29/ext/intl/msgformat/msgformat_format.c -o ext/intl/msgformat/msgformat_format.lo 
/bin/sh /tmp/B.fBDQFx/BUILD/php-5.3.29/libtool --silent --preserve-dup-deps --mode=compile x86_64-pld-linux-gcc -I/tmp/B.fBDQFx/BUILD/php-5.3.29/ext/fileinfo/libmagic -Iext/fileinfo/ -I/tmp/B.fBDQFx/BUILD/php-5.3.29/ext/fileinfo/ -DPHP_ATOM_INC -I/tmp/B.fBDQFx/BUILD/php-5.3.29/include -I/tmp/B.fBDQFx/BUILD/php-5.3.29/main -I/tmp/B.fBDQFx/BUILD/php-5.3.29 -I/tmp/B.fBDQFx/BUILD/php-5.3.29/ext/date/lib -I/usr/include/libxml2 -I/usr/include/enchant -I/usr/include/freetype2 -I/usr/include/imap -I/tmp/B.fBDQFx/BUILD/php-5.3.29/ext/mbstring/oniguruma -I/tmp/B.fBDQFx/BUILD/php-5.3.29/ext/mbstring/libmbfl -I/tmp/B.fBDQFx/BUILD/php-5.3.29/ext/mbstring/libmbfl/mbfl -I/usr/include/mysql -I/usr/include/pspell -I/usr/include/tidy -I/tmp/B.fBDQFx/BUILD/php-5.3.29/TSRM -I/tmp/B.fBDQFx/BUILD/php-5.3.29/Zend  -DDEBUG_FASTCGI -DHAVE_STRNDUP -DOPENSSL_NO_SSL2=1 -DOPENSSL_NO_SSL3=1 -I/usr/include/xmlrpc-epi  -I/usr/include -O2 -fwrapv -pipe -Wformat -Werror=format-security -gdwarf-4 -fno-debug-types-section -fvar-tracking-assignments -g2 -Wp,-D_FORTIFY_SOURCE=2 -fstack-protector-strong --param=ssp-buffer-size=4 -Werror=trampolines -fPIC -march=x86-64 -gdwarf-4 -fno-debug-types-section -fvar-tracking-assignments -g2   -c /tmp/B.fBDQFx/BUILD/php-5.3.29/ext/fileinfo/libmagic/apprentice.c -o ext/fileinfo/libmagic/apprentice.lo 
/bin/sh /tmp/B.fBDQFx/BUILD/php-5.3.29/libtool --silent --preserve-dup-deps --mode=compile x86_64-pld-linux-gcc -I/usr/include  -Iext/intl/ -I/tmp/B.fBDQFx/BUILD/php-5.3.29/ext/intl/ -DPHP_ATOM_INC -I/tmp/B.fBDQFx/BUILD/php-5.3.29/include -I/tmp/B.fBDQFx/BUILD/php-5.3.29/main -I/tmp/B.fBDQFx/BUILD/php-5.3.29 -I/tmp/B.fBDQFx/BUILD/php-5.3.29/ext/date/lib -I/usr/include/libxml2 -I/usr/include/enchant -I/usr/include/freetype2 -I/usr/include/imap -I/tmp/B.fBDQFx/BUILD/php-5.3.29/ext/mbstring/oniguruma -I/tmp/B.fBDQFx/BUILD/php-5.3.29/ext/mbstring/libmbfl -I/tmp/B.fBDQFx/BUILD/php-5.3.29/ext/mbstring/libmbfl/mbfl -I/usr/include/mysql -I/usr/include/pspell -I/usr/include/tidy -I/tmp/B.fBDQFx/BUILD/php-5.3.29/TSRM -I/tmp/B.fBDQFx/BUILD/php-5.3.29/Zend  -DDEBUG_FASTCGI -DHAVE_STRNDUP -DOPENSSL_NO_SSL2=1 -DOPENSSL_NO_SSL3=1 -I/usr/include/xmlrpc-epi  -I/usr/include -O2 -fwrapv -pipe -Wformat -Werror=format-security -gdwarf-4 -fno-debug-types-section -fvar-tracking-assignments -g2 -Wp,-D_FORTIFY_SOURCE=2 -fstack-protector-strong --param=ssp-buffer-size=4 -Werror=trampolines -fPIC -march=x86-64 -gdwarf-4 -fno-debug-types-section -fvar-tracking-assignments -g2   -c /tmp/B.fBDQFx/BUILD/php-5.3.29/ext/intl/msgformat/msgformat_parse.c -o ext/intl/msgformat/msgformat_parse.lo 
/bin/sh /tmp/B.fBDQFx/BUILD/php-5.3.29/libtool --silent --preserve-dup-deps --mode=compile x86_64-pld-linux-gcc -I/usr/include  -Iext/intl/ -I/tmp/B.fBDQFx/BUILD/php-5.3.29/ext/intl/ -DPHP_ATOM_INC -I/tmp/B.fBDQFx/BUILD/php-5.3.29/include -I/tmp/B.fBDQFx/BUILD/php-5.3.29/main -I/tmp/B.fBDQFx/BUILD/php-5.3.29 -I/tmp/B.fBDQFx/BUILD/php-5.3.29/ext/date/lib -I/usr/include/libxml2 -I/usr/include/enchant -I/usr/include/freetype2 -I/usr/include/imap -I/tmp/B.fBDQFx/BUILD/php-5.3.29/ext/mbstring/oniguruma -I/tmp/B.fBDQFx/BUILD/php-5.3.29/ext/mbstring/libmbfl -I/tmp/B.fBDQFx/BUILD/php-5.3.29/ext/mbstring/libmbfl/mbfl -I/usr/include/mysql -I/usr/include/pspell -I/usr/include/tidy -I/tmp/B.fBDQFx/BUILD/php-5.3.29/TSRM -I/tmp/B.fBDQFx/BUILD/php-5.3.29/Zend  -DDEBUG_FASTCGI -DHAVE_STRNDUP -DOPENSSL_NO_SSL2=1 -DOPENSSL_NO_SSL3=1 -I/usr/include/xmlrpc-epi  -I/usr/include -O2 -fwrapv -pipe -Wformat -Werror=format-security -gdwarf-4 -fno-debug-types-section -fvar-tracking-assignments -g2 -Wp,-D_FORTIFY_SOURCE=2 -fstack-protector-strong --param=ssp-buffer-size=4 -Werror=trampolines -fPIC -march=x86-64 -gdwarf-4 -fno-debug-types-section -fvar-tracking-assignments -g2   -c /tmp/B.fBDQFx/BUILD/php-5.3.29/ext/intl/resourcebundle/resourcebundle.c -o ext/intl/resourcebundle/resourcebundle.lo 
In file included from /tmp/B.fBDQFx/BUILD/php-5.3.29/Zend/zend.h:237,
                 from /tmp/B.fBDQFx/BUILD/php-5.3.29/ext/intl/resourcebundle/resourcebundle.c:19:
/tmp/B.fBDQFx/BUILD/php-5.3.29/ext/intl/resourcebundle/resourcebundle.c: In function 'resourcebundle_extract_value':
/tmp/B.fBDQFx/BUILD/php-5.3.29/Zend/zend_alloc.h:72:33: warning: passing argument 1 of '_efree' discards 'const' qualifier from pointer target type [-Wdiscarded-qualifiers]
   72 | #define efree(ptr)       _efree((ptr) ZEND_FILE_LINE_CC ZEND_FILE_LINE_EMPTY_CC)
      |                                 ^~~~~
ext/intl/intl_data.h:82:3: note: in expansion of macro 'efree'
   82 |   efree(ustring);                   \
      |   ^~~~~
/tmp/B.fBDQFx/BUILD/php-5.3.29/ext/intl/resourcebundle/resourcebundle.c:44:4: note: in expansion of macro 'INTL_METHOD_RETVAL_UTF8'
   44 |    INTL_METHOD_RETVAL_UTF8(source, ufield, ilen, 0);
      |    ^~~~~~~~~~~~~~~~~~~~~~~
/tmp/B.fBDQFx/BUILD/php-5.3.29/Zend/zend_alloc.h:60:28: note: expected 'void *' but argument is of type 'const UChar *' {aka 'const short unsigned int *'}
   60 | ZEND_API void _efree(void *ptr ZEND_FILE_LINE_DC ZEND_FILE_LINE_ORIG_DC);
      |                      ~~~~~~^~~
/bin/sh /tmp/B.fBDQFx/BUILD/php-5.3.29/libtool --silent --preserve-dup-deps --mode=compile x86_64-pld-linux-gcc -I/usr/include  -Iext/intl/ -I/tmp/B.fBDQFx/BUILD/php-5.3.29/ext/intl/ -DPHP_ATOM_INC -I/tmp/B.fBDQFx/BUILD/php-5.3.29/include -I/tmp/B.fBDQFx/BUILD/php-5.3.29/main -I/tmp/B.fBDQFx/BUILD/php-5.3.29 -I/tmp/B.fBDQFx/BUILD/php-5.3.29/ext/date/lib -I/usr/include/libxml2 -I/usr/include/enchant -I/usr/include/freetype2 -I/usr/include/imap -I/tmp/B.fBDQFx/BUILD/php-5.3.29/ext/mbstring/oniguruma -I/tmp/B.fBDQFx/BUILD/php-5.3.29/ext/mbstring/libmbfl -I/tmp/B.fBDQFx/BUILD/php-5.3.29/ext/mbstring/libmbfl/mbfl -I/usr/include/mysql -I/usr/include/pspell -I/usr/include/tidy -I/tmp/B.fBDQFx/BUILD/php-5.3.29/TSRM -I/tmp/B.fBDQFx/BUILD/php-5.3.29/Zend  -DDEBUG_FASTCGI -DHAVE_STRNDUP -DOPENSSL_NO_SSL2=1 -DOPENSSL_NO_SSL3=1 -I/usr/include/xmlrpc-epi  -I/usr/include -O2 -fwrapv -pipe -Wformat -Werror=format-security -gdwarf-4 -fno-debug-types-section -fvar-tracking-assignments -g2 -Wp,-D_FORTIFY_SOURCE=2 -fstack-protector-strong --param=ssp-buffer-size=4 -Werror=trampolines -fPIC -march=x86-64 -gdwarf-4 -fno-debug-types-section -fvar-tracking-assignments -g2   -c /tmp/B.fBDQFx/BUILD/php-5.3.29/ext/intl/resourcebundle/resourcebundle_iterator.c -o ext/intl/resourcebundle/resourcebundle_iterator.lo 
/bin/sh /tmp/B.fBDQFx/BUILD/php-5.3.29/libtool --silent --preserve-dup-deps --mode=compile x86_64-pld-linux-gcc -I/usr/include  -Iext/intl/ -I/tmp/B.fBDQFx/BUILD/php-5.3.29/ext/intl/ -DPHP_ATOM_INC -I/tmp/B.fBDQFx/BUILD/php-5.3.29/include -I/tmp/B.fBDQFx/BUILD/php-5.3.29/main -I/tmp/B.fBDQFx/BUILD/php-5.3.29 -I/tmp/B.fBDQFx/BUILD/php-5.3.29/ext/date/lib -I/usr/include/libxml2 -I/usr/include/enchant -I/usr/include/freetype2 -I/usr/include/imap -I/tmp/B.fBDQFx/BUILD/php-5.3.29/ext/mbstring/oniguruma -I/tmp/B.fBDQFx/BUILD/php-5.3.29/ext/mbstring/libmbfl -I/tmp/B.fBDQFx/BUILD/php-5.3.29/ext/mbstring/libmbfl/mbfl -I/usr/include/mysql -I/usr/include/pspell -I/usr/include/tidy -I/tmp/B.fBDQFx/BUILD/php-5.3.29/TSRM -I/tmp/B.fBDQFx/BUILD/php-5.3.29/Zend  -DDEBUG_FASTCGI -DHAVE_STRNDUP -DOPENSSL_NO_SSL2=1 -DOPENSSL_NO_SSL3=1 -I/usr/include/xmlrpc-epi  -I/usr/include -O2 -fwrapv -pipe -Wformat -Werror=format-security -gdwarf-4 -fno-debug-types-section -fvar-tracking-assignments -g2 -Wp,-D_FORTIFY_SOURCE=2 -fstack-protector-strong --param=ssp-buffer-size=4 -Werror=trampolines -fPIC -march=x86-64 -gdwarf-4 -fno-debug-types-section -fvar-tracking-assignments -g2   -c /tmp/B.fBDQFx/BUILD/php-5.3.29/ext/intl/idn/idn.c -o ext/intl/idn/idn.lo 
/tmp/B.fBDQFx/BUILD/php-5.3.29/ext/intl/idn/idn.c: In function 'php_intl_idn_to':
/tmp/B.fBDQFx/BUILD/php-5.3.29/ext/intl/idn/idn.c:97:4: warning: 'uidna_IDNToASCII_65' is deprecated [-Wdeprecated-declarations]
   97 |    converted_ret_len = uidna_IDNToASCII(ustring, ustring_len, converted, MAXPATHLEN, (int32_t)option, &parse_error, &status);
      |    ^~~~~~~~~~~~~~~~~
In file included from /usr/include/unicode/platform.h:25,
                 from /usr/include/unicode/ptypes.h:52,
                 from /usr/include/unicode/umachine.h:46,
                 from /usr/include/unicode/utypes.h:38,
                 from /usr/include/unicode/uidna.h:22,
                 from /tmp/B.fBDQFx/BUILD/php-5.3.29/ext/intl/idn/idn.c:27:
/usr/include/unicode/uidna.h:675:1: note: declared here
  675 | uidna_IDNToASCII(  const UChar* src, int32_t srcLength,
      | ^~~~~~~~~~~~~~~~
/tmp/B.fBDQFx/BUILD/php-5.3.29/ext/intl/idn/idn.c:99:4: warning: 'uidna_IDNToUnicode_65' is deprecated [-Wdeprecated-declarations]
   99 |    converted_ret_len = uidna_IDNToUnicode(ustring, ustring_len, converted, MAXPATHLEN, (int32_t)option, &parse_error, &status);
      |    ^~~~~~~~~~~~~~~~~
In file included from /usr/include/unicode/platform.h:25,
                 from /usr/include/unicode/ptypes.h:52,
                 from /usr/include/unicode/umachine.h:46,
                 from /usr/include/unicode/utypes.h:38,
                 from /usr/include/unicode/uidna.h:22,
                 from /tmp/B.fBDQFx/BUILD/php-5.3.29/ext/intl/idn/idn.c:27:
/usr/include/unicode/uidna.h:722:1: note: declared here
  722 | uidna_IDNToUnicode(  const UChar* src, int32_t srcLength,
      | ^~~~~~~~~~~~~~~~~~
/bin/sh /tmp/B.fBDQFx/BUILD/php-5.3.29/libtool --silent --preserve-dup-deps --mode=compile x86_64-pld-linux-gcc  -Iext/json/ -I/tmp/B.fBDQFx/BUILD/php-5.3.29/ext/json/ -DPHP_ATOM_INC -I/tmp/B.fBDQFx/BUILD/php-5.3.29/include -I/tmp/B.fBDQFx/BUILD/php-5.3.29/main -I/tmp/B.fBDQFx/BUILD/php-5.3.29 -I/tmp/B.fBDQFx/BUILD/php-5.3.29/ext/date/lib -I/usr/include/libxml2 -I/usr/include/enchant -I/usr/include/freetype2 -I/usr/include/imap -I/tmp/B.fBDQFx/BUILD/php-5.3.29/ext/mbstring/oniguruma -I/tmp/B.fBDQFx/BUILD/php-5.3.29/ext/mbstring/libmbfl -I/tmp/B.fBDQFx/BUILD/php-5.3.29/ext/mbstring/libmbfl/mbfl -I/usr/include/mysql -I/usr/include/pspell -I/usr/include/tidy -I/tmp/B.fBDQFx/BUILD/php-5.3.29/TSRM -I/tmp/B.fBDQFx/BUILD/php-5.3.29/Zend  -DDEBUG_FASTCGI -DHAVE_STRNDUP -DOPENSSL_NO_SSL2=1 -DOPENSSL_NO_SSL3=1 -I/usr/include/xmlrpc-epi  -I/usr/include -O2 -fwrapv -pipe -Wformat -Werror=format-security -gdwarf-4 -fno-debug-types-section -fvar-tracking-assignments -g2 -Wp,-D_FORTIFY_SOURCE=2 -fstack-protector-strong --param=ssp-buffer-size=4 -Werror=trampolines -fPIC -march=x86-64 -gdwarf-4 -fno-debug-types-section -fvar-tracking-assignments -g2   -c /tmp/B.fBDQFx/BUILD/php-5.3.29/ext/json/utf8_to_utf16.c -o ext/json/utf8_to_utf16.lo 
/bin/sh /tmp/B.fBDQFx/BUILD/php-5.3.29/libtool --silent --preserve-dup-deps --mode=compile x86_64-pld-linux-gcc -I/usr/include  -Iext/intl/ -I/tmp/B.fBDQFx/BUILD/php-5.3.29/ext/intl/ -DPHP_ATOM_INC -I/tmp/B.fBDQFx/BUILD/php-5.3.29/include -I/tmp/B.fBDQFx/BUILD/php-5.3.29/main -I/tmp/B.fBDQFx/BUILD/php-5.3.29 -I/tmp/B.fBDQFx/BUILD/php-5.3.29/ext/date/lib -I/usr/include/libxml2 -I/usr/include/enchant -I/usr/include/freetype2 -I/usr/include/imap -I/tmp/B.fBDQFx/BUILD/php-5.3.29/ext/mbstring/oniguruma -I/tmp/B.fBDQFx/BUILD/php-5.3.29/ext/mbstring/libmbfl -I/tmp/B.fBDQFx/BUILD/php-5.3.29/ext/mbstring/libmbfl/mbfl -I/usr/include/mysql -I/usr/include/pspell -I/usr/include/tidy -I/tmp/B.fBDQFx/BUILD/php-5.3.29/TSRM -I/tmp/B.fBDQFx/BUILD/php-5.3.29/Zend  -DDEBUG_FASTCGI -DHAVE_STRNDUP -DOPENSSL_NO_SSL2=1 -DOPENSSL_NO_SSL3=1 -I/usr/include/xmlrpc-epi  -I/usr/include -O2 -fwrapv -pipe -Wformat -Werror=format-security -gdwarf-4 -fno-debug-types-section -fvar-tracking-assignments -g2 -Wp,-D_FORTIFY_SOURCE=2 -fstack-protector-strong --param=ssp-buffer-size=4 -Werror=trampolines -fPIC -march=x86-64 -gdwarf-4 -fno-debug-types-section -fvar-tracking-assignments -g2   -c /tmp/B.fBDQFx/BUILD/php-5.3.29/ext/intl/grapheme/grapheme_util.c -o ext/intl/grapheme/grapheme_util.lo 
/bin/sh /tmp/B.fBDQFx/BUILD/php-5.3.29/libtool --silent --preserve-dup-deps --mode=compile x86_64-pld-linux-gcc -I/usr/include  -Iext/intl/ -I/tmp/B.fBDQFx/BUILD/php-5.3.29/ext/intl/ -DPHP_ATOM_INC -I/tmp/B.fBDQFx/BUILD/php-5.3.29/include -I/tmp/B.fBDQFx/BUILD/php-5.3.29/main -I/tmp/B.fBDQFx/BUILD/php-5.3.29 -I/tmp/B.fBDQFx/BUILD/php-5.3.29/ext/date/lib -I/usr/include/libxml2 -I/usr/include/enchant -I/usr/include/freetype2 -I/usr/include/imap -I/tmp/B.fBDQFx/BUILD/php-5.3.29/ext/mbstring/oniguruma -I/tmp/B.fBDQFx/BUILD/php-5.3.29/ext/mbstring/libmbfl -I/tmp/B.fBDQFx/BUILD/php-5.3.29/ext/mbstring/libmbfl/mbfl -I/usr/include/mysql -I/usr/include/pspell -I/usr/include/tidy -I/tmp/B.fBDQFx/BUILD/php-5.3.29/TSRM -I/tmp/B.fBDQFx/BUILD/php-5.3.29/Zend  -DDEBUG_FASTCGI -DHAVE_STRNDUP -DOPENSSL_NO_SSL2=1 -DOPENSSL_NO_SSL3=1 -I/usr/include/xmlrpc-epi  -I/usr/include -O2 -fwrapv -pipe -Wformat -Werror=format-security -gdwarf-4 -fno-debug-types-section -fvar-tracking-assignments -g2 -Wp,-D_FORTIFY_SOURCE=2 -fstack-protector-strong --param=ssp-buffer-size=4 -Werror=trampolines -fPIC -march=x86-64 -gdwarf-4 -fno-debug-types-section -fvar-tracking-assignments -g2   -c /tmp/B.fBDQFx/BUILD/php-5.3.29/ext/intl/resourcebundle/resourcebundle_class.c -o ext/intl/resourcebundle/resourcebundle_class.lo 
/bin/sh /tmp/B.fBDQFx/BUILD/php-5.3.29/libtool --silent --preserve-dup-deps --mode=compile x86_64-pld-linux-gcc  -Iext/json/ -I/tmp/B.fBDQFx/BUILD/php-5.3.29/ext/json/ -DPHP_ATOM_INC -I/tmp/B.fBDQFx/BUILD/php-5.3.29/include -I/tmp/B.fBDQFx/BUILD/php-5.3.29/main -I/tmp/B.fBDQFx/BUILD/php-5.3.29 -I/tmp/B.fBDQFx/BUILD/php-5.3.29/ext/date/lib -I/usr/include/libxml2 -I/usr/include/enchant -I/usr/include/freetype2 -I/usr/include/imap -I/tmp/B.fBDQFx/BUILD/php-5.3.29/ext/mbstring/oniguruma -I/tmp/B.fBDQFx/BUILD/php-5.3.29/ext/mbstring/libmbfl -I/tmp/B.fBDQFx/BUILD/php-5.3.29/ext/mbstring/libmbfl/mbfl -I/usr/include/mysql -I/usr/include/pspell -I/usr/include/tidy -I/tmp/B.fBDQFx/BUILD/php-5.3.29/TSRM -I/tmp/B.fBDQFx/BUILD/php-5.3.29/Zend  -DDEBUG_FASTCGI -DHAVE_STRNDUP -DOPENSSL_NO_SSL2=1 -DOPENSSL_NO_SSL3=1 -I/usr/include/xmlrpc-epi  -I/usr/include -O2 -fwrapv -pipe -Wformat -Werror=format-security -gdwarf-4 -fno-debug-types-section -fvar-tracking-assignments -g2 -Wp,-D_FORTIFY_SOURCE=2 -fstack-protector-strong --param=ssp-buffer-size=4 -Werror=trampolines -fPIC -march=x86-64 -gdwarf-4 -fno-debug-types-section -fvar-tracking-assignments -g2   -c /tmp/B.fBDQFx/BUILD/php-5.3.29/ext/json/utf8_decode.c -o ext/json/utf8_decode.lo 
/bin/sh /tmp/B.fBDQFx/BUILD/php-5.3.29/libtool --silent --preserve-dup-deps --mode=compile x86_64-pld-linux-gcc -I/usr/include  -Iext/intl/ -I/tmp/B.fBDQFx/BUILD/php-5.3.29/ext/intl/ -DPHP_ATOM_INC -I/tmp/B.fBDQFx/BUILD/php-5.3.29/include -I/tmp/B.fBDQFx/BUILD/php-5.3.29/main -I/tmp/B.fBDQFx/BUILD/php-5.3.29 -I/tmp/B.fBDQFx/BUILD/php-5.3.29/ext/date/lib -I/usr/include/libxml2 -I/usr/include/enchant -I/usr/include/freetype2 -I/usr/include/imap -I/tmp/B.fBDQFx/BUILD/php-5.3.29/ext/mbstring/oniguruma -I/tmp/B.fBDQFx/BUILD/php-5.3.29/ext/mbstring/libmbfl -I/tmp/B.fBDQFx/BUILD/php-5.3.29/ext/mbstring/libmbfl/mbfl -I/usr/include/mysql -I/usr/include/pspell -I/usr/include/tidy -I/tmp/B.fBDQFx/BUILD/php-5.3.29/TSRM -I/tmp/B.fBDQFx/BUILD/php-5.3.29/Zend  -DDEBUG_FASTCGI -DHAVE_STRNDUP -DOPENSSL_NO_SSL2=1 -DOPENSSL_NO_SSL3=1 -I/usr/include/xmlrpc-epi  -I/usr/include -O2 -fwrapv -pipe -Wformat -Werror=format-security -gdwarf-4 -fno-debug-types-section -fvar-tracking-assignments -g2 -Wp,-D_FORTIFY_SOURCE=2 -fstack-protector-strong --param=ssp-buffer-size=4 -Werror=trampolines -fPIC -march=x86-64 -gdwarf-4 -fno-debug-types-section -fvar-tracking-assignments -g2   -c /tmp/B.fBDQFx/BUILD/php-5.3.29/ext/intl/grapheme/grapheme_string.c -o ext/intl/grapheme/grapheme_string.lo 
In file included from /tmp/B.fBDQFx/BUILD/php-5.3.29/ext/intl/grapheme/grapheme_string.c:24:
/tmp/B.fBDQFx/BUILD/php-5.3.29/ext/intl/grapheme/grapheme_util.h:45:14: warning: inline function 'grapheme_memrchr_grapheme' declared but never defined
   45 | inline void *grapheme_memrchr_grapheme(const void *s, int c, int32_t n);
      |              ^~~~~~~~~~~~~~~~~~~~~~~~~
/bin/sh /tmp/B.fBDQFx/BUILD/php-5.3.29/libtool --silent --preserve-dup-deps --mode=compile x86_64-pld-linux-gcc  -DNOT_RUBY -DONIG_ESCAPE_UCHAR_COLLISION=1 -DUChar=OnigUChar -DHAVE_CONFIG_H -Iext/mbstring/ -I/tmp/B.fBDQFx/BUILD/php-5.3.29/ext/mbstring/ -DPHP_ATOM_INC -I/tmp/B.fBDQFx/BUILD/php-5.3.29/include -I/tmp/B.fBDQFx/BUILD/php-5.3.29/main -I/tmp/B.fBDQFx/BUILD/php-5.3.29 -I/tmp/B.fBDQFx/BUILD/php-5.3.29/ext/date/lib -I/usr/include/libxml2 -I/usr/include/enchant -I/usr/include/freetype2 -I/usr/include/imap -I/tmp/B.fBDQFx/BUILD/php-5.3.29/ext/mbstring/oniguruma -I/tmp/B.fBDQFx/BUILD/php-5.3.29/ext/mbstring/libmbfl -I/tmp/B.fBDQFx/BUILD/php-5.3.29/ext/mbstring/libmbfl/mbfl -I/usr/include/mysql -I/usr/include/pspell -I/usr/include/tidy -I/tmp/B.fBDQFx/BUILD/php-5.3.29/TSRM -I/tmp/B.fBDQFx/BUILD/php-5.3.29/Zend  -DDEBUG_FASTCGI -DHAVE_STRNDUP -DOPENSSL_NO_SSL2=1 -DOPENSSL_NO_SSL3=1 -I/usr/include/xmlrpc-epi  -I/usr/include -O2 -fwrapv -pipe -Wformat -Werror=format-security -gdwarf-4 -fno-debug-types-section -fvar-tracking-assignments -g2 -Wp,-D_FORTIFY_SOURCE=2 -fstack-protector-strong --param=ssp-buffer-size=4 -Werror=trampolines -fPIC -march=x86-64 -gdwarf-4 -fno-debug-types-section -fvar-tracking-assignments -g2   -c /tmp/B.fBDQFx/BUILD/php-5.3.29/ext/mbstring/oniguruma/reggnu.c -o ext/mbstring/oniguruma/reggnu.lo 
/bin/sh /tmp/B.fBDQFx/BUILD/php-5.3.29/libtool --silent --preserve-dup-deps --mode=compile x86_64-pld-linux-gcc  -DNOT_RUBY -DONIG_ESCAPE_UCHAR_COLLISION=1 -DUChar=OnigUChar -DHAVE_CONFIG_H -Iext/mbstring/ -I/tmp/B.fBDQFx/BUILD/php-5.3.29/ext/mbstring/ -DPHP_ATOM_INC -I/tmp/B.fBDQFx/BUILD/php-5.3.29/include -I/tmp/B.fBDQFx/BUILD/php-5.3.29/main -I/tmp/B.fBDQFx/BUILD/php-5.3.29 -I/tmp/B.fBDQFx/BUILD/php-5.3.29/ext/date/lib -I/usr/include/libxml2 -I/usr/include/enchant -I/usr/include/freetype2 -I/usr/include/imap -I/tmp/B.fBDQFx/BUILD/php-5.3.29/ext/mbstring/oniguruma -I/tmp/B.fBDQFx/BUILD/php-5.3.29/ext/mbstring/libmbfl -I/tmp/B.fBDQFx/BUILD/php-5.3.29/ext/mbstring/libmbfl/mbfl -I/usr/include/mysql -I/usr/include/pspell -I/usr/include/tidy -I/tmp/B.fBDQFx/BUILD/php-5.3.29/TSRM -I/tmp/B.fBDQFx/BUILD/php-5.3.29/Zend  -DDEBUG_FASTCGI -DHAVE_STRNDUP -DOPENSSL_NO_SSL2=1 -DOPENSSL_NO_SSL3=1 -I/usr/include/xmlrpc-epi  -I/usr/include -O2 -fwrapv -pipe -Wformat -Werror=format-security -gdwarf-4 -fno-debug-types-section -fvar-tracking-assignments -g2 -Wp,-D_FORTIFY_SOURCE=2 -fstack-protector-strong --param=ssp-buffer-size=4 -Werror=trampolines -fPIC -march=x86-64 -gdwarf-4 -fno-debug-types-section -fvar-tracking-assignments -g2   -c /tmp/B.fBDQFx/BUILD/php-5.3.29/ext/mbstring/oniguruma/regerror.c -o ext/mbstring/oniguruma/regerror.lo 
/bin/sh /tmp/B.fBDQFx/BUILD/php-5.3.29/libtool --silent --preserve-dup-deps --mode=compile x86_64-pld-linux-gcc  -Iext/json/ -I/tmp/B.fBDQFx/BUILD/php-5.3.29/ext/json/ -DPHP_ATOM_INC -I/tmp/B.fBDQFx/BUILD/php-5.3.29/include -I/tmp/B.fBDQFx/BUILD/php-5.3.29/main -I/tmp/B.fBDQFx/BUILD/php-5.3.29 -I/tmp/B.fBDQFx/BUILD/php-5.3.29/ext/date/lib -I/usr/include/libxml2 -I/usr/include/enchant -I/usr/include/freetype2 -I/usr/include/imap -I/tmp/B.fBDQFx/BUILD/php-5.3.29/ext/mbstring/oniguruma -I/tmp/B.fBDQFx/BUILD/php-5.3.29/ext/mbstring/libmbfl -I/tmp/B.fBDQFx/BUILD/php-5.3.29/ext/mbstring/libmbfl/mbfl -I/usr/include/mysql -I/usr/include/pspell -I/usr/include/tidy -I/tmp/B.fBDQFx/BUILD/php-5.3.29/TSRM -I/tmp/B.fBDQFx/BUILD/php-5.3.29/Zend  -DDEBUG_FASTCGI -DHAVE_STRNDUP -DOPENSSL_NO_SSL2=1 -DOPENSSL_NO_SSL3=1 -I/usr/include/xmlrpc-epi  -I/usr/include -O2 -fwrapv -pipe -Wformat -Werror=format-security -gdwarf-4 -fno-debug-types-section -fvar-tracking-assignments -g2 -Wp,-D_FORTIFY_SOURCE=2 -fstack-protector-strong --param=ssp-buffer-size=4 -Werror=trampolines -fPIC -march=x86-64 -gdwarf-4 -fno-debug-types-section -fvar-tracking-assignments -g2   -c /tmp/B.fBDQFx/BUILD/php-5.3.29/ext/json/JSON_parser.c -o ext/json/JSON_parser.lo 
/bin/sh /tmp/B.fBDQFx/BUILD/php-5.3.29/libtool --silent --preserve-dup-deps --mode=compile x86_64-pld-linux-g++ -I/usr/include  -Iext/intl/ -I/tmp/B.fBDQFx/BUILD/php-5.3.29/ext/intl/ -DPHP_ATOM_INC -I/tmp/B.fBDQFx/BUILD/php-5.3.29/include -I/tmp/B.fBDQFx/BUILD/php-5.3.29/main -I/tmp/B.fBDQFx/BUILD/php-5.3.29 -I/tmp/B.fBDQFx/BUILD/php-5.3.29/ext/date/lib -I/usr/include/libxml2 -I/usr/include/enchant -I/usr/include/freetype2 -I/usr/include/imap -I/tmp/B.fBDQFx/BUILD/php-5.3.29/ext/mbstring/oniguruma -I/tmp/B.fBDQFx/BUILD/php-5.3.29/ext/mbstring/libmbfl -I/tmp/B.fBDQFx/BUILD/php-5.3.29/ext/mbstring/libmbfl/mbfl -I/usr/include/mysql -I/usr/include/pspell -I/usr/include/tidy -I/tmp/B.fBDQFx/BUILD/php-5.3.29/TSRM -I/tmp/B.fBDQFx/BUILD/php-5.3.29/Zend  -DDEBUG_FASTCGI -DHAVE_STRNDUP -DOPENSSL_NO_SSL2=1 -DOPENSSL_NO_SSL3=1 -I/usr/include/xmlrpc-epi  -O2 -fwrapv -pipe -Wformat -Werror=format-security -gdwarf-4 -fno-debug-types-section -fvar-tracking-assignments -g2 -Wp,-D_FORTIFY_SOURCE=2 -fstack-protector-strong --param=ssp-buffer-size=4 -Werror=trampolines -fPIC -march=x86-64 -gdwarf-4 -fno-debug-types-section -fvar-tracking-assignments -g2   -c /tmp/B.fBDQFx/BUILD/php-5.3.29/ext/intl/msgformat/msgformat_helpers.cpp -o ext/intl/msgformat/msgformat_helpers.lo 
In file included from /usr/include/unicode/uformattable.h:37,
                 from /usr/include/unicode/fmtable.h:33,
                 from /usr/include/unicode/format.h:39,
                 from /usr/include/unicode/msgfmt.h:33,
                 from /tmp/B.fBDQFx/BUILD/php-5.3.29/ext/intl/msgformat/msgformat_helpers.cpp:22:
/usr/include/unicode/ubrk.h:353:1: error: conflicting declaration of C function 'void icu_65::swap(icu_65::LocalUBreakIteratorPointer&, icu_65::LocalUBreakIteratorPointer&)'
  353 | U_DEFINE_LOCAL_OPEN_POINTER(LocalUBreakIteratorPointer, UBreakIterator, ubrk_close);
      | ^~~~~~~~~~~~~~~~~~~~~~~~~~~
/usr/include/unicode/utext.h:199:1: note: previous declaration 'void icu_65::swap(icu_65::LocalUTextPointer&, icu_65::LocalUTextPointer&)'
  199 | U_DEFINE_LOCAL_OPEN_POINTER(LocalUTextPointer, UText, utext_close);
      | ^~~~~~~~~~~~~~~~~~~~~~~~~~~
/usr/include/unicode/umsg.h:428:1: error: conflicting declaration of C function 'void icu_65::swap(icu_65::LocalUMessageFormatPointer&, icu_65::LocalUMessageFormatPointer&)'
  428 | U_DEFINE_LOCAL_OPEN_POINTER(LocalUMessageFormatPointer, UMessageFormat, umsg_close);
      | ^~~~~~~~~~~~~~~~~~~~~~~~~~~
/usr/include/unicode/utext.h:199:1: note: previous declaration 'void icu_65::swap(icu_65::LocalUTextPointer&, icu_65::LocalUTextPointer&)'
  199 | U_DEFINE_LOCAL_OPEN_POINTER(LocalUTextPointer, UText, utext_close);
      | ^~~~~~~~~~~~~~~~~~~~~~~~~~~
/usr/include/unicode/umsg.h:428:1: error: conflicting declaration of C function 'void icu_65::swap(icu_65::LocalUMessageFormatPointer&, icu_65::LocalUMessageFormatPointer&)'
  428 | U_DEFINE_LOCAL_OPEN_POINTER(LocalUMessageFormatPointer, UMessageFormat, umsg_close);
      | ^~~~~~~~~~~~~~~~~~~~~~~~~~~
/usr/include/unicode/ubrk.h:353:1: note: previous declaration 'void icu_65::swap(icu_65::LocalUBreakIteratorPointer&, icu_65::LocalUBreakIteratorPointer&)'
  353 | U_DEFINE_LOCAL_OPEN_POINTER(LocalUBreakIteratorPointer, UBreakIterator, ubrk_close);
      | ^~~~~~~~~~~~~~~~~~~~~~~~~~~
make: *** [Makefile:1166: ext/intl/msgformat/msgformat_helpers.lo] Error 1
make: *** Waiting for unfinished jobs....
/bin/sh /tmp/B.fBDQFx/BUILD/php-5.3.29/libtool --silent --preserve-dup-deps --mode=compile x86_64-pld-linux-gcc  -DNOT_RUBY -DONIG_ESCAPE_UCHAR_COLLISION=1 -DUChar=OnigUChar -DHAVE_CONFIG_H -Iext/mbstring/ -I/tmp/B.fBDQFx/BUILD/php-5.3.29/ext/mbstring/ -DPHP_ATOM_INC -I/tmp/B.fBDQFx/BUILD/php-5.3.29/include -I/tmp/B.fBDQFx/BUILD/php-5.3.29/main -I/tmp/B.fBDQFx/BUILD/php-5.3.29 -I/tmp/B.fBDQFx/BUILD/php-5.3.29/ext/date/lib -I/usr/include/libxml2 -I/usr/include/enchant -I/usr/include/freetype2 -I/usr/include/imap -I/tmp/B.fBDQFx/BUILD/php-5.3.29/ext/mbstring/oniguruma -I/tmp/B.fBDQFx/BUILD/php-5.3.29/ext/mbstring/libmbfl -I/tmp/B.fBDQFx/BUILD/php-5.3.29/ext/mbstring/libmbfl/mbfl -I/usr/include/mysql -I/usr/include/pspell -I/usr/include/tidy -I/tmp/B.fBDQFx/BUILD/php-5.3.29/TSRM -I/tmp/B.fBDQFx/BUILD/php-5.3.29/Zend  -DDEBUG_FASTCGI -DHAVE_STRNDUP -DOPENSSL_NO_SSL2=1 -DOPENSSL_NO_SSL3=1 -I/usr/include/xmlrpc-epi  -I/usr/include -O2 -fwrapv -pipe -Wformat -Werror=format-security -gdwarf-4 -fno-debug-types-section -fvar-tracking-assignments -g2 -Wp,-D_FORTIFY_SOURCE=2 -fstack-protector-strong --param=ssp-buffer-size=4 -Werror=trampolines -fPIC -march=x86-64 -gdwarf-4 -fno-debug-types-section -fvar-tracking-assignments -g2   -c /tmp/B.fBDQFx/BUILD/php-5.3.29/ext/mbstring/oniguruma/regsyntax.c -o ext/mbstring/oniguruma/regsyntax.lo 
/bin/sh /tmp/B.fBDQFx/BUILD/php-5.3.29/libtool --silent --preserve-dup-deps --mode=compile x86_64-pld-linux-gcc  -Iext/json/ -I/tmp/B.fBDQFx/BUILD/php-5.3.29/ext/json/ -DPHP_ATOM_INC -I/tmp/B.fBDQFx/BUILD/php-5.3.29/include -I/tmp/B.fBDQFx/BUILD/php-5.3.29/main -I/tmp/B.fBDQFx/BUILD/php-5.3.29 -I/tmp/B.fBDQFx/BUILD/php-5.3.29/ext/date/lib -I/usr/include/libxml2 -I/usr/include/enchant -I/usr/include/freetype2 -I/usr/include/imap -I/tmp/B.fBDQFx/BUILD/php-5.3.29/ext/mbstring/oniguruma -I/tmp/B.fBDQFx/BUILD/php-5.3.29/ext/mbstring/libmbfl -I/tmp/B.fBDQFx/BUILD/php-5.3.29/ext/mbstring/libmbfl/mbfl -I/usr/include/mysql -I/usr/include/pspell -I/usr/include/tidy -I/tmp/B.fBDQFx/BUILD/php-5.3.29/TSRM -I/tmp/B.fBDQFx/BUILD/php-5.3.29/Zend  -DDEBUG_FASTCGI -DHAVE_STRNDUP -DOPENSSL_NO_SSL2=1 -DOPENSSL_NO_SSL3=1 -I/usr/include/xmlrpc-epi  -I/usr/include -O2 -fwrapv -pipe -Wformat -Werror=format-security -gdwarf-4 -fno-debug-types-section -fvar-tracking-assignments -g2 -Wp,-D_FORTIFY_SOURCE=2 -fstack-protector-strong --param=ssp-buffer-size=4 -Werror=trampolines -fPIC -march=x86-64 -gdwarf-4 -fno-debug-types-section -fvar-tracking-assignments -g2   -c /tmp/B.fBDQFx/BUILD/php-5.3.29/ext/json/json.c -o ext/json/json.lo 
/tmp/B.fBDQFx/BUILD/php-5.3.29/ext/json/json.c: In function 'json_escape_string':
/tmp/B.fBDQFx/BUILD/php-5.3.29/ext/json/json.c:301:36: warning: unknown conversion type character 'k' in format [-Wformat=]
  301 |      int l = spprintf(&tmp, 0, "%.*k", (int) EG(precision), d);
      |                                    ^
/tmp/B.fBDQFx/BUILD/php-5.3.29/ext/json/json.c:301:32: warning: too many arguments for format [-Wformat-extra-args]
  301 |      int l = spprintf(&tmp, 0, "%.*k", (int) EG(precision), d);
      |                                ^~~~~~
/tmp/B.fBDQFx/BUILD/php-5.3.29/ext/json/json.c: In function 'php_json_encode':
/tmp/B.fBDQFx/BUILD/php-5.3.29/ext/json/json.c:460:32: warning: unknown conversion type character 'k' in format [-Wformat=]
  460 |      len = spprintf(&d, 0, "%.*k", (int) EG(precision), dbl);
      |                                ^
/tmp/B.fBDQFx/BUILD/php-5.3.29/ext/json/json.c:460:28: warning: too many arguments for format [-Wformat-extra-args]
  460 |      len = spprintf(&d, 0, "%.*k", (int) EG(precision), dbl);
      |                            ^~~~~~
/bin/sh /tmp/B.fBDQFx/BUILD/php-5.3.29/libtool --silent --preserve-dup-deps --mode=compile x86_64-pld-linux-gcc  -DNOT_RUBY -DONIG_ESCAPE_UCHAR_COLLISION=1 -DUChar=OnigUChar -DHAVE_CONFIG_H -Iext/mbstring/ -I/tmp/B.fBDQFx/BUILD/php-5.3.29/ext/mbstring/ -DPHP_ATOM_INC -I/tmp/B.fBDQFx/BUILD/php-5.3.29/include -I/tmp/B.fBDQFx/BUILD/php-5.3.29/main -I/tmp/B.fBDQFx/BUILD/php-5.3.29 -I/tmp/B.fBDQFx/BUILD/php-5.3.29/ext/date/lib -I/usr/include/libxml2 -I/usr/include/enchant -I/usr/include/freetype2 -I/usr/include/imap -I/tmp/B.fBDQFx/BUILD/php-5.3.29/ext/mbstring/oniguruma -I/tmp/B.fBDQFx/BUILD/php-5.3.29/ext/mbstring/libmbfl -I/tmp/B.fBDQFx/BUILD/php-5.3.29/ext/mbstring/libmbfl/mbfl -I/usr/include/mysql -I/usr/include/pspell -I/usr/include/tidy -I/tmp/B.fBDQFx/BUILD/php-5.3.29/TSRM -I/tmp/B.fBDQFx/BUILD/php-5.3.29/Zend  -DDEBUG_FASTCGI -DHAVE_STRNDUP -DOPENSSL_NO_SSL2=1 -DOPENSSL_NO_SSL3=1 -I/usr/include/xmlrpc-epi  -I/usr/include -O2 -fwrapv -pipe -Wformat -Werror=format-security -gdwarf-4 -fno-debug-types-section -fvar-tracking-assignments -g2 -Wp,-D_FORTIFY_SOURCE=2 -fstack-protector-strong --param=ssp-buffer-size=4 -Werror=trampolines -fPIC -march=x86-64 -gdwarf-4 -fno-debug-types-section -fvar-tracking-assignments -g2   -c /tmp/B.fBDQFx/BUILD/php-5.3.29/ext/mbstring/oniguruma/regext.c -o ext/mbstring/oniguruma/regext.lo 
/bin/sh /tmp/B.fBDQFx/BUILD/php-5.3.29/libtool --silent --preserve-dup-deps --mode=compile x86_64-pld-linux-gcc  -DNOT_RUBY -DONIG_ESCAPE_UCHAR_COLLISION=1 -DUChar=OnigUChar -DHAVE_CONFIG_H -Iext/mbstring/ -I/tmp/B.fBDQFx/BUILD/php-5.3.29/ext/mbstring/ -DPHP_ATOM_INC -I/tmp/B.fBDQFx/BUILD/php-5.3.29/include -I/tmp/B.fBDQFx/BUILD/php-5.3.29/main -I/tmp/B.fBDQFx/BUILD/php-5.3.29 -I/tmp/B.fBDQFx/BUILD/php-5.3.29/ext/date/lib -I/usr/include/libxml2 -I/usr/include/enchant -I/usr/include/freetype2 -I/usr/include/imap -I/tmp/B.fBDQFx/BUILD/php-5.3.29/ext/mbstring/oniguruma -I/tmp/B.fBDQFx/BUILD/php-5.3.29/ext/mbstring/libmbfl -I/tmp/B.fBDQFx/BUILD/php-5.3.29/ext/mbstring/libmbfl/mbfl -I/usr/include/mysql -I/usr/include/pspell -I/usr/include/tidy -I/tmp/B.fBDQFx/BUILD/php-5.3.29/TSRM -I/tmp/B.fBDQFx/BUILD/php-5.3.29/Zend  -DDEBUG_FASTCGI -DHAVE_STRNDUP -DOPENSSL_NO_SSL2=1 -DOPENSSL_NO_SSL3=1 -I/usr/include/xmlrpc-epi  -I/usr/include -O2 -fwrapv -pipe -Wformat -Werror=format-security -gdwarf-4 -fno-debug-types-section -fvar-tracking-assignments -g2 -Wp,-D_FORTIFY_SOURCE=2 -fstack-protector-strong --param=ssp-buffer-size=4 -Werror=trampolines -fPIC -march=x86-64 -gdwarf-4 -fno-debug-types-section -fvar-tracking-assignments -g2   -c /tmp/B.fBDQFx/BUILD/php-5.3.29/ext/mbstring/oniguruma/regenc.c -o ext/mbstring/oniguruma/regenc.lo 
/bin/sh /tmp/B.fBDQFx/BUILD/php-5.3.29/libtool --silent --preserve-dup-deps --mode=compile x86_64-pld-linux-gcc -DLDAP_DEPRECATED=1 -Iext/ldap/ -I/tmp/B.fBDQFx/BUILD/php-5.3.29/ext/ldap/ -DPHP_ATOM_INC -I/tmp/B.fBDQFx/BUILD/php-5.3.29/include -I/tmp/B.fBDQFx/BUILD/php-5.3.29/main -I/tmp/B.fBDQFx/BUILD/php-5.3.29 -I/tmp/B.fBDQFx/BUILD/php-5.3.29/ext/date/lib -I/usr/include/libxml2 -I/usr/include/enchant -I/usr/include/freetype2 -I/usr/include/imap -I/tmp/B.fBDQFx/BUILD/php-5.3.29/ext/mbstring/oniguruma -I/tmp/B.fBDQFx/BUILD/php-5.3.29/ext/mbstring/libmbfl -I/tmp/B.fBDQFx/BUILD/php-5.3.29/ext/mbstring/libmbfl/mbfl -I/usr/include/mysql -I/usr/include/pspell -I/usr/include/tidy -I/tmp/B.fBDQFx/BUILD/php-5.3.29/TSRM -I/tmp/B.fBDQFx/BUILD/php-5.3.29/Zend  -DDEBUG_FASTCGI -DHAVE_STRNDUP -DOPENSSL_NO_SSL2=1 -DOPENSSL_NO_SSL3=1 -I/usr/include/xmlrpc-epi  -I/usr/include -O2 -fwrapv -pipe -Wformat -Werror=format-security -gdwarf-4 -fno-debug-types-section -fvar-tracking-assignments -g2 -Wp,-D_FORTIFY_SOURCE=2 -fstack-protector-strong --param=ssp-buffer-size=4 -Werror=trampolines -fPIC -march=x86-64 -gdwarf-4 -fno-debug-types-section -fvar-tracking-assignments -g2   -c /tmp/B.fBDQFx/BUILD/php-5.3.29/ext/ldap/ldap.c -o ext/ldap/ldap.lo 
/bin/sh /tmp/B.fBDQFx/BUILD/php-5.3.29/libtool --silent --preserve-dup-deps --mode=compile x86_64-pld-linux-gcc  -DNOT_RUBY -DONIG_ESCAPE_UCHAR_COLLISION=1 -DUChar=OnigUChar -DHAVE_CONFIG_H -Iext/mbstring/ -I/tmp/B.fBDQFx/BUILD/php-5.3.29/ext/mbstring/ -DPHP_ATOM_INC -I/tmp/B.fBDQFx/BUILD/php-5.3.29/include -I/tmp/B.fBDQFx/BUILD/php-5.3.29/main -I/tmp/B.fBDQFx/BUILD/php-5.3.29 -I/tmp/B.fBDQFx/BUILD/php-5.3.29/ext/date/lib -I/usr/include/libxml2 -I/usr/include/enchant -I/usr/include/freetype2 -I/usr/include/imap -I/tmp/B.fBDQFx/BUILD/php-5.3.29/ext/mbstring/oniguruma -I/tmp/B.fBDQFx/BUILD/php-5.3.29/ext/mbstring/libmbfl -I/tmp/B.fBDQFx/BUILD/php-5.3.29/ext/mbstring/libmbfl/mbfl -I/usr/include/mysql -I/usr/include/pspell -I/usr/include/tidy -I/tmp/B.fBDQFx/BUILD/php-5.3.29/TSRM -I/tmp/B.fBDQFx/BUILD/php-5.3.29/Zend  -DDEBUG_FASTCGI -DHAVE_STRNDUP -DOPENSSL_NO_SSL2=1 -DOPENSSL_NO_SSL3=1 -I/usr/include/xmlrpc-epi  -I/usr/include -O2 -fwrapv -pipe -Wformat -Werror=format-security -gdwarf-4 -fno-debug-types-section -fvar-tracking-assignments -g2 -Wp,-D_FORTIFY_SOURCE=2 -fstack-protector-strong --param=ssp-buffer-size=4 -Werror=trampolines -fPIC -march=x86-64 -gdwarf-4 -fno-debug-types-section -fvar-tracking-assignments -g2   -c /tmp/B.fBDQFx/BUILD/php-5.3.29/ext/mbstring/oniguruma/regcomp.c -o ext/mbstring/oniguruma/regcomp.lo 
/bin/sh /tmp/B.fBDQFx/BUILD/php-5.3.29/libtool --silent --preserve-dup-deps --mode=compile x86_64-pld-linux-gcc  -DNOT_RUBY -DONIG_ESCAPE_UCHAR_COLLISION=1 -DUChar=OnigUChar -DHAVE_CONFIG_H -Iext/mbstring/ -I/tmp/B.fBDQFx/BUILD/php-5.3.29/ext/mbstring/ -DPHP_ATOM_INC -I/tmp/B.fBDQFx/BUILD/php-5.3.29/include -I/tmp/B.fBDQFx/BUILD/php-5.3.29/main -I/tmp/B.fBDQFx/BUILD/php-5.3.29 -I/tmp/B.fBDQFx/BUILD/php-5.3.29/ext/date/lib -I/usr/include/libxml2 -I/usr/include/enchant -I/usr/include/freetype2 -I/usr/include/imap -I/tmp/B.fBDQFx/BUILD/php-5.3.29/ext/mbstring/oniguruma -I/tmp/B.fBDQFx/BUILD/php-5.3.29/ext/mbstring/libmbfl -I/tmp/B.fBDQFx/BUILD/php-5.3.29/ext/mbstring/libmbfl/mbfl -I/usr/include/mysql -I/usr/include/pspell -I/usr/include/tidy -I/tmp/B.fBDQFx/BUILD/php-5.3.29/TSRM -I/tmp/B.fBDQFx/BUILD/php-5.3.29/Zend  -DDEBUG_FASTCGI -DHAVE_STRNDUP -DOPENSSL_NO_SSL2=1 -DOPENSSL_NO_SSL3=1 -I/usr/include/xmlrpc-epi  -I/usr/include -O2 -fwrapv -pipe -Wformat -Werror=format-security -gdwarf-4 -fno-debug-types-section -fvar-tracking-assignments -g2 -Wp,-D_FORTIFY_SOURCE=2 -fstack-protector-strong --param=ssp-buffer-size=4 -Werror=trampolines -fPIC -march=x86-64 -gdwarf-4 -fno-debug-types-section -fvar-tracking-assignments -g2   -c /tmp/B.fBDQFx/BUILD/php-5.3.29/ext/mbstring/oniguruma/regparse.c -o ext/mbstring/oniguruma/regparse.lo 
/bin/sh /tmp/B.fBDQFx/BUILD/php-5.3.29/libtool --silent --preserve-dup-deps --mode=compile x86_64-pld-linux-gcc  -DNOT_RUBY -DONIG_ESCAPE_UCHAR_COLLISION=1 -DUChar=OnigUChar -DHAVE_CONFIG_H -Iext/mbstring/ -I/tmp/B.fBDQFx/BUILD/php-5.3.29/ext/mbstring/ -DPHP_ATOM_INC -I/tmp/B.fBDQFx/BUILD/php-5.3.29/include -I/tmp/B.fBDQFx/BUILD/php-5.3.29/main -I/tmp/B.fBDQFx/BUILD/php-5.3.29 -I/tmp/B.fBDQFx/BUILD/php-5.3.29/ext/date/lib -I/usr/include/libxml2 -I/usr/include/enchant -I/usr/include/freetype2 -I/usr/include/imap -I/tmp/B.fBDQFx/BUILD/php-5.3.29/ext/mbstring/oniguruma -I/tmp/B.fBDQFx/BUILD/php-5.3.29/ext/mbstring/libmbfl -I/tmp/B.fBDQFx/BUILD/php-5.3.29/ext/mbstring/libmbfl/mbfl -I/usr/include/mysql -I/usr/include/pspell -I/usr/include/tidy -I/tmp/B.fBDQFx/BUILD/php-5.3.29/TSRM -I/tmp/B.fBDQFx/BUILD/php-5.3.29/Zend  -DDEBUG_FASTCGI -DHAVE_STRNDUP -DOPENSSL_NO_SSL2=1 -DOPENSSL_NO_SSL3=1 -I/usr/include/xmlrpc-epi  -I/usr/include -O2 -fwrapv -pipe -Wformat -Werror=format-security -gdwarf-4 -fno-debug-types-section -fvar-tracking-assignments -g2 -Wp,-D_FORTIFY_SOURCE=2 -fstack-protector-strong --param=ssp-buffer-size=4 -Werror=trampolines -fPIC -march=x86-64 -gdwarf-4 -fno-debug-types-section -fvar-tracking-assignments -g2   -c /tmp/B.fBDQFx/BUILD/php-5.3.29/ext/mbstring/oniguruma/regexec.c -o ext/mbstring/oniguruma/regexec.lo 
error: Bad exit status from /tmp/B.fBDQFx/BUILD/tmp/rpm-tmp.55091 (%build)


RPM build errors:
    Bad exit status from /tmp/B.fBDQFx/BUILD/tmp/rpm-tmp.55091 (%build)
ended at: Sat Oct 19 18:36:38 2019, done in 0:02:49.302797
error: No files produced.
+ chmod -R u+rwX /tmp/B.fBDQFx/BUILD
+ rm -rf /tmp/B.fBDQFx/tmp /tmp/B.fBDQFx/BUILD
+ rm -rf /tmp/B.fBDQFx
Begin-PLD-Builder-Info
Build-Time: user:279.41s sys:41.33s real:183.18s (faults io:0 non-io:20500271)

End-PLD-Builder-Info
[Back to list of logs] [View rpm -qa of builder]