FailedOk

th/SRPMS[OK]
th/x32[OK]
th/i686[OK]
th/x86_64[OK]

ac/SRPMS[OK]
ac/i386[OK]
ac/i586[OK]
ac/i686[OK]
ac/alpha[OK]
ac/amd64[OK]
ac/athlon[OK]
ac/ppc[OK]
ac/sparc[OK]
ac/sparc64[OK]

Advanced Search
main()
Powered by PLD Linux
(c) 2002-2021 PLD Team
$Revision: 1.37 $
Powered by NSA.
Your IP: 54.227.97.219

php-bytekit a370d466-09aa-42f8-9483-2b4804246e9b

Status:Failed
Source URL:https://buildlogs.pld-linux.org/pld/th/x86_64/FAIL/php-bytekit,a370d466-09aa-42f8-9483-2b4804246e9b.bz2
text/plain URL:View!
full text:View!
rpm -qa of builder:View!
Date:2014/04/28 13:48:56
Runtime:0:00:05.513798

Toc:

  • error 1
  • /tmp/B.340e56b9-b473-4eda-8622-1cde38159093/BUILD/bytekit-0.1.1/bytekit.c:117:35: error: 'znode_op' has no member named 'u'
  • error 2
  • /tmp/B.340e56b9-b473-4eda-8622-1cde38159093/BUILD/bytekit-0.1.1/bytekit.c:217:35: error: 'znode_op' has no member named 'u'
  • error 3
  • /tmp/B.340e56b9-b473-4eda-8622-1cde38159093/BUILD/bytekit-0.1.1/bytekit.c:614:40: error: 'union <anonymous>' has no member named 'opline_num'
  • error 4
  • /tmp/B.340e56b9-b473-4eda-8622-1cde38159093/BUILD/bytekit-0.1.1/bytekit.c:623:47: error: 'union <anonymous>' has no member named 'opline_num'
  • error 5
  • /tmp/B.340e56b9-b473-4eda-8622-1cde38159093/BUILD/bytekit-0.1.1/bytekit.c:626:58: error: 'union <anonymous>' has no member named 'opline_num'
  • error 6
  • /tmp/B.340e56b9-b473-4eda-8622-1cde38159093/BUILD/bytekit-0.1.1/bytekit.c:629:49: error: 'union <anonymous>' has no member named 'jmp_addr'
  • error 7
  • /tmp/B.340e56b9-b473-4eda-8622-1cde38159093/BUILD/bytekit-0.1.1/bytekit.c:638:48: error: 'union <anonymous>' has no member named 'var'
  • error 8
  • /tmp/B.340e56b9-b473-4eda-8622-1cde38159093/BUILD/bytekit-0.1.1/bytekit.c:641:58: error: 'union <anonymous>' has no member named 'var'
  • error 9
  • /tmp/B.340e56b9-b473-4eda-8622-1cde38159093/BUILD/bytekit-0.1.1/bytekit.c:650:48: error: 'union <anonymous>' has no member named 'var'
  • error 10
  • /tmp/B.340e56b9-b473-4eda-8622-1cde38159093/BUILD/bytekit-0.1.1/bytekit.c:653:58: error: 'union <anonymous>' has no member named 'var'
  • error 11
  • /tmp/B.340e56b9-b473-4eda-8622-1cde38159093/BUILD/bytekit-0.1.1/bytekit.c:656:48: error: 'union <anonymous>' has no member named 'var'
  • error 12
  • /tmp/B.340e56b9-b473-4eda-8622-1cde38159093/BUILD/bytekit-0.1.1/bytekit.c:659:58: error: 'union <anonymous>' has no member named 'var'
  • error 13
  • /tmp/B.340e56b9-b473-4eda-8622-1cde38159093/BUILD/bytekit-0.1.1/bytekit.c:662:48: error: 'union <anonymous>' has no member named 'var'
  • error 14
  • /tmp/B.340e56b9-b473-4eda-8622-1cde38159093/BUILD/bytekit-0.1.1/bytekit.c:665:58: error: 'union <anonymous>' has no member named 'var'
  • error 15
  • /tmp/B.340e56b9-b473-4eda-8622-1cde38159093/BUILD/bytekit-0.1.1/bytekit.c:758:101: error: 'znode_op' has no member named 'u'
  • error 16
  • /tmp/B.340e56b9-b473-4eda-8622-1cde38159093/BUILD/bytekit-0.1.1/bytekit.c:769:106: error: 'znode_op' has no member named 'u'
  • error 17
  • /tmp/B.340e56b9-b473-4eda-8622-1cde38159093/BUILD/bytekit-0.1.1/bytekit.c:870:31: error: 'znode_op' has no member named 'u'
  • error 18
  • /tmp/B.340e56b9-b473-4eda-8622-1cde38159093/BUILD/bytekit-0.1.1/bytekit.c:876:30: error: 'znode_op' has no member named 'u'
  • error 19
  • /tmp/B.340e56b9-b473-4eda-8622-1cde38159093/BUILD/bytekit-0.1.1/bytekit.c:884:31: error: 'znode_op' has no member named 'u'
  • error 20
  • /tmp/B.340e56b9-b473-4eda-8622-1cde38159093/BUILD/bytekit-0.1.1/bytekit.c:889:30: error: 'znode_op' has no member named 'u'
  • error 21
  • /tmp/B.340e56b9-b473-4eda-8622-1cde38159093/BUILD/bytekit-0.1.1/bytekit.c:896:43: error: 'znode_op' has no member named 'u'
  • error 22
  • /tmp/B.340e56b9-b473-4eda-8622-1cde38159093/BUILD/bytekit-0.1.1/bytekit.c:1125:62: error: 'zend_arg_info' has no member named 'array_type_hint'
  • error 23
  • /tmp/B.340e56b9-b473-4eda-8622-1cde38159093/BUILD/bytekit-0.1.1/bytekit.c:1140:51: error: 'union <anonymous>' has no member named 'EA'
  • error 24
  • /tmp/B.340e56b9-b473-4eda-8622-1cde38159093/BUILD/bytekit-0.1.1/bytekit.c:1141:52: error: 'union <anonymous>' has no member named 'EA'
  • error 25
  • /tmp/B.340e56b9-b473-4eda-8622-1cde38159093/BUILD/bytekit-0.1.1/bytekit.c:1157:52: error: 'union <anonymous>' has no member named 'var'
  • error 26
  • /tmp/B.340e56b9-b473-4eda-8622-1cde38159093/BUILD/bytekit-0.1.1/bytekit.c:1160:52: error: 'union <anonymous>' has no member named 'var'
  • error 27
  • /tmp/B.340e56b9-b473-4eda-8622-1cde38159093/BUILD/bytekit-0.1.1/bytekit.c:1164:63: error: 'union <anonymous>' has no member named 'opline_num'
  • error 28
  • /tmp/B.340e56b9-b473-4eda-8622-1cde38159093/BUILD/bytekit-0.1.1/bytekit.c:1167:63: error: 'union <anonymous>' has no member named 'opline_num'
  • error 29
  • /tmp/B.340e56b9-b473-4eda-8622-1cde38159093/BUILD/bytekit-0.1.1/bytekit.c:1170:72: error: 'union <anonymous>' has no member named 'jmp_addr'
  • error 30
  • /tmp/B.340e56b9-b473-4eda-8622-1cde38159093/BUILD/bytekit-0.1.1/bytekit.c:1285:54: error: 'zend_op_array' has no member named 'pass_rest_by_reference'
  • error 31
  • /tmp/B.340e56b9-b473-4eda-8622-1cde38159093/BUILD/bytekit-0.1.1/bytekit.c:1316:48: error: 'zend_op_array' has no member named 'return_reference'
  • error 32
  • /tmp/B.340e56b9-b473-4eda-8622-1cde38159093/BUILD/bytekit-0.1.1/bytekit.c:1319:36: error: 'zend_op_array' has no member named 'size'
  • error 33
  • /tmp/B.340e56b9-b473-4eda-8622-1cde38159093/BUILD/bytekit-0.1.1/bytekit.c:1322:48: error: 'zend_op_array' has no member named 'current_brk_cont'
  • error 34
  • /tmp/B.340e56b9-b473-4eda-8622-1cde38159093/BUILD/bytekit-0.1.1/bytekit.c:1323:47: error: 'zend_op_array' has no member named 'backpatch_count'
  • error 35
  • /tmp/B.340e56b9-b473-4eda-8622-1cde38159093/BUILD/bytekit-0.1.1/bytekit.c:1324:45: error: 'zend_op_array' has no member named 'done_pass_two'
  • error 36
  • /tmp/B.340e56b9-b473-4eda-8622-1cde38159093/BUILD/bytekit-0.1.1/bytekit.c:1367:12: error: 'zend_op_array' has no member named 'start_op'
  • error 37
  • /tmp/B.340e56b9-b473-4eda-8622-1cde38159093/BUILD/bytekit-0.1.1/bytekit.c:1370:59: error: 'zend_op_array' has no member named 'start_op'
  • error 38
  • /tmp/B.340e56b9-b473-4eda-8622-1cde38159093/BUILD/bytekit-0.1.1/bytekit.c:1475:54: error: 'zend_class_entry' has no member named 'constants_updated'
  • error 39
  • /tmp/B.340e56b9-b473-4eda-8622-1cde38159093/BUILD/bytekit-0.1.1/bytekit.c:1530:11: error: 'zend_class_entry' has no member named 'static_members'
  • error 40
  • /tmp/B.340e56b9-b473-4eda-8622-1cde38159093/BUILD/bytekit-0.1.1/bytekit.c:1530:56: error: 'zend_class_entry' has no member named 'static_members'
  • error 41
  • /tmp/B.340e56b9-b473-4eda-8622-1cde38159093/BUILD/bytekit-0.1.1/bytekit.c:1535:44: error: 'zend_class_entry' has no member named 'static_members'
  • error 42
  • /tmp/B.340e56b9-b473-4eda-8622-1cde38159093/BUILD/bytekit-0.1.1/bytekit.c:1563:47: error: 'zend_class_entry' has no member named 'filename'
  • error 43
  • /tmp/B.340e56b9-b473-4eda-8622-1cde38159093/BUILD/bytekit-0.1.1/bytekit.c:1564:47: error: 'zend_class_entry' has no member named 'line_start'
  • error 44
  • /tmp/B.340e56b9-b473-4eda-8622-1cde38159093/BUILD/bytekit-0.1.1/bytekit.c:1565:45: error: 'zend_class_entry' has no member named 'line_end'
  • error 45
  • /tmp/B.340e56b9-b473-4eda-8622-1cde38159093/BUILD/bytekit-0.1.1/bytekit.c:1566:11: error: 'zend_class_entry' has no member named 'doc_comment'
  • error 46
  • /tmp/B.340e56b9-b473-4eda-8622-1cde38159093/BUILD/bytekit-0.1.1/bytekit.c:1567:55: error: 'zend_class_entry' has no member named 'doc_comment'
  • error 47
  • /tmp/B.340e56b9-b473-4eda-8622-1cde38159093/BUILD/bytekit-0.1.1/bytekit.c:1567:72: error: 'zend_class_entry' has no member named 'doc_comment_len'
  • error 48
  • /tmp/B.340e56b9-b473-4eda-8622-1cde38159093/BUILD/bytekit-0.1.1/bytekit.c:1588:36: error: 'zend_class_entry' has no member named 'default_properties'
  • error 49
  • /tmp/B.340e56b9-b473-4eda-8622-1cde38159093/BUILD/bytekit-0.1.1/bytekit.c:1593:46: error: 'zend_class_entry' has no member named 'default_properties'
  • error 50
  • /tmp/B.340e56b9-b473-4eda-8622-1cde38159093/BUILD/bytekit-0.1.1/bytekit.c:1863:1: error: unknown type name 'function_entry'
  • error 51
  • /tmp/B.340e56b9-b473-4eda-8622-1cde38159093/BUILD/bytekit-0.1.1/bytekit.c:1864:5: error: initializer element is not computable at load time
  • error 52
  • /tmp/B.340e56b9-b473-4eda-8622-1cde38159093/BUILD/bytekit-0.1.1/bytekit.c:1864:5: error: (near initialization for 'bytekit_functions[0]')
  • error 53
  • /tmp/B.340e56b9-b473-4eda-8622-1cde38159093/BUILD/bytekit-0.1.1/bytekit.c:1865:5: error: initializer element is not computable at load time
  • error 54
  • /tmp/B.340e56b9-b473-4eda-8622-1cde38159093/BUILD/bytekit-0.1.1/bytekit.c:1865:5: error: (near initialization for 'bytekit_functions[1]')
  • error 55
  • /tmp/B.340e56b9-b473-4eda-8622-1cde38159093/BUILD/bytekit-0.1.1/bytekit.c:1866:5: error: initializer element is not computable at load time
  • error 56
  • /tmp/B.340e56b9-b473-4eda-8622-1cde38159093/BUILD/bytekit-0.1.1/bytekit.c:1866:5: error: (near initialization for 'bytekit_functions[2]')
  • error 57
  • Makefile:201: recipe for target 'bytekit.lo' failed
  • error 58
  • error: Bad exit status from /tmp/B.340e56b9-b473-4eda-8622-1cde38159093/BUILD/tmp/rpm-tmp.58362 (%build)
  • error 59
  • RPM build errors:
  • error 60
  • error: No files produced.

Content:

checking for a sed that does not truncate output... /bin/sed
checking for x86_64-pld-linux-cc... x86_64-pld-linux-gcc
checking whether the C compiler works... yes
checking for C compiler default output file name... a.out
checking for suffix of executables... 
checking whether we are cross compiling... no
checking for suffix of object files... o
checking whether we are using the GNU C compiler... yes
checking whether x86_64-pld-linux-gcc accepts -g... yes
checking for x86_64-pld-linux-gcc option to accept ISO C89... none needed
checking how to run the C preprocessor... x86_64-pld-linux-gcc -E
checking for icc... no
checking for suncc... no
checking whether x86_64-pld-linux-gcc and cc understand -c and -o together... yes
checking for system library directory... lib
checking if compiler supports -R... no
checking if compiler supports -Wl,-rpath,... yes
checking build system type... x86_64-pld-linux-gnu
checking host system type... x86_64-pld-linux-gnu
checking target system type... x86_64-pld-linux-gnu
checking for PHP prefix... /usr
checking for PHP includes... -I/usr/include/php -I/usr/include/php/main -I/usr/include/php/TSRM -I/usr/include/php/Zend -I/usr/include/php/ext -I/usr/include/php/ext/date/lib
checking for PHP extension directory... /usr/lib64/php
checking for PHP installed headers prefix... /usr/include/php
checking if debug is enabled... no
checking if zts is enabled... no
checking for re2c... re2c
checking for re2c version... 0.13.5 (ok)
checking for gawk... gawk
checking whether to enable ByteKit support... yes, shared
checking how to print strings... print -r
checking for a sed that does not truncate output... (cached) /bin/sed
checking for fgrep... /bin/grep -F
checking for ld used by x86_64-pld-linux-gcc... /usr/bin/ld
checking if the linker (/usr/bin/ld) is GNU ld... yes
checking for BSD- or MS-compatible name lister (nm)... /usr/bin/nm -B
checking the name lister (/usr/bin/nm -B) interface... BSD nm
checking whether ln -s works... yes
checking the maximum length of command line arguments... 1572864
checking whether the shell understands some XSI constructs... yes
checking whether the shell understands "+="... yes
checking how to convert x86_64-pld-linux-gnu file names to x86_64-pld-linux-gnu format... func_convert_file_noop
checking how to convert x86_64-pld-linux-gnu file names to toolchain format... func_convert_file_noop
checking for /usr/bin/ld option to reload object files... -r
checking for x86_64-pld-linux-objdump... no
checking for objdump... objdump
checking how to recognize dependent libraries... pass_all
checking for x86_64-pld-linux-dlltool... no
checking for dlltool... no
checking how to associate runtime and link libraries... print -r --
checking for x86_64-pld-linux-ar... no
checking for ar... ar
checking for archiver @FILE support... @
checking for x86_64-pld-linux-strip... no
checking for strip... strip
checking for x86_64-pld-linux-ranlib... no
checking for ranlib... ranlib
checking for mawk... (cached) gawk
checking command to parse /usr/bin/nm -B output from x86_64-pld-linux-gcc object... ok
checking for sysroot... no
checking for x86_64-pld-linux-mt... no
checking for mt... no
checking if : is a manifest tool... no
checking for ANSI C header files... yes
checking for sys/types.h... yes
checking for sys/stat.h... yes
checking for stdlib.h... yes
checking for string.h... yes
checking for memory.h... yes
checking for strings.h... yes
checking for inttypes.h... yes
checking for stdint.h... yes
checking for unistd.h... yes
checking for dlfcn.h... yes
checking for objdir... .libs
checking if x86_64-pld-linux-gcc supports -fno-rtti -fno-exceptions... no
checking for x86_64-pld-linux-gcc option to produce PIC... -fPIC -DPIC
checking if x86_64-pld-linux-gcc PIC flag -fPIC -DPIC works... yes
checking if x86_64-pld-linux-gcc static flag -static works... yes
checking if x86_64-pld-linux-gcc supports -c -o file.o... yes
checking if x86_64-pld-linux-gcc supports -c -o file.o... (cached) yes
checking whether the x86_64-pld-linux-gcc linker (/usr/bin/ld -m elf_x86_64) supports shared libraries... yes
checking whether -lc should be explicitly linked in... no
checking dynamic linker characteristics... GNU/Linux ld.so
checking how to hardcode library paths into programs... immediate
checking whether stripping libraries is possible... yes
checking if libtool supports shared libraries... yes
checking whether to build shared libraries... yes
checking whether to build static libraries... no
configure: creating ./config.status
config.status: creating config.h
config.status: executing libtool commands
+ /usr/bin/make -j5
/bin/sh /tmp/B.340e56b9-b473-4eda-8622-1cde38159093/BUILD/bytekit-0.1.1/libtool --mode=compile x86_64-pld-linux-gcc  -I. -I/tmp/B.340e56b9-b473-4eda-8622-1cde38159093/BUILD/bytekit-0.1.1 -DPHP_ATOM_INC -I/tmp/B.340e56b9-b473-4eda-8622-1cde38159093/BUILD/bytekit-0.1.1/include -I/tmp/B.340e56b9-b473-4eda-8622-1cde38159093/BUILD/bytekit-0.1.1/main -I/tmp/B.340e56b9-b473-4eda-8622-1cde38159093/BUILD/bytekit-0.1.1 -I/usr/include/php -I/usr/include/php/main -I/usr/include/php/TSRM -I/usr/include/php/Zend -I/usr/include/php/ext -I/usr/include/php/ext/date/lib  -DHAVE_CONFIG_H  -O2 -fwrapv -pipe -Wformat -Werror=format-security -gdwarf-4 -fno-debug-types-section -fvar-tracking-assignments -g2 -Wp,-D_FORTIFY_SOURCE=2 -fstack-protector --param=ssp-buffer-size=4 -fPIC -march=x86-64 -gdwarf-4 -fno-debug-types-section -fvar-tracking-assignments -g2   -c /tmp/B.340e56b9-b473-4eda-8622-1cde38159093/BUILD/bytekit-0.1.1/bytekit.c -o bytekit.lo 
libtool: compile:  x86_64-pld-linux-gcc -I. -I/tmp/B.340e56b9-b473-4eda-8622-1cde38159093/BUILD/bytekit-0.1.1 -DPHP_ATOM_INC -I/tmp/B.340e56b9-b473-4eda-8622-1cde38159093/BUILD/bytekit-0.1.1/include -I/tmp/B.340e56b9-b473-4eda-8622-1cde38159093/BUILD/bytekit-0.1.1/main -I/tmp/B.340e56b9-b473-4eda-8622-1cde38159093/BUILD/bytekit-0.1.1 -I/usr/include/php -I/usr/include/php/main -I/usr/include/php/TSRM -I/usr/include/php/Zend -I/usr/include/php/ext -I/usr/include/php/ext/date/lib -DHAVE_CONFIG_H -O2 -fwrapv -pipe -Wformat -Werror=format-security -gdwarf-4 -fno-debug-types-section -fvar-tracking-assignments -g2 -Wp,-D_FORTIFY_SOURCE=2 -fstack-protector --param=ssp-buffer-size=4 -fPIC -march=x86-64 -gdwarf-4 -fno-debug-types-section -fvar-tracking-assignments -g2 -c /tmp/B.340e56b9-b473-4eda-8622-1cde38159093/BUILD/bytekit-0.1.1/bytekit.c  -fPIC -DPIC -o .libs/bytekit.o
In file included from /usr/include/php/Zend/zend.h:843:0,
                 from /usr/include/php/main/php.h:34,
                 from /tmp/B.340e56b9-b473-4eda-8622-1cde38159093/BUILD/bytekit-0.1.1/bytekit.c:30:
/tmp/B.340e56b9-b473-4eda-8622-1cde38159093/BUILD/bytekit-0.1.1/bytekit.c: In function 'bytekit_get_opcode_mnemonic':
/tmp/B.340e56b9-b473-4eda-8622-1cde38159093/BUILD/bytekit-0.1.1/bytekit.c:117:35: error: 'znode_op' has no member named 'u'
             switch (Z_LVAL(op->op2.u.constant)) {
                                   ^
/usr/include/php/Zend/zend_operators.h:440:25: note: in definition of macro 'Z_LVAL'
 #define Z_LVAL(zval)   (zval).value.lval
                         ^
/tmp/B.340e56b9-b473-4eda-8622-1cde38159093/BUILD/bytekit-0.1.1/bytekit.c: In function 'bytekit_get_opcode_flags':
/tmp/B.340e56b9-b473-4eda-8622-1cde38159093/BUILD/bytekit-0.1.1/bytekit.c:217:35: error: 'znode_op' has no member named 'u'
             switch (Z_LVAL(op->op2.u.constant)) {
                                   ^
/usr/include/php/Zend/zend_operators.h:440:25: note: in definition of macro 'Z_LVAL'
 #define Z_LVAL(zval)   (zval).value.lval
                         ^
/tmp/B.340e56b9-b473-4eda-8622-1cde38159093/BUILD/bytekit-0.1.1/bytekit.c: In function 'bytekit_disassemble_node':
/tmp/B.340e56b9-b473-4eda-8622-1cde38159093/BUILD/bytekit-0.1.1/bytekit.c:606:76: warning: pointer type mismatch in conditional expression [enabled by default]
     char *base_address = BYTEKIT_G(opcodes_base) ? BYTEKIT_G(opcodes_base) : op_array->opcodes;
                                                                            ^
/tmp/B.340e56b9-b473-4eda-8622-1cde38159093/BUILD/bytekit-0.1.1/bytekit.c:614:40: error: 'union <anonymous>' has no member named 'opline_num'
             dst = address - i + node->u.opline_num;
                                        ^
/tmp/B.340e56b9-b473-4eda-8622-1cde38159093/BUILD/bytekit-0.1.1/bytekit.c:623:47: error: 'union <anonymous>' has no member named 'opline_num'
             spprintf(&tmpstr, 0, "%d", node->u.opline_num);
                                               ^
In file included from /usr/include/php/main/php.h:38:0,
                 from /tmp/B.340e56b9-b473-4eda-8622-1cde38159093/BUILD/bytekit-0.1.1/bytekit.c:30:
/tmp/B.340e56b9-b473-4eda-8622-1cde38159093/BUILD/bytekit-0.1.1/bytekit.c:626:58: error: 'union <anonymous>' has no member named 'opline_num'
             add_assoc_long(return_value, "value", node->u.opline_num );
                                                          ^
/usr/include/php/Zend/zend_API.h:385:92: note: in definition of macro 'add_assoc_long'
 #define add_assoc_long(__arg, __key, __n) add_assoc_long_ex(__arg, __key, strlen(__key)+1, __n)
                                                                                            ^
/tmp/B.340e56b9-b473-4eda-8622-1cde38159093/BUILD/bytekit-0.1.1/bytekit.c:629:49: error: 'union <anonymous>' has no member named 'jmp_addr'
             dst = address - i + ((char *)node->u.jmp_addr - base_address) / sizeof(zend_op);
                                                 ^
/tmp/B.340e56b9-b473-4eda-8622-1cde38159093/BUILD/bytekit-0.1.1/bytekit.c:638:48: error: 'union <anonymous>' has no member named 'var'
             spprintf(&tmpstr, 0, "~%d", node->u.var / sizeof(temp_variable));
                                                ^
In file included from /usr/include/php/main/php.h:38:0,
                 from /tmp/B.340e56b9-b473-4eda-8622-1cde38159093/BUILD/bytekit-0.1.1/bytekit.c:30:
/tmp/B.340e56b9-b473-4eda-8622-1cde38159093/BUILD/bytekit-0.1.1/bytekit.c:641:58: error: 'union <anonymous>' has no member named 'var'
             add_assoc_long(return_value, "value", node->u.var / sizeof(temp_variable));
                                                          ^
/usr/include/php/Zend/zend_API.h:385:92: note: in definition of macro 'add_assoc_long'
 #define add_assoc_long(__arg, __key, __n) add_assoc_long_ex(__arg, __key, strlen(__key)+1, __n)
                                                                                            ^
/tmp/B.340e56b9-b473-4eda-8622-1cde38159093/BUILD/bytekit-0.1.1/bytekit.c:650:48: error: 'union <anonymous>' has no member named 'var'
             spprintf(&tmpstr, 0, "!%d", node->u.var);
                                                ^
In file included from /usr/include/php/main/php.h:38:0,
                 from /tmp/B.340e56b9-b473-4eda-8622-1cde38159093/BUILD/bytekit-0.1.1/bytekit.c:30:
/tmp/B.340e56b9-b473-4eda-8622-1cde38159093/BUILD/bytekit-0.1.1/bytekit.c:653:58: error: 'union <anonymous>' has no member named 'var'
             add_assoc_long(return_value, "value", node->u.var );
                                                          ^
/usr/include/php/Zend/zend_API.h:385:92: note: in definition of macro 'add_assoc_long'
 #define add_assoc_long(__arg, __key, __n) add_assoc_long_ex(__arg, __key, strlen(__key)+1, __n)
                                                                                            ^
/tmp/B.340e56b9-b473-4eda-8622-1cde38159093/BUILD/bytekit-0.1.1/bytekit.c:656:48: error: 'union <anonymous>' has no member named 'var'
             spprintf(&tmpstr, 0, "~%d", node->u.var / sizeof(temp_variable));
                                                ^
In file included from /usr/include/php/main/php.h:38:0,
                 from /tmp/B.340e56b9-b473-4eda-8622-1cde38159093/BUILD/bytekit-0.1.1/bytekit.c:30:
/tmp/B.340e56b9-b473-4eda-8622-1cde38159093/BUILD/bytekit-0.1.1/bytekit.c:659:58: error: 'union <anonymous>' has no member named 'var'
             add_assoc_long(return_value, "value", node->u.var / sizeof(temp_variable));
                                                          ^
/usr/include/php/Zend/zend_API.h:385:92: note: in definition of macro 'add_assoc_long'
 #define add_assoc_long(__arg, __key, __n) add_assoc_long_ex(__arg, __key, strlen(__key)+1, __n)
                                                                                            ^
/tmp/B.340e56b9-b473-4eda-8622-1cde38159093/BUILD/bytekit-0.1.1/bytekit.c:662:48: error: 'union <anonymous>' has no member named 'var'
             spprintf(&tmpstr, 0, "$%d", node->u.var / sizeof(temp_variable));
                                                ^
In file included from /usr/include/php/main/php.h:38:0,
                 from /tmp/B.340e56b9-b473-4eda-8622-1cde38159093/BUILD/bytekit-0.1.1/bytekit.c:30:
/tmp/B.340e56b9-b473-4eda-8622-1cde38159093/BUILD/bytekit-0.1.1/bytekit.c:665:58: error: 'union <anonymous>' has no member named 'var'
             add_assoc_long(return_value, "value", node->u.var / sizeof(temp_variable));
                                                          ^
/usr/include/php/Zend/zend_API.h:385:92: note: in definition of macro 'add_assoc_long'
 #define add_assoc_long(__arg, __key, __n) add_assoc_long_ex(__arg, __key, strlen(__key)+1, __n)
                                                                                            ^
/tmp/B.340e56b9-b473-4eda-8622-1cde38159093/BUILD/bytekit-0.1.1/bytekit.c: In function 'bytekit_disassemble_ext':
/tmp/B.340e56b9-b473-4eda-8622-1cde38159093/BUILD/bytekit-0.1.1/bytekit.c:680:76: warning: pointer type mismatch in conditional expression [enabled by default]
     char *base_address = BYTEKIT_G(opcodes_base) ? BYTEKIT_G(opcodes_base) : op_array->opcodes;
                                                                            ^
/tmp/B.340e56b9-b473-4eda-8622-1cde38159093/BUILD/bytekit-0.1.1/bytekit.c:691:13: warning: format '%d' expects argument of type 'int', but argument 4 has type 'ulong' [-Wformat=]
             spprintf(&tmpstr, 0, "s(%d)", ext);
             ^
/tmp/B.340e56b9-b473-4eda-8622-1cde38159093/BUILD/bytekit-0.1.1/bytekit.c:697:13: warning: format '%d' expects argument of type 'int', but argument 4 has type 'ulong' [-Wformat=]
             spprintf(&tmpstr, 0, "%d", ext);
             ^
/tmp/B.340e56b9-b473-4eda-8622-1cde38159093/BUILD/bytekit-0.1.1/bytekit.c:703:13: warning: format '%d' expects argument of type 'int', but argument 4 has type 'ulong' [-Wformat=]
             spprintf(&tmpstr, 0, "f(%d)", ext);
             ^
/tmp/B.340e56b9-b473-4eda-8622-1cde38159093/BUILD/bytekit-0.1.1/bytekit.c:718:13: warning: format '%d' expects argument of type 'int', but argument 4 has type 'long unsigned int' [-Wformat=]
             spprintf(&tmpstr, 0, "~%d", ext / sizeof(temp_variable));
             ^
/tmp/B.340e56b9-b473-4eda-8622-1cde38159093/BUILD/bytekit-0.1.1/bytekit.c: In function 'bytekit_disassemble_op':
/tmp/B.340e56b9-b473-4eda-8622-1cde38159093/BUILD/bytekit-0.1.1/bytekit.c:758:101: error: 'znode_op' has no member named 'u'
     if ((opcode_flags & BYTEKIT_RES_USED) && ((opcode_flags & BYTEKIT_RES_HIDE)==0) && (!(op->result.u.EA.type & EXT_TYPE_UNUSED) || (opcode_flags & BYTEKIT_RES_FORCE))) {
                                                                                                     ^
/tmp/B.340e56b9-b473-4eda-8622-1cde38159093/BUILD/bytekit-0.1.1/bytekit.c:760:9: warning: passing argument 3 of 'bytekit_disassemble_node' from incompatible pointer type [enabled by default]
         if (bytekit_disassemble_node(result, op_array, &(op->result), i, address, (opcode_flags & BYTEKIT_RES_TYPE_MASK) >> BYTEKIT_RES_SHIFT, options TSRMLS_CC) == SUCCESS) {
         ^
/tmp/B.340e56b9-b473-4eda-8622-1cde38159093/BUILD/bytekit-0.1.1/bytekit.c:603:12: note: expected 'struct znode *' but argument is of type 'union znode_op *'
 static int bytekit_disassemble_node(zval *return_value, zend_op_array *op_array, znode *node, int i, long long address, long opcode_flags, long options TSRMLS_DC)
            ^
/tmp/B.340e56b9-b473-4eda-8622-1cde38159093/BUILD/bytekit-0.1.1/bytekit.c:769:106: error: 'znode_op' has no member named 'u'
     if ((opcode_flags2 & BYTEKIT_RES_USED) && ((opcode_flags2 & BYTEKIT_RES_HIDE)==0) && !((op+1)->result.u.EA.type & EXT_TYPE_UNUSED)) {
                                                                                                          ^
/tmp/B.340e56b9-b473-4eda-8622-1cde38159093/BUILD/bytekit-0.1.1/bytekit.c:771:9: warning: passing argument 3 of 'bytekit_disassemble_node' from incompatible pointer type [enabled by default]
         if (bytekit_disassemble_node(result, op_array, &((op+1)->result), i, address, (opcode_flags2 & BYTEKIT_RES_TYPE_MASK) >> BYTEKIT_RES_SHIFT, options TSRMLS_CC) == SUCCESS) {
         ^
/tmp/B.340e56b9-b473-4eda-8622-1cde38159093/BUILD/bytekit-0.1.1/bytekit.c:603:12: note: expected 'struct znode *' but argument is of type 'union znode_op *'
 static int bytekit_disassemble_node(zval *return_value, zend_op_array *op_array, znode *node, int i, long long address, long opcode_flags, long options TSRMLS_DC)
            ^
/tmp/B.340e56b9-b473-4eda-8622-1cde38159093/BUILD/bytekit-0.1.1/bytekit.c:782:9: warning: passing argument 3 of 'bytekit_disassemble_node' from incompatible pointer type [enabled by default]
         if (bytekit_disassemble_node(op1, op_array, &(op->op1), i, address, (opcode_flags & BYTEKIT_OP1_TYPE_MASK) >> BYTEKIT_OP1_SHIFT, options TSRMLS_CC) == SUCCESS) {
         ^
/tmp/B.340e56b9-b473-4eda-8622-1cde38159093/BUILD/bytekit-0.1.1/bytekit.c:603:12: note: expected 'struct znode *' but argument is of type 'union znode_op *'
 static int bytekit_disassemble_node(zval *return_value, zend_op_array *op_array, znode *node, int i, long long address, long opcode_flags, long options TSRMLS_DC)
            ^
/tmp/B.340e56b9-b473-4eda-8622-1cde38159093/BUILD/bytekit-0.1.1/bytekit.c:793:9: warning: passing argument 3 of 'bytekit_disassemble_node' from incompatible pointer type [enabled by default]
         if (bytekit_disassemble_node(op2, op_array, &(op->op2), i, address, (opcode_flags & BYTEKIT_OP2_TYPE_MASK) >> BYTEKIT_OP2_SHIFT, options TSRMLS_CC) == SUCCESS) {
         ^
/tmp/B.340e56b9-b473-4eda-8622-1cde38159093/BUILD/bytekit-0.1.1/bytekit.c:603:12: note: expected 'struct znode *' but argument is of type 'union znode_op *'
 static int bytekit_disassemble_node(zval *return_value, zend_op_array *op_array, znode *node, int i, long long address, long opcode_flags, long options TSRMLS_DC)
            ^
/tmp/B.340e56b9-b473-4eda-8622-1cde38159093/BUILD/bytekit-0.1.1/bytekit.c:815:9: warning: passing argument 3 of 'bytekit_disassemble_node' from incompatible pointer type [enabled by default]
         if (bytekit_disassemble_node(op1, op_array, &((op+1)->op1), i, address, (opcode_flags2 & BYTEKIT_OP1_TYPE_MASK) >> BYTEKIT_OP1_SHIFT, options TSRMLS_CC) == SUCCESS) {
         ^
/tmp/B.340e56b9-b473-4eda-8622-1cde38159093/BUILD/bytekit-0.1.1/bytekit.c:603:12: note: expected 'struct znode *' but argument is of type 'union znode_op *'
 static int bytekit_disassemble_node(zval *return_value, zend_op_array *op_array, znode *node, int i, long long address, long opcode_flags, long options TSRMLS_DC)
            ^
/tmp/B.340e56b9-b473-4eda-8622-1cde38159093/BUILD/bytekit-0.1.1/bytekit.c:826:9: warning: passing argument 3 of 'bytekit_disassemble_node' from incompatible pointer type [enabled by default]
         if (bytekit_disassemble_node(op2, op_array, &((op+1)->op2), i, address, (opcode_flags2 & BYTEKIT_OP2_TYPE_MASK) >> BYTEKIT_OP2_SHIFT, options TSRMLS_CC) == SUCCESS) {
         ^
/tmp/B.340e56b9-b473-4eda-8622-1cde38159093/BUILD/bytekit-0.1.1/bytekit.c:603:12: note: expected 'struct znode *' but argument is of type 'union znode_op *'
 static int bytekit_disassemble_node(zval *return_value, zend_op_array *op_array, znode *node, int i, long long address, long opcode_flags, long options TSRMLS_DC)
            ^
/tmp/B.340e56b9-b473-4eda-8622-1cde38159093/BUILD/bytekit-0.1.1/bytekit.c: In function 'bytekit_get_next_oplines':
/tmp/B.340e56b9-b473-4eda-8622-1cde38159093/BUILD/bytekit-0.1.1/bytekit.c:856:76: warning: pointer type mismatch in conditional expression [enabled by default]
     char *opcodes_base = BYTEKIT_G(opcodes_base) ? BYTEKIT_G(opcodes_base) : ops->opcodes;
                                                                            ^
/tmp/B.340e56b9-b473-4eda-8622-1cde38159093/BUILD/bytekit-0.1.1/bytekit.c:870:31: error: 'znode_op' has no member named 'u'
             *next_t = (op->op1.u.jmp_addr - (zend_op *)opcodes_base);
                               ^
/tmp/B.340e56b9-b473-4eda-8622-1cde38159093/BUILD/bytekit-0.1.1/bytekit.c:876:30: error: 'znode_op' has no member named 'u'
             *next_f = op->op2.u.opline_num;
                              ^
/tmp/B.340e56b9-b473-4eda-8622-1cde38159093/BUILD/bytekit-0.1.1/bytekit.c:884:31: error: 'znode_op' has no member named 'u'
             *next_t = (op->op2.u.jmp_addr - (zend_op *)opcodes_base);
                               ^
/tmp/B.340e56b9-b473-4eda-8622-1cde38159093/BUILD/bytekit-0.1.1/bytekit.c:889:30: error: 'znode_op' has no member named 'u'
             *next_f = op->op2.u.opline_num;
                              ^
/tmp/B.340e56b9-b473-4eda-8622-1cde38159093/BUILD/bytekit-0.1.1/bytekit.c:896:43: error: 'znode_op' has no member named 'u'
                 int array_offset = op->op1.u.opline_num;
                                           ^
/tmp/B.340e56b9-b473-4eda-8622-1cde38159093/BUILD/bytekit-0.1.1/bytekit.c: In function 'bytekit_raw_arginfo':
/tmp/B.340e56b9-b473-4eda-8622-1cde38159093/BUILD/bytekit-0.1.1/bytekit.c:1117:9: warning: passing argument 4 of 'add_assoc_stringl_ex' discards 'const' qualifier from pointer target type [enabled by default]
         add_assoc_stringl(tmpzval, "name", arginfo[i].name, arginfo[i].name_len, 1);
         ^
In file included from /usr/include/php/main/php.h:38:0,
                 from /tmp/B.340e56b9-b473-4eda-8622-1cde38159093/BUILD/bytekit-0.1.1/bytekit.c:30:
/usr/include/php/Zend/zend_API.h:382:14: note: expected 'char *' but argument is of type 'const char *'
 ZEND_API int add_assoc_stringl_ex(zval *arg, const char *key, uint key_len, char *str, uint length, int duplicate);
              ^
/tmp/B.340e56b9-b473-4eda-8622-1cde38159093/BUILD/bytekit-0.1.1/bytekit.c:1119:13: warning: passing argument 4 of 'add_assoc_stringl_ex' discards 'const' qualifier from pointer target type [enabled by default]
             add_assoc_stringl(tmpzval, "class_name", arginfo[i].class_name, arginfo[i].class_name_len, 1);
             ^
In file included from /usr/include/php/main/php.h:38:0,
                 from /tmp/B.340e56b9-b473-4eda-8622-1cde38159093/BUILD/bytekit-0.1.1/bytekit.c:30:
/usr/include/php/Zend/zend_API.h:382:14: note: expected 'char *' but argument is of type 'const char *'
 ZEND_API int add_assoc_stringl_ex(zval *arg, const char *key, uint key_len, char *str, uint length, int duplicate);
              ^
/tmp/B.340e56b9-b473-4eda-8622-1cde38159093/BUILD/bytekit-0.1.1/bytekit.c:1125:62: error: 'zend_arg_info' has no member named 'array_type_hint'
         add_assoc_bool(tmpzval, "array_type_hint", arginfo[i].array_type_hint);
                                                              ^
/usr/include/php/Zend/zend_API.h:387:92: note: in definition of macro 'add_assoc_bool'
 #define add_assoc_bool(__arg, __key, __b) add_assoc_bool_ex(__arg, __key, strlen(__key)+1, __b)
                                                                                            ^
/tmp/B.340e56b9-b473-4eda-8622-1cde38159093/BUILD/bytekit-0.1.1/bytekit.c: In function 'bytekit_raw_node':
/tmp/B.340e56b9-b473-4eda-8622-1cde38159093/BUILD/bytekit-0.1.1/bytekit.c:1135:76: warning: pointer type mismatch in conditional expression [enabled by default]
     char *opcodes_base = BYTEKIT_G(opcodes_base) ? BYTEKIT_G(opcodes_base) : op_array->opcodes;
                                                                            ^
In file included from /usr/include/php/main/php.h:38:0,
                 from /tmp/B.340e56b9-b473-4eda-8622-1cde38159093/BUILD/bytekit-0.1.1/bytekit.c:30:
/tmp/B.340e56b9-b473-4eda-8622-1cde38159093/BUILD/bytekit-0.1.1/bytekit.c:1140:51: error: 'union <anonymous>' has no member named 'EA'
     add_assoc_long(return_value, "EA.var", node->u.EA.var);
                                                   ^
/usr/include/php/Zend/zend_API.h:385:92: note: in definition of macro 'add_assoc_long'
 #define add_assoc_long(__arg, __key, __n) add_assoc_long_ex(__arg, __key, strlen(__key)+1, __n)
                                                                                            ^
/tmp/B.340e56b9-b473-4eda-8622-1cde38159093/BUILD/bytekit-0.1.1/bytekit.c:1141:52: error: 'union <anonymous>' has no member named 'EA'
     add_assoc_long(return_value, "EA.type", node->u.EA.type);
                                                    ^
/usr/include/php/Zend/zend_API.h:385:92: note: in definition of macro 'add_assoc_long'
 #define add_assoc_long(__arg, __key, __n) add_assoc_long_ex(__arg, __key, strlen(__key)+1, __n)
                                                                                            ^
/tmp/B.340e56b9-b473-4eda-8622-1cde38159093/BUILD/bytekit-0.1.1/bytekit.c:1157:52: error: 'union <anonymous>' has no member named 'var'
         add_assoc_long(return_value, "var", node->u.var);
                                                    ^
/usr/include/php/Zend/zend_API.h:385:92: note: in definition of macro 'add_assoc_long'
 #define add_assoc_long(__arg, __key, __n) add_assoc_long_ex(__arg, __key, strlen(__key)+1, __n)
                                                                                            ^
/tmp/B.340e56b9-b473-4eda-8622-1cde38159093/BUILD/bytekit-0.1.1/bytekit.c:1160:52: error: 'union <anonymous>' has no member named 'var'
         add_assoc_long(return_value, "var", node->u.var / sizeof(temp_variable));
                                                    ^
/usr/include/php/Zend/zend_API.h:385:92: note: in definition of macro 'add_assoc_long'
 #define add_assoc_long(__arg, __key, __n) add_assoc_long_ex(__arg, __key, strlen(__key)+1, __n)
                                                                                            ^
/tmp/B.340e56b9-b473-4eda-8622-1cde38159093/BUILD/bytekit-0.1.1/bytekit.c:1164:63: error: 'union <anonymous>' has no member named 'opline_num'
                 add_assoc_long(return_value, "opline", node->u.opline_num);
                                                               ^
/usr/include/php/Zend/zend_API.h:385:92: note: in definition of macro 'add_assoc_long'
 #define add_assoc_long(__arg, __key, __n) add_assoc_long_ex(__arg, __key, strlen(__key)+1, __n)
                                                                                            ^
/tmp/B.340e56b9-b473-4eda-8622-1cde38159093/BUILD/bytekit-0.1.1/bytekit.c:1167:63: error: 'union <anonymous>' has no member named 'opline_num'
                 add_assoc_long(return_value, "number", node->u.opline_num);
                                                               ^
/usr/include/php/Zend/zend_API.h:385:92: note: in definition of macro 'add_assoc_long'
 #define add_assoc_long(__arg, __key, __n) add_assoc_long_ex(__arg, __key, strlen(__key)+1, __n)
                                                                                            ^
/tmp/B.340e56b9-b473-4eda-8622-1cde38159093/BUILD/bytekit-0.1.1/bytekit.c:1170:72: error: 'union <anonymous>' has no member named 'jmp_addr'
                 add_assoc_long(return_value, "opline", ((char *)node->u.jmp_addr - opcodes_base) / sizeof(zend_op));
                                                                        ^
/usr/include/php/Zend/zend_API.h:385:92: note: in definition of macro 'add_assoc_long'
 #define add_assoc_long(__arg, __key, __n) add_assoc_long_ex(__arg, __key, strlen(__key)+1, __n)
                                                                                            ^
/tmp/B.340e56b9-b473-4eda-8622-1cde38159093/BUILD/bytekit-0.1.1/bytekit.c: In function 'bytekit_raw_op':
/tmp/B.340e56b9-b473-4eda-8622-1cde38159093/BUILD/bytekit-0.1.1/bytekit.c:1198:9: warning: passing argument 3 of 'bytekit_raw_node' from incompatible pointer type [enabled by default]
         bytekit_raw_node(result, op_array, &(op->result), (opcode_flags & BYTEKIT_RES_USED) >> BYTEKIT_RES_SHIFT, options TSRMLS_CC);
         ^
/tmp/B.340e56b9-b473-4eda-8622-1cde38159093/BUILD/bytekit-0.1.1/bytekit.c:1133:13: note: expected 'struct znode *' but argument is of type 'union znode_op *'
 static void bytekit_raw_node(zval *return_value, zend_op_array *op_array, znode *node, long opcode_flags, long options TSRMLS_DC)
             ^
/tmp/B.340e56b9-b473-4eda-8622-1cde38159093/BUILD/bytekit-0.1.1/bytekit.c:1206:9: warning: passing argument 3 of 'bytekit_raw_node' from incompatible pointer type [enabled by default]
         bytekit_raw_node(op1, op_array, &(op->op1), (opcode_flags & BYTEKIT_OP1_USED) >> BYTEKIT_OP1_SHIFT, options TSRMLS_CC);
         ^
/tmp/B.340e56b9-b473-4eda-8622-1cde38159093/BUILD/bytekit-0.1.1/bytekit.c:1133:13: note: expected 'struct znode *' but argument is of type 'union znode_op *'
 static void bytekit_raw_node(zval *return_value, zend_op_array *op_array, znode *node, long opcode_flags, long options TSRMLS_DC)
             ^
/tmp/B.340e56b9-b473-4eda-8622-1cde38159093/BUILD/bytekit-0.1.1/bytekit.c:1214:9: warning: passing argument 3 of 'bytekit_raw_node' from incompatible pointer type [enabled by default]
         bytekit_raw_node(op2, op_array, &(op->op2), (opcode_flags & BYTEKIT_OP2_USED) >> BYTEKIT_OP2_SHIFT, options TSRMLS_CC);
         ^
/tmp/B.340e56b9-b473-4eda-8622-1cde38159093/BUILD/bytekit-0.1.1/bytekit.c:1133:13: note: expected 'struct znode *' but argument is of type 'union znode_op *'
 static void bytekit_raw_node(zval *return_value, zend_op_array *op_array, znode *node, long opcode_flags, long options TSRMLS_DC)
             ^
/tmp/B.340e56b9-b473-4eda-8622-1cde38159093/BUILD/bytekit-0.1.1/bytekit.c: In function 'bytekit_disassemble_op_array':
/tmp/B.340e56b9-b473-4eda-8622-1cde38159093/BUILD/bytekit-0.1.1/bytekit.c:1271:9: warning: passing argument 4 of 'add_assoc_string_ex' discards 'const' qualifier from pointer target type [enabled by default]
         add_assoc_string(raw, "function_name", ops->function_name, 1);
         ^
In file included from /usr/include/php/main/php.h:38:0,
                 from /tmp/B.340e56b9-b473-4eda-8622-1cde38159093/BUILD/bytekit-0.1.1/bytekit.c:30:
/usr/include/php/Zend/zend_API.h:381:14: note: expected 'char *' but argument is of type 'const char *'
 ZEND_API int add_assoc_string_ex(zval *arg, const char *key, uint key_len, char *str, int duplicate);
              ^
/tmp/B.340e56b9-b473-4eda-8622-1cde38159093/BUILD/bytekit-0.1.1/bytekit.c:1277:9: warning: passing argument 4 of 'add_assoc_stringl_ex' discards 'const' qualifier from pointer target type [enabled by default]
         add_assoc_stringl(raw, "scope", ops->scope->name, ops->scope->name_length, 1);
         ^
In file included from /usr/include/php/main/php.h:38:0,
                 from /tmp/B.340e56b9-b473-4eda-8622-1cde38159093/BUILD/bytekit-0.1.1/bytekit.c:30:
/usr/include/php/Zend/zend_API.h:382:14: note: expected 'char *' but argument is of type 'const char *'
 ZEND_API int add_assoc_stringl_ex(zval *arg, const char *key, uint key_len, char *str, uint length, int duplicate);
              ^
/tmp/B.340e56b9-b473-4eda-8622-1cde38159093/BUILD/bytekit-0.1.1/bytekit.c:1285:54: error: 'zend_op_array' has no member named 'pass_rest_by_reference'
     add_assoc_bool(raw, "pass_rest_by_reference", ops->pass_rest_by_reference);
                                                      ^
/usr/include/php/Zend/zend_API.h:387:92: note: in definition of macro 'add_assoc_bool'
 #define add_assoc_bool(__arg, __key, __b) add_assoc_bool_ex(__arg, __key, strlen(__key)+1, __b)
                                                                                            ^
/tmp/B.340e56b9-b473-4eda-8622-1cde38159093/BUILD/bytekit-0.1.1/bytekit.c:1311:9: warning: passing argument 4 of 'add_assoc_stringl_ex' discards 'const' qualifier from pointer target type [enabled by default]
         add_assoc_stringl(raw, "doc_comment", ops->doc_comment, ops->doc_comment_len, 1);
         ^
In file included from /usr/include/php/main/php.h:38:0,
                 from /tmp/B.340e56b9-b473-4eda-8622-1cde38159093/BUILD/bytekit-0.1.1/bytekit.c:30:
/usr/include/php/Zend/zend_API.h:382:14: note: expected 'char *' but argument is of type 'const char *'
 ZEND_API int add_assoc_stringl_ex(zval *arg, const char *key, uint key_len, char *str, uint length, int duplicate);
              ^
/tmp/B.340e56b9-b473-4eda-8622-1cde38159093/BUILD/bytekit-0.1.1/bytekit.c:1316:48: error: 'zend_op_array' has no member named 'return_reference'
     add_assoc_bool(raw, "return_reference", ops->return_reference);
                                                ^
/usr/include/php/Zend/zend_API.h:387:92: note: in definition of macro 'add_assoc_bool'
 #define add_assoc_bool(__arg, __key, __b) add_assoc_bool_ex(__arg, __key, strlen(__key)+1, __b)
                                                                                            ^
/tmp/B.340e56b9-b473-4eda-8622-1cde38159093/BUILD/bytekit-0.1.1/bytekit.c:1319:36: error: 'zend_op_array' has no member named 'size'
     add_assoc_long(raw, "size", ops->size);
                                    ^
/usr/include/php/Zend/zend_API.h:385:92: note: in definition of macro 'add_assoc_long'
 #define add_assoc_long(__arg, __key, __n) add_assoc_long_ex(__arg, __key, strlen(__key)+1, __n)
                                                                                            ^
/tmp/B.340e56b9-b473-4eda-8622-1cde38159093/BUILD/bytekit-0.1.1/bytekit.c:1322:48: error: 'zend_op_array' has no member named 'current_brk_cont'
     add_assoc_long(raw, "current_brk_cont", ops->current_brk_cont);
                                                ^
/usr/include/php/Zend/zend_API.h:385:92: note: in definition of macro 'add_assoc_long'
 #define add_assoc_long(__arg, __key, __n) add_assoc_long_ex(__arg, __key, strlen(__key)+1, __n)
                                                                                            ^
/tmp/B.340e56b9-b473-4eda-8622-1cde38159093/BUILD/bytekit-0.1.1/bytekit.c:1323:47: error: 'zend_op_array' has no member named 'backpatch_count'
     add_assoc_long(raw, "backpatch_count", ops->backpatch_count);
                                               ^
/usr/include/php/Zend/zend_API.h:385:92: note: in definition of macro 'add_assoc_long'
 #define add_assoc_long(__arg, __key, __n) add_assoc_long_ex(__arg, __key, strlen(__key)+1, __n)
                                                                                            ^
/tmp/B.340e56b9-b473-4eda-8622-1cde38159093/BUILD/bytekit-0.1.1/bytekit.c:1324:45: error: 'zend_op_array' has no member named 'done_pass_two'
     add_assoc_bool(raw, "done_pass_two", ops->done_pass_two);
                                             ^
/usr/include/php/Zend/zend_API.h:387:92: note: in definition of macro 'add_assoc_bool'
 #define add_assoc_bool(__arg, __key, __b) add_assoc_bool_ex(__arg, __key, strlen(__key)+1, __b)
                                                                                            ^
/tmp/B.340e56b9-b473-4eda-8622-1cde38159093/BUILD/bytekit-0.1.1/bytekit.c:1367:12: error: 'zend_op_array' has no member named 'start_op'
     if (ops->start_op) {
            ^
/tmp/B.340e56b9-b473-4eda-8622-1cde38159093/BUILD/bytekit-0.1.1/bytekit.c:1370:59: error: 'zend_op_array' has no member named 'start_op'
         snprintf(sop, sizeof(sop), "%X", (unsigned int)ops->start_op); 
                                                           ^
/tmp/B.340e56b9-b473-4eda-8622-1cde38159093/BUILD/bytekit-0.1.1/bytekit.c:1377:9: warning: passing argument 4 of 'add_assoc_string_ex' discards 'const' qualifier from pointer target type [enabled by default]
         add_assoc_string(raw, "filename", ops->filename, 1);
         ^
In file included from /usr/include/php/main/php.h:38:0,
                 from /tmp/B.340e56b9-b473-4eda-8622-1cde38159093/BUILD/bytekit-0.1.1/bytekit.c:30:
/usr/include/php/Zend/zend_API.h:381:14: note: expected 'char *' but argument is of type 'const char *'
 ZEND_API int add_assoc_string_ex(zval *arg, const char *key, uint key_len, char *str, int duplicate);
              ^
/tmp/B.340e56b9-b473-4eda-8622-1cde38159093/BUILD/bytekit-0.1.1/bytekit.c: In function 'bytekit_disassemble_class_entry':
/tmp/B.340e56b9-b473-4eda-8622-1cde38159093/BUILD/bytekit-0.1.1/bytekit.c:1469:5: warning: passing argument 4 of 'add_assoc_stringl_ex' discards 'const' qualifier from pointer target type [enabled by default]
     add_assoc_stringl(raw_class, "name", ce->name, ce->name_length, 1);
     ^
In file included from /usr/include/php/main/php.h:38:0,
                 from /tmp/B.340e56b9-b473-4eda-8622-1cde38159093/BUILD/bytekit-0.1.1/bytekit.c:30:
/usr/include/php/Zend/zend_API.h:382:14: note: expected 'char *' but argument is of type 'const char *'
 ZEND_API int add_assoc_stringl_ex(zval *arg, const char *key, uint key_len, char *str, uint length, int duplicate);
              ^
/tmp/B.340e56b9-b473-4eda-8622-1cde38159093/BUILD/bytekit-0.1.1/bytekit.c:1471:9: warning: passing argument 4 of 'add_assoc_stringl_ex' discards 'const' qualifier from pointer target type [enabled by default]
         add_assoc_stringl(raw_class, "parent", ce->parent->name, ce->parent->name_length, 1);
         ^
In file included from /usr/include/php/main/php.h:38:0,
                 from /tmp/B.340e56b9-b473-4eda-8622-1cde38159093/BUILD/bytekit-0.1.1/bytekit.c:30:
/usr/include/php/Zend/zend_API.h:382:14: note: expected 'char *' but argument is of type 'const char *'
 ZEND_API int add_assoc_stringl_ex(zval *arg, const char *key, uint key_len, char *str, uint length, int duplicate);
              ^
/tmp/B.340e56b9-b473-4eda-8622-1cde38159093/BUILD/bytekit-0.1.1/bytekit.c:1475:54: error: 'zend_class_entry' has no member named 'constants_updated'
     add_assoc_bool(raw_class, "constants_updated", ce->constants_updated);
                                                      ^
/usr/include/php/Zend/zend_API.h:387:92: note: in definition of macro 'add_assoc_bool'
 #define add_assoc_bool(__arg, __key, __b) add_assoc_bool_ex(__arg, __key, strlen(__key)+1, __b)
                                                                                            ^
/tmp/B.340e56b9-b473-4eda-8622-1cde38159093/BUILD/bytekit-0.1.1/bytekit.c:1480:9: warning: passing argument 4 of 'add_assoc_string_ex' discards 'const' qualifier from pointer target type [enabled by default]
         add_assoc_string(raw_class, "constructor", ce->constructor->common.function_name, 1);
         ^
In file included from /usr/include/php/main/php.h:38:0,
                 from /tmp/B.340e56b9-b473-4eda-8622-1cde38159093/BUILD/bytekit-0.1.1/bytekit.c:30:
/usr/include/php/Zend/zend_API.h:381:14: note: expected 'char *' but argument is of type 'const char *'
 ZEND_API int add_assoc_string_ex(zval *arg, const char *key, uint key_len, char *str, int duplicate);
              ^
/tmp/B.340e56b9-b473-4eda-8622-1cde38159093/BUILD/bytekit-0.1.1/bytekit.c:1486:9: warning: passing argument 4 of 'add_assoc_string_ex' discards 'const' qualifier from pointer target type [enabled by default]
         add_assoc_string(raw_class, "clone", ce->clone->common.function_name, 1);
         ^
In file included from /usr/include/php/main/php.h:38:0,
                 from /tmp/B.340e56b9-b473-4eda-8622-1cde38159093/BUILD/bytekit-0.1.1/bytekit.c:30:
/usr/include/php/Zend/zend_API.h:381:14: note: expected 'char *' but argument is of type 'const char *'
 ZEND_API int add_assoc_string_ex(zval *arg, const char *key, uint key_len, char *str, int duplicate);
              ^
/tmp/B.340e56b9-b473-4eda-8622-1cde38159093/BUILD/bytekit-0.1.1/bytekit.c:1492:9: warning: passing argument 4 of 'add_assoc_string_ex' discards 'const' qualifier from pointer target type [enabled by default]
         add_assoc_string(raw_class, "__get", ce->__get->common.function_name, 1);
         ^
In file included from /usr/include/php/main/php.h:38:0,
                 from /tmp/B.340e56b9-b473-4eda-8622-1cde38159093/BUILD/bytekit-0.1.1/bytekit.c:30:
/usr/include/php/Zend/zend_API.h:381:14: note: expected 'char *' but argument is of type 'const char *'
 ZEND_API int add_assoc_string_ex(zval *arg, const char *key, uint key_len, char *str, int duplicate);
              ^
/tmp/B.340e56b9-b473-4eda-8622-1cde38159093/BUILD/bytekit-0.1.1/bytekit.c:1498:9: warning: passing argument 4 of 'add_assoc_string_ex' discards 'const' qualifier from pointer target type [enabled by default]
         add_assoc_string(raw_class, "__set", ce->__set->common.function_name, 1);
         ^
In file included from /usr/include/php/main/php.h:38:0,
                 from /tmp/B.340e56b9-b473-4eda-8622-1cde38159093/BUILD/bytekit-0.1.1/bytekit.c:30:
/usr/include/php/Zend/zend_API.h:381:14: note: expected 'char *' but argument is of type 'const char *'
 ZEND_API int add_assoc_string_ex(zval *arg, const char *key, uint key_len, char *str, int duplicate);
              ^
/tmp/B.340e56b9-b473-4eda-8622-1cde38159093/BUILD/bytekit-0.1.1/bytekit.c:1504:9: warning: passing argument 4 of 'add_assoc_string_ex' discards 'const' qualifier from pointer target type [enabled by default]
         add_assoc_string(raw_class, "__call", ce->__call->common.function_name, 1);
         ^
In file included from /usr/include/php/main/php.h:38:0,
                 from /tmp/B.340e56b9-b473-4eda-8622-1cde38159093/BUILD/bytekit-0.1.1/bytekit.c:30:
/usr/include/php/Zend/zend_API.h:381:14: note: expected 'char *' but argument is of type 'const char *'
 ZEND_API int add_assoc_string_ex(zval *arg, const char *key, uint key_len, char *str, int duplicate);
              ^
/tmp/B.340e56b9-b473-4eda-8622-1cde38159093/BUILD/bytekit-0.1.1/bytekit.c:1522:13: warning: passing argument 4 of 'add_assoc_stringl_ex' discards 'const' qualifier from pointer target type [enabled by default]
             add_assoc_stringl(tmp_zval, "name", property_info->name, property_info->name_length, 1);
             ^
In file included from /usr/include/php/main/php.h:38:0,
                 from /tmp/B.340e56b9-b473-4eda-8622-1cde38159093/BUILD/bytekit-0.1.1/bytekit.c:30:
/usr/include/php/Zend/zend_API.h:382:14: note: expected 'char *' but argument is of type 'const char *'
 ZEND_API int add_assoc_stringl_ex(zval *arg, const char *key, uint key_len, char *str, uint length, int duplicate);
              ^
/tmp/B.340e56b9-b473-4eda-8622-1cde38159093/BUILD/bytekit-0.1.1/bytekit.c:1530:11: error: 'zend_class_entry' has no member named 'static_members'
     if (ce->static_members && zend_hash_num_elements(ce->static_members) > 0) {
           ^
/tmp/B.340e56b9-b473-4eda-8622-1cde38159093/BUILD/bytekit-0.1.1/bytekit.c:1530:56: error: 'zend_class_entry' has no member named 'static_members'
     if (ce->static_members && zend_hash_num_elements(ce->static_members) > 0) {
                                                        ^
/tmp/B.340e56b9-b473-4eda-8622-1cde38159093/BUILD/bytekit-0.1.1/bytekit.c:1535:44: error: 'zend_class_entry' has no member named 'static_members'
         zend_hash_copy(HASH_OF(tmpzval), ce->static_members, (copy_ctor_func_t) zval_add_ref, (void *) &tmp_zval, sizeof(zval *));  
                                            ^
In file included from /usr/include/php/main/php.h:38:0,
                 from /tmp/B.340e56b9-b473-4eda-8622-1cde38159093/BUILD/bytekit-0.1.1/bytekit.c:30:
/tmp/B.340e56b9-b473-4eda-8622-1cde38159093/BUILD/bytekit-0.1.1/bytekit.c:1563:47: error: 'zend_class_entry' has no member named 'filename'
     add_assoc_string(raw_class, "filename", ce->filename, 1);
                                               ^
/usr/include/php/Zend/zend_API.h:390:111: note: in definition of macro 'add_assoc_string'
 #define add_assoc_string(__arg, __key, __str, __duplicate) add_assoc_string_ex(__arg, __key, strlen(__key)+1, __str, __duplicate)
                                                                                                               ^
/tmp/B.340e56b9-b473-4eda-8622-1cde38159093/BUILD/bytekit-0.1.1/bytekit.c:1564:47: error: 'zend_class_entry' has no member named 'line_start'
     add_assoc_long(raw_class, "line_start", ce->line_start);
                                               ^
/usr/include/php/Zend/zend_API.h:385:92: note: in definition of macro 'add_assoc_long'
 #define add_assoc_long(__arg, __key, __n) add_assoc_long_ex(__arg, __key, strlen(__key)+1, __n)
                                                                                            ^
/tmp/B.340e56b9-b473-4eda-8622-1cde38159093/BUILD/bytekit-0.1.1/bytekit.c:1565:45: error: 'zend_class_entry' has no member named 'line_end'
     add_assoc_long(raw_class, "line_end", ce->line_end);
                                             ^
/usr/include/php/Zend/zend_API.h:385:92: note: in definition of macro 'add_assoc_long'
 #define add_assoc_long(__arg, __key, __n) add_assoc_long_ex(__arg, __key, strlen(__key)+1, __n)
                                                                                            ^
/tmp/B.340e56b9-b473-4eda-8622-1cde38159093/BUILD/bytekit-0.1.1/bytekit.c:1566:11: error: 'zend_class_entry' has no member named 'doc_comment'
     if (ce->doc_comment) {
           ^
In file included from /usr/include/php/main/php.h:38:0,
                 from /tmp/B.340e56b9-b473-4eda-8622-1cde38159093/BUILD/bytekit-0.1.1/bytekit.c:30:
/tmp/B.340e56b9-b473-4eda-8622-1cde38159093/BUILD/bytekit-0.1.1/bytekit.c:1567:55: error: 'zend_class_entry' has no member named 'doc_comment'
         add_assoc_stringl(raw_class, "doc_comment", ce->doc_comment, ce->doc_comment_len, 1);
                                                       ^
/usr/include/php/Zend/zend_API.h:391:123: note: in definition of macro 'add_assoc_stringl'
 #define add_assoc_stringl(__arg, __key, __str, __length, __duplicate) add_assoc_stringl_ex(__arg, __key, strlen(__key)+1, __str, __length, __duplicate)
                                                                                                                           ^
/tmp/B.340e56b9-b473-4eda-8622-1cde38159093/BUILD/bytekit-0.1.1/bytekit.c:1567:72: error: 'zend_class_entry' has no member named 'doc_comment_len'
         add_assoc_stringl(raw_class, "doc_comment", ce->doc_comment, ce->doc_comment_len, 1);
                                                                        ^
/usr/include/php/Zend/zend_API.h:391:130: note: in definition of macro 'add_assoc_stringl'
 #define add_assoc_stringl(__arg, __key, __str, __length, __duplicate) add_assoc_stringl_ex(__arg, __key, strlen(__key)+1, __str, __length, __duplicate)
                                                                                                                                  ^
/tmp/B.340e56b9-b473-4eda-8622-1cde38159093/BUILD/bytekit-0.1.1/bytekit.c:1588:36: error: 'zend_class_entry' has no member named 'default_properties'
     if (zend_hash_num_elements(&(ce->default_properties)) > 0) {
                                    ^
/tmp/B.340e56b9-b473-4eda-8622-1cde38159093/BUILD/bytekit-0.1.1/bytekit.c:1593:46: error: 'zend_class_entry' has no member named 'default_properties'
         zend_hash_copy(HASH_OF(tmpzval), &(ce->default_properties), (copy_ctor_func_t) zval_add_ref, (void *) &tmp_zval, sizeof(zval *));   
                                              ^
/tmp/B.340e56b9-b473-4eda-8622-1cde38159093/BUILD/bytekit-0.1.1/bytekit.c: In function 'zif_bytekit_set_baseaddress':
/tmp/B.340e56b9-b473-4eda-8622-1cde38159093/BUILD/bytekit-0.1.1/bytekit.c:1825:5: warning: 'zend_get_parameters_ex' is deprecated (declared at /usr/include/php/Zend/zend_API.h:238) [-Wdeprecated-declarations]
     if (ZEND_NUM_ARGS() != 1 || zend_get_parameters_ex(1, &value) == FAILURE) {
     ^
/tmp/B.340e56b9-b473-4eda-8622-1cde38159093/BUILD/bytekit-0.1.1/bytekit.c: At top level:
/tmp/B.340e56b9-b473-4eda-8622-1cde38159093/BUILD/bytekit-0.1.1/bytekit.c:1863:1: error: unknown type name 'function_entry'
 function_entry bytekit_functions[] = {
 ^
/tmp/B.340e56b9-b473-4eda-8622-1cde38159093/BUILD/bytekit-0.1.1/bytekit.c:1864:5: warning: braces around scalar initializer [enabled by default]
     PHP_FE(bytekit_disassemble_file,            bytekit_second_arg_force_ref)
     ^
/tmp/B.340e56b9-b473-4eda-8622-1cde38159093/BUILD/bytekit-0.1.1/bytekit.c:1864:5: warning: (near initialization for 'bytekit_functions[0]') [enabled by default]
/tmp/B.340e56b9-b473-4eda-8622-1cde38159093/BUILD/bytekit-0.1.1/bytekit.c:1864:5: warning: initialization makes integer from pointer without a cast [enabled by default]
/tmp/B.340e56b9-b473-4eda-8622-1cde38159093/BUILD/bytekit-0.1.1/bytekit.c:1864:5: warning: (near initialization for 'bytekit_functions[0]') [enabled by default]
/tmp/B.340e56b9-b473-4eda-8622-1cde38159093/BUILD/bytekit-0.1.1/bytekit.c:1864:5: error: initializer element is not computable at load time
/tmp/B.340e56b9-b473-4eda-8622-1cde38159093/BUILD/bytekit-0.1.1/bytekit.c:1864:5: error: (near initialization for 'bytekit_functions[0]')
/tmp/B.340e56b9-b473-4eda-8622-1cde38159093/BUILD/bytekit-0.1.1/bytekit.c:1864:5: warning: excess elements in scalar initializer [enabled by default]
/tmp/B.340e56b9-b473-4eda-8622-1cde38159093/BUILD/bytekit-0.1.1/bytekit.c:1864:5: warning: (near initialization for 'bytekit_functions[0]') [enabled by default]
/tmp/B.340e56b9-b473-4eda-8622-1cde38159093/BUILD/bytekit-0.1.1/bytekit.c:1864:5: warning: excess elements in scalar initializer [enabled by default]
/tmp/B.340e56b9-b473-4eda-8622-1cde38159093/BUILD/bytekit-0.1.1/bytekit.c:1864:5: warning: (near initialization for 'bytekit_functions[0]') [enabled by default]
In file included from /usr/include/php/main/php.h:38:0,
                 from /tmp/B.340e56b9-b473-4eda-8622-1cde38159093/BUILD/bytekit-0.1.1/bytekit.c:30:
/usr/include/php/Zend/zend_API.h:71:129: warning: excess elements in scalar initializer [enabled by default]
 #define ZEND_FENTRY(zend_name, name, arg_info, flags) { #zend_name, name, arg_info, (zend_uint) (sizeof(arg_info)/sizeof(struct _zend_arg_info)-1), flags },
                                                                                                                                 ^
/usr/include/php/Zend/zend_API.h:77:38: note: in expansion of macro 'ZEND_FENTRY'
 #define ZEND_FE(name, arg_info)      ZEND_FENTRY(name, ZEND_FN(name), arg_info, 0)
                                      ^
/usr/include/php/main/php.h:349:18: note: in expansion of macro 'ZEND_FE'
 #define PHP_FE   ZEND_FE
                  ^
/tmp/B.340e56b9-b473-4eda-8622-1cde38159093/BUILD/bytekit-0.1.1/bytekit.c:1864:5: note: in expansion of macro 'PHP_FE'
     PHP_FE(bytekit_disassemble_file,            bytekit_second_arg_force_ref)
     ^
/usr/include/php/Zend/zend_API.h:71:129: warning: (near initialization for 'bytekit_functions[0]') [enabled by default]
 #define ZEND_FENTRY(zend_name, name, arg_info, flags) { #zend_name, name, arg_info, (zend_uint) (sizeof(arg_info)/sizeof(struct _zend_arg_info)-1), flags },
                                                                                                                                 ^
/usr/include/php/Zend/zend_API.h:77:38: note: in expansion of macro 'ZEND_FENTRY'
 #define ZEND_FE(name, arg_info)      ZEND_FENTRY(name, ZEND_FN(name), arg_info, 0)
                                      ^
/usr/include/php/main/php.h:349:18: note: in expansion of macro 'ZEND_FE'
 #define PHP_FE   ZEND_FE
                  ^
/tmp/B.340e56b9-b473-4eda-8622-1cde38159093/BUILD/bytekit-0.1.1/bytekit.c:1864:5: note: in expansion of macro 'PHP_FE'
     PHP_FE(bytekit_disassemble_file,            bytekit_second_arg_force_ref)
     ^
/usr/include/php/Zend/zend_API.h:71:129: warning: excess elements in scalar initializer [enabled by default]
 #define ZEND_FENTRY(zend_name, name, arg_info, flags) { #zend_name, name, arg_info, (zend_uint) (sizeof(arg_info)/sizeof(struct _zend_arg_info)-1), flags },
                                                                                                                                 ^
/usr/include/php/Zend/zend_API.h:77:38: note: in expansion of macro 'ZEND_FENTRY'
 #define ZEND_FE(name, arg_info)      ZEND_FENTRY(name, ZEND_FN(name), arg_info, 0)
                                      ^
/usr/include/php/main/php.h:349:18: note: in expansion of macro 'ZEND_FE'
 #define PHP_FE   ZEND_FE
                  ^
/tmp/B.340e56b9-b473-4eda-8622-1cde38159093/BUILD/bytekit-0.1.1/bytekit.c:1864:5: note: in expansion of macro 'PHP_FE'
     PHP_FE(bytekit_disassemble_file,            bytekit_second_arg_force_ref)
     ^
/usr/include/php/Zend/zend_API.h:71:129: warning: (near initialization for 'bytekit_functions[0]') [enabled by default]
 #define ZEND_FENTRY(zend_name, name, arg_info, flags) { #zend_name, name, arg_info, (zend_uint) (sizeof(arg_info)/sizeof(struct _zend_arg_info)-1), flags },
                                                                                                                                 ^
/usr/include/php/Zend/zend_API.h:77:38: note: in expansion of macro 'ZEND_FENTRY'
 #define ZEND_FE(name, arg_info)      ZEND_FENTRY(name, ZEND_FN(name), arg_info, 0)
                                      ^
/usr/include/php/main/php.h:349:18: note: in expansion of macro 'ZEND_FE'
 #define PHP_FE   ZEND_FE
                  ^
/tmp/B.340e56b9-b473-4eda-8622-1cde38159093/BUILD/bytekit-0.1.1/bytekit.c:1864:5: note: in expansion of macro 'PHP_FE'
     PHP_FE(bytekit_disassemble_file,            bytekit_second_arg_force_ref)
     ^
/tmp/B.340e56b9-b473-4eda-8622-1cde38159093/BUILD/bytekit-0.1.1/bytekit.c:1865:5: warning: braces around scalar initializer [enabled by default]
     PHP_FE(bytekit_get_baseaddress,             bytekit_arginfo_get_baseaddress)
     ^
/tmp/B.340e56b9-b473-4eda-8622-1cde38159093/BUILD/bytekit-0.1.1/bytekit.c:1865:5: warning: (near initialization for 'bytekit_functions[1]') [enabled by default]
/tmp/B.340e56b9-b473-4eda-8622-1cde38159093/BUILD/bytekit-0.1.1/bytekit.c:1865:5: warning: initialization makes integer from pointer without a cast [enabled by default]
/tmp/B.340e56b9-b473-4eda-8622-1cde38159093/BUILD/bytekit-0.1.1/bytekit.c:1865:5: warning: (near initialization for 'bytekit_functions[1]') [enabled by default]
/tmp/B.340e56b9-b473-4eda-8622-1cde38159093/BUILD/bytekit-0.1.1/bytekit.c:1865:5: error: initializer element is not computable at load time
/tmp/B.340e56b9-b473-4eda-8622-1cde38159093/BUILD/bytekit-0.1.1/bytekit.c:1865:5: error: (near initialization for 'bytekit_functions[1]')
/tmp/B.340e56b9-b473-4eda-8622-1cde38159093/BUILD/bytekit-0.1.1/bytekit.c:1865:5: warning: excess elements in scalar initializer [enabled by default]
/tmp/B.340e56b9-b473-4eda-8622-1cde38159093/BUILD/bytekit-0.1.1/bytekit.c:1865:5: warning: (near initialization for 'bytekit_functions[1]') [enabled by default]
/tmp/B.340e56b9-b473-4eda-8622-1cde38159093/BUILD/bytekit-0.1.1/bytekit.c:1865:5: warning: excess elements in scalar initializer [enabled by default]
/tmp/B.340e56b9-b473-4eda-8622-1cde38159093/BUILD/bytekit-0.1.1/bytekit.c:1865:5: warning: (near initialization for 'bytekit_functions[1]') [enabled by default]
In file included from /usr/include/php/main/php.h:38:0,
                 from /tmp/B.340e56b9-b473-4eda-8622-1cde38159093/BUILD/bytekit-0.1.1/bytekit.c:30:
/usr/include/php/Zend/zend_API.h:71:129: warning: excess elements in scalar initializer [enabled by default]
 #define ZEND_FENTRY(zend_name, name, arg_info, flags) { #zend_name, name, arg_info, (zend_uint) (sizeof(arg_info)/sizeof(struct _zend_arg_info)-1), flags },
                                                                                                                                 ^
/usr/include/php/Zend/zend_API.h:77:38: note: in expansion of macro 'ZEND_FENTRY'
 #define ZEND_FE(name, arg_info)      ZEND_FENTRY(name, ZEND_FN(name), arg_info, 0)
                                      ^
/usr/include/php/main/php.h:349:18: note: in expansion of macro 'ZEND_FE'
 #define PHP_FE   ZEND_FE
                  ^
/tmp/B.340e56b9-b473-4eda-8622-1cde38159093/BUILD/bytekit-0.1.1/bytekit.c:1865:5: note: in expansion of macro 'PHP_FE'
     PHP_FE(bytekit_get_baseaddress,             bytekit_arginfo_get_baseaddress)
     ^
/usr/include/php/Zend/zend_API.h:71:129: warning: (near initialization for 'bytekit_functions[1]') [enabled by default]
 #define ZEND_FENTRY(zend_name, name, arg_info, flags) { #zend_name, name, arg_info, (zend_uint) (sizeof(arg_info)/sizeof(struct _zend_arg_info)-1), flags },
                                                                                                                                 ^
/usr/include/php/Zend/zend_API.h:77:38: note: in expansion of macro 'ZEND_FENTRY'
 #define ZEND_FE(name, arg_info)      ZEND_FENTRY(name, ZEND_FN(name), arg_info, 0)
                                      ^
/usr/include/php/main/php.h:349:18: note: in expansion of macro 'ZEND_FE'
 #define PHP_FE   ZEND_FE
                  ^
/tmp/B.340e56b9-b473-4eda-8622-1cde38159093/BUILD/bytekit-0.1.1/bytekit.c:1865:5: note: in expansion of macro 'PHP_FE'
     PHP_FE(bytekit_get_baseaddress,             bytekit_arginfo_get_baseaddress)
     ^
/usr/include/php/Zend/zend_API.h:71:129: warning: excess elements in scalar initializer [enabled by default]
 #define ZEND_FENTRY(zend_name, name, arg_info, flags) { #zend_name, name, arg_info, (zend_uint) (sizeof(arg_info)/sizeof(struct _zend_arg_info)-1), flags },
                                                                                                                                 ^
/usr/include/php/Zend/zend_API.h:77:38: note: in expansion of macro 'ZEND_FENTRY'
 #define ZEND_FE(name, arg_info)      ZEND_FENTRY(name, ZEND_FN(name), arg_info, 0)
                                      ^
/usr/include/php/main/php.h:349:18: note: in expansion of macro 'ZEND_FE'
 #define PHP_FE   ZEND_FE
                  ^
/tmp/B.340e56b9-b473-4eda-8622-1cde38159093/BUILD/bytekit-0.1.1/bytekit.c:1865:5: note: in expansion of macro 'PHP_FE'
     PHP_FE(bytekit_get_baseaddress,             bytekit_arginfo_get_baseaddress)
     ^
/usr/include/php/Zend/zend_API.h:71:129: warning: (near initialization for 'bytekit_functions[1]') [enabled by default]
 #define ZEND_FENTRY(zend_name, name, arg_info, flags) { #zend_name, name, arg_info, (zend_uint) (sizeof(arg_info)/sizeof(struct _zend_arg_info)-1), flags },
                                                                                                                                 ^
/usr/include/php/Zend/zend_API.h:77:38: note: in expansion of macro 'ZEND_FENTRY'
 #define ZEND_FE(name, arg_info)      ZEND_FENTRY(name, ZEND_FN(name), arg_info, 0)
                                      ^
/usr/include/php/main/php.h:349:18: note: in expansion of macro 'ZEND_FE'
 #define PHP_FE   ZEND_FE
                  ^
/tmp/B.340e56b9-b473-4eda-8622-1cde38159093/BUILD/bytekit-0.1.1/bytekit.c:1865:5: note: in expansion of macro 'PHP_FE'
     PHP_FE(bytekit_get_baseaddress,             bytekit_arginfo_get_baseaddress)
     ^
/tmp/B.340e56b9-b473-4eda-8622-1cde38159093/BUILD/bytekit-0.1.1/bytekit.c:1866:5: warning: braces around scalar initializer [enabled by default]
     PHP_FE(bytekit_set_baseaddress,             bytekit_arginfo_set_baseaddress)
     ^
/tmp/B.340e56b9-b473-4eda-8622-1cde38159093/BUILD/bytekit-0.1.1/bytekit.c:1866:5: warning: (near initialization for 'bytekit_functions[2]') [enabled by default]
/tmp/B.340e56b9-b473-4eda-8622-1cde38159093/BUILD/bytekit-0.1.1/bytekit.c:1866:5: warning: initialization makes integer from pointer without a cast [enabled by default]
/tmp/B.340e56b9-b473-4eda-8622-1cde38159093/BUILD/bytekit-0.1.1/bytekit.c:1866:5: warning: (near initialization for 'bytekit_functions[2]') [enabled by default]
/tmp/B.340e56b9-b473-4eda-8622-1cde38159093/BUILD/bytekit-0.1.1/bytekit.c:1866:5: error: initializer element is not computable at load time
/tmp/B.340e56b9-b473-4eda-8622-1cde38159093/BUILD/bytekit-0.1.1/bytekit.c:1866:5: error: (near initialization for 'bytekit_functions[2]')
/tmp/B.340e56b9-b473-4eda-8622-1cde38159093/BUILD/bytekit-0.1.1/bytekit.c:1866:5: warning: excess elements in scalar initializer [enabled by default]
/tmp/B.340e56b9-b473-4eda-8622-1cde38159093/BUILD/bytekit-0.1.1/bytekit.c:1866:5: warning: (near initialization for 'bytekit_functions[2]') [enabled by default]
/tmp/B.340e56b9-b473-4eda-8622-1cde38159093/BUILD/bytekit-0.1.1/bytekit.c:1866:5: warning: excess elements in scalar initializer [enabled by default]
/tmp/B.340e56b9-b473-4eda-8622-1cde38159093/BUILD/bytekit-0.1.1/bytekit.c:1866:5: warning: (near initialization for 'bytekit_functions[2]') [enabled by default]
In file included from /usr/include/php/main/php.h:38:0,
                 from /tmp/B.340e56b9-b473-4eda-8622-1cde38159093/BUILD/bytekit-0.1.1/bytekit.c:30:
/usr/include/php/Zend/zend_API.h:71:129: warning: excess elements in scalar initializer [enabled by default]
 #define ZEND_FENTRY(zend_name, name, arg_info, flags) { #zend_name, name, arg_info, (zend_uint) (sizeof(arg_info)/sizeof(struct _zend_arg_info)-1), flags },
                                                                                                                                 ^
/usr/include/php/Zend/zend_API.h:77:38: note: in expansion of macro 'ZEND_FENTRY'
 #define ZEND_FE(name, arg_info)      ZEND_FENTRY(name, ZEND_FN(name), arg_info, 0)
                                      ^
/usr/include/php/main/php.h:349:18: note: in expansion of macro 'ZEND_FE'
 #define PHP_FE   ZEND_FE
                  ^
/tmp/B.340e56b9-b473-4eda-8622-1cde38159093/BUILD/bytekit-0.1.1/bytekit.c:1866:5: note: in expansion of macro 'PHP_FE'
     PHP_FE(bytekit_set_baseaddress,             bytekit_arginfo_set_baseaddress)
     ^
/usr/include/php/Zend/zend_API.h:71:129: warning: (near initialization for 'bytekit_functions[2]') [enabled by default]
 #define ZEND_FENTRY(zend_name, name, arg_info, flags) { #zend_name, name, arg_info, (zend_uint) (sizeof(arg_info)/sizeof(struct _zend_arg_info)-1), flags },
                                                                                                                                 ^
/usr/include/php/Zend/zend_API.h:77:38: note: in expansion of macro 'ZEND_FENTRY'
 #define ZEND_FE(name, arg_info)      ZEND_FENTRY(name, ZEND_FN(name), arg_info, 0)
                                      ^
/usr/include/php/main/php.h:349:18: note: in expansion of macro 'ZEND_FE'
 #define PHP_FE   ZEND_FE
                  ^
/tmp/B.340e56b9-b473-4eda-8622-1cde38159093/BUILD/bytekit-0.1.1/bytekit.c:1866:5: note: in expansion of macro 'PHP_FE'
     PHP_FE(bytekit_set_baseaddress,             bytekit_arginfo_set_baseaddress)
     ^
/usr/include/php/Zend/zend_API.h:71:129: warning: excess elements in scalar initializer [enabled by default]
 #define ZEND_FENTRY(zend_name, name, arg_info, flags) { #zend_name, name, arg_info, (zend_uint) (sizeof(arg_info)/sizeof(struct _zend_arg_info)-1), flags },
                                                                                                                                 ^
/usr/include/php/Zend/zend_API.h:77:38: note: in expansion of macro 'ZEND_FENTRY'
 #define ZEND_FE(name, arg_info)      ZEND_FENTRY(name, ZEND_FN(name), arg_info, 0)
                                      ^
/usr/include/php/main/php.h:349:18: note: in expansion of macro 'ZEND_FE'
 #define PHP_FE   ZEND_FE
                  ^
/tmp/B.340e56b9-b473-4eda-8622-1cde38159093/BUILD/bytekit-0.1.1/bytekit.c:1866:5: note: in expansion of macro 'PHP_FE'
     PHP_FE(bytekit_set_baseaddress,             bytekit_arginfo_set_baseaddress)
     ^
/usr/include/php/Zend/zend_API.h:71:129: warning: (near initialization for 'bytekit_functions[2]') [enabled by default]
 #define ZEND_FENTRY(zend_name, name, arg_info, flags) { #zend_name, name, arg_info, (zend_uint) (sizeof(arg_info)/sizeof(struct _zend_arg_info)-1), flags },
                                                                                                                                 ^
/usr/include/php/Zend/zend_API.h:77:38: note: in expansion of macro 'ZEND_FENTRY'
 #define ZEND_FE(name, arg_info)      ZEND_FENTRY(name, ZEND_FN(name), arg_info, 0)
                                      ^
/usr/include/php/main/php.h:349:18: note: in expansion of macro 'ZEND_FE'
 #define PHP_FE   ZEND_FE
                  ^
/tmp/B.340e56b9-b473-4eda-8622-1cde38159093/BUILD/bytekit-0.1.1/bytekit.c:1866:5: note: in expansion of macro 'PHP_FE'
     PHP_FE(bytekit_set_baseaddress,             bytekit_arginfo_set_baseaddress)
     ^
/tmp/B.340e56b9-b473-4eda-8622-1cde38159093/BUILD/bytekit-0.1.1/bytekit.c:1867:5: warning: braces around scalar initializer [enabled by default]
     {NULL, NULL, NULL}
     ^
/tmp/B.340e56b9-b473-4eda-8622-1cde38159093/BUILD/bytekit-0.1.1/bytekit.c:1867:5: warning: (near initialization for 'bytekit_functions[3]') [enabled by default]
/tmp/B.340e56b9-b473-4eda-8622-1cde38159093/BUILD/bytekit-0.1.1/bytekit.c:1867:5: warning: initialization makes integer from pointer without a cast [enabled by default]
/tmp/B.340e56b9-b473-4eda-8622-1cde38159093/BUILD/bytekit-0.1.1/bytekit.c:1867:5: warning: (near initialization for 'bytekit_functions[3]') [enabled by default]
/tmp/B.340e56b9-b473-4eda-8622-1cde38159093/BUILD/bytekit-0.1.1/bytekit.c:1867:5: warning: excess elements in scalar initializer [enabled by default]
/tmp/B.340e56b9-b473-4eda-8622-1cde38159093/BUILD/bytekit-0.1.1/bytekit.c:1867:5: warning: (near initialization for 'bytekit_functions[3]') [enabled by default]
/tmp/B.340e56b9-b473-4eda-8622-1cde38159093/BUILD/bytekit-0.1.1/bytekit.c:1867:5: warning: excess elements in scalar initializer [enabled by default]
/tmp/B.340e56b9-b473-4eda-8622-1cde38159093/BUILD/bytekit-0.1.1/bytekit.c:1867:5: warning: (near initialization for 'bytekit_functions[3]') [enabled by default]
/tmp/B.340e56b9-b473-4eda-8622-1cde38159093/BUILD/bytekit-0.1.1/bytekit.c:1876:5: warning: initialization from incompatible pointer type [enabled by default]
     bytekit_functions,
     ^
/tmp/B.340e56b9-b473-4eda-8622-1cde38159093/BUILD/bytekit-0.1.1/bytekit.c:1876:5: warning: (near initialization for 'bytekit_module_entry.functions') [enabled by default]
Makefile:201: recipe for target 'bytekit.lo' failed
make: *** [bytekit.lo] Error 1
error: Bad exit status from /tmp/B.340e56b9-b473-4eda-8622-1cde38159093/BUILD/tmp/rpm-tmp.58362 (%build)


RPM build errors:
    Bad exit status from /tmp/B.340e56b9-b473-4eda-8622-1cde38159093/BUILD/tmp/rpm-tmp.58362 (%build)
ended at: Mon Apr 28 13:48:56 2014, done in 0:00:05.513798
error: No files produced.
mesg: ttyname failed: Inappropriate ioctl for device
+ chmod -R u+rwX /tmp/B.340e56b9-b473-4eda-8622-1cde38159093/BUILD
+ rm -rf /tmp/B.340e56b9-b473-4eda-8622-1cde38159093/tmp /tmp/B.340e56b9-b473-4eda-8622-1cde38159093/BUILD
mesg: ttyname failed: Inappropriate ioctl for device
+ rm -rf /tmp/B.340e56b9-b473-4eda-8622-1cde38159093
Begin-PLD-Builder-Info
Build-Time: user:3.48s sys:0.54s real:9.75s (faults io:0 non-io:812367)

End-PLD-Builder-Info
[Back to list of logs] [View rpm -qa of builder]