FailedOk

th/SRPMS[OK]
th/x32[OK]
th/i686[OK]
th/x86_64[OK]

ac/SRPMS[OK]
ac/i386[OK]
ac/i586[OK]
ac/i686[OK]
ac/alpha[OK]
ac/amd64[OK]
ac/athlon[OK]
ac/ppc[OK]
ac/sparc[OK]
ac/sparc64[OK]

Advanced Search
main()
Powered by PLD Linux
(c) 2002-2021 PLD Team
$Revision: 1.37 $
Powered by Linux.
Your IP: 54.227.97.219

php-eaccelerator a370d466-09aa-42f8-9483-2b4804246e9b

Status:Failed
Source URL:https://buildlogs.pld-linux.org/pld/th/x86_64/FAIL/php-eaccelerator,a370d466-09aa-42f8-9483-2b4804246e9b.bz2
text/plain URL:View!
full text:View!
rpm -qa of builder:View!
Date:2014/04/28 13:49:51
Runtime:0:00:09.365781

Toc:

  • error 1
  • /tmp/B.b0831137-5079-4121-aa60-900e29b62b65/BUILD/eaccelerator-0.9.6.1/eaccelerator.c:66:23: fatal error: php_logos.h: No such file or directory
  • error 2
  • compilation terminated.
  • error 3
  • Makefile:201: recipe for target 'eaccelerator.lo' failed
  • error 4
  • /tmp/B.b0831137-5079-4121-aa60-900e29b62b65/BUILD/eaccelerator-0.9.6.1/ea_store.c:201:28: error: 'znode_op' has no member named 'op_type'
  • error 5
  • /tmp/B.b0831137-5079-4121-aa60-900e29b62b65/BUILD/eaccelerator-0.9.6.1/ea_store.c:202:47: error: 'znode_op' has no member named 'u'
  • error 6
  • /tmp/B.b0831137-5079-4121-aa60-900e29b62b65/BUILD/eaccelerator-0.9.6.1/ea_store.c:204:28: error: 'znode_op' has no member named 'op_type'
  • error 7
  • /tmp/B.b0831137-5079-4121-aa60-900e29b62b65/BUILD/eaccelerator-0.9.6.1/ea_store.c:205:47: error: 'znode_op' has no member named 'u'
  • error 8
  • /tmp/B.b0831137-5079-4121-aa60-900e29b62b65/BUILD/eaccelerator-0.9.6.1/ea_store.c:254:13: error: 'zend_class_entry' has no member named 'filename'
  • error 9
  • /tmp/B.b0831137-5079-4121-aa60-900e29b62b65/BUILD/eaccelerator-0.9.6.1/ea_store.c:255:33: error: 'zend_class_entry' has no member named 'filename'
  • error 10
  • /tmp/B.b0831137-5079-4121-aa60-900e29b62b65/BUILD/eaccelerator-0.9.6.1/ea_store.c:255:56: error: 'zend_class_entry' has no member named 'filename'
  • error 11
  • /tmp/B.b0831137-5079-4121-aa60-900e29b62b65/BUILD/eaccelerator-0.9.6.1/ea_store.c:264:33: error: 'zend_class_entry' has no member named 'default_properties'
  • error 12
  • /tmp/B.b0831137-5079-4121-aa60-900e29b62b65/BUILD/eaccelerator-0.9.6.1/ea_store.c:264:33: error: 'zend_class_entry' has no member named 'default_properties'
  • error 13
  • /tmp/B.b0831137-5079-4121-aa60-900e29b62b65/BUILD/eaccelerator-0.9.6.1/ea_store.c:267:33: error: 'zend_class_entry' has no member named 'default_static_members'
  • error 14
  • /tmp/B.b0831137-5079-4121-aa60-900e29b62b65/BUILD/eaccelerator-0.9.6.1/ea_store.c:267:33: error: 'zend_class_entry' has no member named 'default_static_members'
  • error 15
  • /tmp/B.b0831137-5079-4121-aa60-900e29b62b65/BUILD/eaccelerator-0.9.6.1/ea_store.c:268:14: error: 'zend_class_entry' has no member named 'static_members'
  • error 16
  • /tmp/B.b0831137-5079-4121-aa60-900e29b62b65/BUILD/eaccelerator-0.9.6.1/ea_store.c:268:48: error: 'zend_class_entry' has no member named 'static_members'
  • error 17
  • /tmp/B.b0831137-5079-4121-aa60-900e29b62b65/BUILD/eaccelerator-0.9.6.1/ea_store.c:268:73: error: 'zend_class_entry' has no member named 'default_static_members'
  • error 18
  • /tmp/B.b0831137-5079-4121-aa60-900e29b62b65/BUILD/eaccelerator-0.9.6.1/ea_store.c:270:36: error: 'zend_class_entry' has no member named 'static_members'
  • error 19
  • /tmp/B.b0831137-5079-4121-aa60-900e29b62b65/BUILD/eaccelerator-0.9.6.1/ea_store.c:270:36: error: 'zend_class_entry' has no member named 'static_members'
  • error 20
  • /tmp/B.b0831137-5079-4121-aa60-900e29b62b65/BUILD/eaccelerator-0.9.6.1/ea_store.c:508:28: error: 'zend_arg_info' has no member named 'array_type_hint'
  • error 21
  • /tmp/B.b0831137-5079-4121-aa60-900e29b62b65/BUILD/eaccelerator-0.9.6.1/ea_store.c:508:64: error: 'zend_arg_info' has no member named 'array_type_hint'
  • error 22
  • /tmp/B.b0831137-5079-4121-aa60-900e29b62b65/BUILD/eaccelerator-0.9.6.1/ea_store.c:511:28: error: 'zend_arg_info' has no member named 'return_reference'
  • error 23
  • /tmp/B.b0831137-5079-4121-aa60-900e29b62b65/BUILD/eaccelerator-0.9.6.1/ea_store.c:511:65: error: 'zend_arg_info' has no member named 'return_reference'
  • error 24
  • /tmp/B.b0831137-5079-4121-aa60-900e29b62b65/BUILD/eaccelerator-0.9.6.1/ea_store.c:514:38: error: 'zend_op_array' has no member named 'pass_rest_by_reference'
  • error 25
  • /tmp/B.b0831137-5079-4121-aa60-900e29b62b65/BUILD/eaccelerator-0.9.6.1/ea_store.c:545:36: error: 'zend_op_array' has no member named 'return_reference'
  • error 26
  • /tmp/B.b0831137-5079-4121-aa60-900e29b62b65/BUILD/eaccelerator-0.9.6.1/ea_store.c:570:32: error: 'zend_op_array' has no member named 'return_reference'
  • error 27
  • /tmp/B.b0831137-5079-4121-aa60-900e29b62b65/BUILD/eaccelerator-0.9.6.1/ea_store.c:580:28: error: 'znode_op' has no member named 'op_type'
  • error 28
  • /tmp/B.b0831137-5079-4121-aa60-900e29b62b65/BUILD/eaccelerator-0.9.6.1/ea_store.c:581:44: error: 'znode_op' has no member named 'u'
  • error 29
  • /tmp/B.b0831137-5079-4121-aa60-900e29b62b65/BUILD/eaccelerator-0.9.6.1/ea_store.c:583:28: error: 'znode_op' has no member named 'op_type'
  • error 30
  • /tmp/B.b0831137-5079-4121-aa60-900e29b62b65/BUILD/eaccelerator-0.9.6.1/ea_store.c:584:44: error: 'znode_op' has no member named 'u'
  • error 31
  • /tmp/B.b0831137-5079-4121-aa60-900e29b62b65/BUILD/eaccelerator-0.9.6.1/ea_store.c:591:28: error: 'znode_op' has no member named 'u'
  • error 32
  • /tmp/B.b0831137-5079-4121-aa60-900e29b62b65/BUILD/eaccelerator-0.9.6.1/ea_store.c:591:68: error: 'znode_op' has no member named 'u'
  • error 33
  • /tmp/B.b0831137-5079-4121-aa60-900e29b62b65/BUILD/eaccelerator-0.9.6.1/ea_store.c:600:28: error: 'znode_op' has no member named 'u'
  • error 34
  • /tmp/B.b0831137-5079-4121-aa60-900e29b62b65/BUILD/eaccelerator-0.9.6.1/ea_store.c:600:68: error: 'znode_op' has no member named 'u'
  • error 35
  • /tmp/B.b0831137-5079-4121-aa60-900e29b62b65/BUILD/eaccelerator-0.9.6.1/ea_restore.c:67:41: error: 'zend_class_entry' has no member named 'default_properties'
  • error 36
  • /tmp/B.b0831137-5079-4121-aa60-900e29b62b65/BUILD/eaccelerator-0.9.6.1/ea_restore.c:71:41: error: 'zend_class_entry' has no member named 'default_static_members'
  • error 37
  • /tmp/B.b0831137-5079-4121-aa60-900e29b62b65/BUILD/eaccelerator-0.9.6.1/ea_restore.c:175:28: error: 'znode_op' has no member named 'op_type'
  • error 38
  • /tmp/B.b0831137-5079-4121-aa60-900e29b62b65/BUILD/eaccelerator-0.9.6.1/ea_restore.c:176:46: error: 'znode_op' has no member named 'u'
  • error 39
  • /tmp/B.b0831137-5079-4121-aa60-900e29b62b65/BUILD/eaccelerator-0.9.6.1/ea_restore.c:177:28: error: 'znode_op' has no member named 'op_type'
  • error 40
  • /tmp/B.b0831137-5079-4121-aa60-900e29b62b65/BUILD/eaccelerator-0.9.6.1/ea_restore.c:178:46: error: 'znode_op' has no member named 'u'
  • error 41
  • /tmp/B.b0831137-5079-4121-aa60-900e29b62b65/BUILD/eaccelerator-0.9.6.1/ea_restore.c:184:40: error: 'znode_op' has no member named 'u'
  • error 42
  • /tmp/B.b0831137-5079-4121-aa60-900e29b62b65/BUILD/eaccelerator-0.9.6.1/ea_restore.c:184:40: error: 'znode_op' has no member named 'u'
  • error 43
  • /tmp/B.b0831137-5079-4121-aa60-900e29b62b65/BUILD/eaccelerator-0.9.6.1/ea_restore.c:184:40: error: 'znode_op' has no member named 'u'
  • error 44
  • /tmp/B.b0831137-5079-4121-aa60-900e29b62b65/BUILD/eaccelerator-0.9.6.1/ea_restore.c:193:40: error: 'znode_op' has no member named 'u'
  • error 45
  • /tmp/B.b0831137-5079-4121-aa60-900e29b62b65/BUILD/eaccelerator-0.9.6.1/ea_restore.c:193:40: error: 'znode_op' has no member named 'u'
  • error 46
  • /tmp/B.b0831137-5079-4121-aa60-900e29b62b65/BUILD/eaccelerator-0.9.6.1/ea_restore.c:193:40: error: 'znode_op' has no member named 'u'
  • error 47
  • /tmp/B.b0831137-5079-4121-aa60-900e29b62b65/BUILD/eaccelerator-0.9.6.1/ea_restore.c:420:7: error: 'zend_op_array' has no member named 'pass_rest_by_reference'
  • error 48
  • /tmp/B.b0831137-5079-4121-aa60-900e29b62b65/BUILD/eaccelerator-0.9.6.1/ea_restore.c:521:11: error: 'zend_op_array' has no member named 'return_reference'
  • error 49
  • /tmp/B.b0831137-5079-4121-aa60-900e29b62b65/BUILD/eaccelerator-0.9.6.1/ea_restore.c:531:18: error: 'zend_op_array' has no member named 'size'
  • error 50
  • /tmp/B.b0831137-5079-4121-aa60-900e29b62b65/BUILD/eaccelerator-0.9.6.1/ea_restore.c:536:7: error: 'zend_op_array' has no member named 'current_brk_cont'
  • error 51
  • /tmp/B.b0831137-5079-4121-aa60-900e29b62b65/BUILD/eaccelerator-0.9.6.1/ea_restore.c:538:7: error: 'zend_op_array' has no member named 'backpatch_count'
  • error 52
  • /tmp/B.b0831137-5079-4121-aa60-900e29b62b65/BUILD/eaccelerator-0.9.6.1/ea_restore.c:540:7: error: 'zend_op_array' has no member named 'return_reference'
  • error 53
  • /tmp/B.b0831137-5079-4121-aa60-900e29b62b65/BUILD/eaccelerator-0.9.6.1/ea_restore.c:541:7: error: 'zend_op_array' has no member named 'done_pass_two'
  • error 54
  • /tmp/B.b0831137-5079-4121-aa60-900e29b62b65/BUILD/eaccelerator-0.9.6.1/ea_restore.c:569:7: error: 'zend_op_array' has no member named 'size_var'
  • error 55
  • /tmp/B.b0831137-5079-4121-aa60-900e29b62b65/BUILD/eaccelerator-0.9.6.1/ea_restore.c:714:7: error: 'zend_class_entry' has no member named 'line_start'
  • error 56
  • /tmp/B.b0831137-5079-4121-aa60-900e29b62b65/BUILD/eaccelerator-0.9.6.1/ea_restore.c:715:7: error: 'zend_class_entry' has no member named 'line_end'
  • error 57
  • /tmp/B.b0831137-5079-4121-aa60-900e29b62b65/BUILD/eaccelerator-0.9.6.1/ea_restore.c:729:7: error: 'zend_class_entry' has no member named 'doc_comment_len'
  • error 58
  • /tmp/B.b0831137-5079-4121-aa60-900e29b62b65/BUILD/eaccelerator-0.9.6.1/ea_restore.c:730:7: error: 'zend_class_entry' has no member named 'doc_comment'
  • error 59
  • /tmp/B.b0831137-5079-4121-aa60-900e29b62b65/BUILD/eaccelerator-0.9.6.1/ea_restore.c:733:7: error: 'zend_class_entry' has no member named 'filename'
  • error 60
  • /tmp/B.b0831137-5079-4121-aa60-900e29b62b65/BUILD/eaccelerator-0.9.6.1/ea_restore.c:744:26: error: 'zend_class_entry' has no member named 'default_properties'
  • error 61
  • /tmp/B.b0831137-5079-4121-aa60-900e29b62b65/BUILD/eaccelerator-0.9.6.1/ea_restore.c:745:7: error: 'zend_class_entry' has no member named 'default_properties'
  • error 62
  • /tmp/B.b0831137-5079-4121-aa60-900e29b62b65/BUILD/eaccelerator-0.9.6.1/ea_restore.c:748:26: error: 'zend_class_entry' has no member named 'default_static_members'
  • error 63
  • /tmp/B.b0831137-5079-4121-aa60-900e29b62b65/BUILD/eaccelerator-0.9.6.1/ea_restore.c:749:7: error: 'zend_class_entry' has no member named 'default_static_members'
  • error 64
  • /tmp/B.b0831137-5079-4121-aa60-900e29b62b65/BUILD/eaccelerator-0.9.6.1/ea_restore.c:752:27: error: 'zend_class_entry' has no member named 'static_members'
  • error 65
  • /tmp/B.b0831137-5079-4121-aa60-900e29b62b65/BUILD/eaccelerator-0.9.6.1/ea_restore.c:753:29: error: 'zend_class_entry' has no member named 'static_members'
  • error 66
  • /tmp/B.b0831137-5079-4121-aa60-900e29b62b65/BUILD/eaccelerator-0.9.6.1/ea_restore.c:754:11: error: 'zend_class_entry' has no member named 'static_members'
  • error 67
  • /tmp/B.b0831137-5079-4121-aa60-900e29b62b65/BUILD/eaccelerator-0.9.6.1/ea_restore.c:756:11: error: 'zend_class_entry' has no member named 'static_members'
  • error 68
  • /tmp/B.b0831137-5079-4121-aa60-900e29b62b65/BUILD/eaccelerator-0.9.6.1/ea_restore.c:756:34: error: 'zend_class_entry' has no member named 'default_static_members'
  • error 69
  • /tmp/B.b0831137-5079-4121-aa60-900e29b62b65/BUILD/eaccelerator-0.9.6.1/ea_restore.c:817:33: error: 'zend_class_entry' has no member named 'line_start'
  • error 70
  • /tmp/B.b0831137-5079-4121-aa60-900e29b62b65/BUILD/eaccelerator-0.9.6.1/ea_store.c:726:44: error: 'zend_class_entry' has no member named 'default_static_members'
  • error 71
  • /tmp/B.b0831137-5079-4121-aa60-900e29b62b65/BUILD/eaccelerator-0.9.6.1/ea_store.c:801:26: error: 'zend_class_entry' has no member named 'line_start'
  • error 72
  • /tmp/B.b0831137-5079-4121-aa60-900e29b62b65/BUILD/eaccelerator-0.9.6.1/ea_store.c:802:24: error: 'zend_class_entry' has no member named 'line_end'
  • error 73
  • /tmp/B.b0831137-5079-4121-aa60-900e29b62b65/BUILD/eaccelerator-0.9.6.1/ea_store.c:807:13: error: 'zend_class_entry' has no member named 'filename'
  • error 74
  • /tmp/B.b0831137-5079-4121-aa60-900e29b62b65/BUILD/eaccelerator-0.9.6.1/ea_store.c:808:45: error: 'zend_class_entry' has no member named 'filename'
  • error 75
  • /tmp/B.b0831137-5079-4121-aa60-900e29b62b65/BUILD/eaccelerator-0.9.6.1/ea_store.c:808:68: error: 'zend_class_entry' has no member named 'filename'
  • error 76
  • /tmp/B.b0831137-5079-4121-aa60-900e29b62b65/BUILD/eaccelerator-0.9.6.1/ea_store.c:815:55: error: 'zend_class_entry' has no member named 'default_properties'
  • error 77
  • /tmp/B.b0831137-5079-4121-aa60-900e29b62b65/BUILD/eaccelerator-0.9.6.1/ea_store.c:815:55: error: 'zend_class_entry' has no member named 'default_properties'
  • error 78
  • /tmp/B.b0831137-5079-4121-aa60-900e29b62b65/BUILD/eaccelerator-0.9.6.1/ea_store.c:818:14: error: 'zend_class_entry' has no member named 'static_members'
  • error 79
  • /tmp/B.b0831137-5079-4121-aa60-900e29b62b65/BUILD/eaccelerator-0.9.6.1/ea_store.c:818:48: error: 'zend_class_entry' has no member named 'static_members'
  • error 80
  • /tmp/B.b0831137-5079-4121-aa60-900e29b62b65/BUILD/eaccelerator-0.9.6.1/ea_store.c:818:73: error: 'zend_class_entry' has no member named 'default_static_members'
  • error 81
  • /tmp/B.b0831137-5079-4121-aa60-900e29b62b65/BUILD/eaccelerator-0.9.6.1/debug.c:296:59: error: 'zend_class_entry' has no member named 'default_properties'
  • error 82
  • /tmp/B.b0831137-5079-4121-aa60-900e29b62b65/BUILD/eaccelerator-0.9.6.1/debug.c:298:63: error: 'zend_class_entry' has no member named 'default_static_members'
  • error 83
  • /tmp/B.b0831137-5079-4121-aa60-900e29b62b65/BUILD/eaccelerator-0.9.6.1/debug.c:299:55: error: 'zend_class_entry' has no member named 'static_members'
  • error 84
  • /tmp/B.b0831137-5079-4121-aa60-900e29b62b65/BUILD/eaccelerator-0.9.6.1/debug.c:303:41: error: 'zend_class_entry' has no member named 'filename'
  • error 85
  • /tmp/B.b0831137-5079-4121-aa60-900e29b62b65/BUILD/eaccelerator-0.9.6.1/debug.c:304:43: error: 'zend_class_entry' has no member named 'line_start'
  • error 86
  • /tmp/B.b0831137-5079-4121-aa60-900e29b62b65/BUILD/eaccelerator-0.9.6.1/debug.c:305:41: error: 'zend_class_entry' has no member named 'line_end'
  • error 87
  • /tmp/B.b0831137-5079-4121-aa60-900e29b62b65/BUILD/eaccelerator-0.9.6.1/ea_store.c:819:63: error: 'zend_class_entry' has no member named 'default_static_members'
  • error 88
  • /tmp/B.b0831137-5079-4121-aa60-900e29b62b65/BUILD/eaccelerator-0.9.6.1/ea_store.c:819:63: error: 'zend_class_entry' has no member named 'default_static_members'
  • error 89
  • /tmp/B.b0831137-5079-4121-aa60-900e29b62b65/BUILD/eaccelerator-0.9.6.1/ea_store.c:823:48: error: 'zend_class_entry' has no member named 'static_members'
  • error 90
  • /tmp/B.b0831137-5079-4121-aa60-900e29b62b65/BUILD/eaccelerator-0.9.6.1/ea_store.c:823:48: error: 'zend_class_entry' has no member named 'static_members'
  • error 91
  • /tmp/B.b0831137-5079-4121-aa60-900e29b62b65/BUILD/eaccelerator-0.9.6.1/ea_store.c:825:58: error: 'zend_class_entry' has no member named 'default_static_members'
  • error 92
  • /tmp/B.b0831137-5079-4121-aa60-900e29b62b65/BUILD/eaccelerator-0.9.6.1/ea_store.c:825:58: error: 'zend_class_entry' has no member named 'default_static_members'
  • error 93
  • Makefile:207: recipe for target 'ea_restore.lo' failed
  • error 94
  • Makefile:205: recipe for target 'debug.lo' failed
  • error 95
  • Makefile:209: recipe for target 'ea_store.lo' failed
  • error 96
  • error: Bad exit status from /tmp/B.b0831137-5079-4121-aa60-900e29b62b65/BUILD/tmp/rpm-tmp.83047 (%build)
  • error 97
  • RPM build errors:
  • error 98
  • error: No files produced.

Content:

checking for sys/stat.h... yes
checking for stdlib.h... yes
checking for string.h... yes
checking for memory.h... yes
checking for strings.h... yes
checking for inttypes.h... yes
checking for stdint.h... yes
checking for unistd.h... yes
checking for unistd.h... (cached) yes
checking limits.h usability... yes
checking limits.h presence... yes
checking for limits.h... yes
checking sys/param.h usability... yes
checking sys/param.h presence... yes
checking for sys/param.h... yes
checking sched.h usability... yes
checking sched.h presence... yes
checking for sched.h... yes
checking mandatory system headers... yes
checking whether union semun is defined in sys/sem.h... no
checking for sysvipc shared memory support... yes
checking for mmap shared memory support... yes
checking for mmap on /dev/zero shared memory support... yes
checking for anonymous mmap shared memory support... yes
checking for posix mmap shared memory support... no
checking for best shared memory type... sysvipc
checking for spinlock semaphores support... yes
checking for pthread semaphores support... yes
checking for posix semaphores support... no
checking for sysvipc semaphores support... no
checking for fcntl semaphores support... yes
checking for flock semaphores support... yes
checking for best semaphores type... spinlock
checking for mprotect... yes
checking how to print strings... print -r
checking for a sed that does not truncate output... (cached) /bin/sed
checking for fgrep... /bin/grep -F
checking for ld used by x86_64-pld-linux-gcc... /usr/bin/ld
checking if the linker (/usr/bin/ld) is GNU ld... yes
checking for BSD- or MS-compatible name lister (nm)... /usr/bin/nm -B
checking the name lister (/usr/bin/nm -B) interface... BSD nm
checking whether ln -s works... yes
checking the maximum length of command line arguments... 1572864
checking whether the shell understands some XSI constructs... yes
checking whether the shell understands "+="... yes
checking how to convert x86_64-pld-linux-gnu file names to x86_64-pld-linux-gnu format... func_convert_file_noop
checking how to convert x86_64-pld-linux-gnu file names to toolchain format... func_convert_file_noop
checking for /usr/bin/ld option to reload object files... -r
checking for x86_64-pld-linux-objdump... no
checking for objdump... objdump
checking how to recognize dependent libraries... pass_all
checking for x86_64-pld-linux-dlltool... no
checking for dlltool... no
checking how to associate runtime and link libraries... print -r --
checking for x86_64-pld-linux-ar... no
checking for ar... ar
checking for archiver @FILE support... @
checking for x86_64-pld-linux-strip... no
checking for strip... strip
checking for x86_64-pld-linux-ranlib... no
checking for ranlib... ranlib
checking for mawk... (cached) gawk
checking command to parse /usr/bin/nm -B output from x86_64-pld-linux-gcc object... ok
checking for sysroot... no
checking for x86_64-pld-linux-mt... no
checking for mt... no
checking if : is a manifest tool... no
checking for dlfcn.h... yes
checking for objdir... .libs
checking if x86_64-pld-linux-gcc supports -fno-rtti -fno-exceptions... no
checking for x86_64-pld-linux-gcc option to produce PIC... -fPIC -DPIC
checking if x86_64-pld-linux-gcc PIC flag -fPIC -DPIC works... yes
checking if x86_64-pld-linux-gcc static flag -static works... yes
checking if x86_64-pld-linux-gcc supports -c -o file.o... yes
checking if x86_64-pld-linux-gcc supports -c -o file.o... (cached) yes
checking whether the x86_64-pld-linux-gcc linker (/usr/bin/ld -m elf_x86_64) supports shared libraries... yes
checking whether -lc should be explicitly linked in... no
checking dynamic linker characteristics... GNU/Linux ld.so
checking how to hardcode library paths into programs... immediate
checking whether stripping libraries is possible... yes
checking if libtool supports shared libraries... yes
checking whether to build shared libraries... yes
checking whether to build static libraries... no
configure: creating ./config.status
config.status: creating config.h
config.status: executing libtool commands
+ /usr/bin/make -j5
/bin/sh /tmp/B.b0831137-5079-4121-aa60-900e29b62b65/BUILD/eaccelerator-0.9.6.1/libtool --mode=compile x86_64-pld-linux-gcc  -I. -I/tmp/B.b0831137-5079-4121-aa60-900e29b62b65/BUILD/eaccelerator-0.9.6.1 -DPHP_ATOM_INC -I/tmp/B.b0831137-5079-4121-aa60-900e29b62b65/BUILD/eaccelerator-0.9.6.1/include -I/tmp/B.b0831137-5079-4121-aa60-900e29b62b65/BUILD/eaccelerator-0.9.6.1/main -I/tmp/B.b0831137-5079-4121-aa60-900e29b62b65/BUILD/eaccelerator-0.9.6.1 -I/usr/include/php -I/usr/include/php/main -I/usr/include/php/TSRM -I/usr/include/php/Zend -I/usr/include/php/ext -I/usr/include/php/ext/date/lib  -DHAVE_CONFIG_H  -O2 -fwrapv -pipe -Wformat -Werror=format-security -gdwarf-4 -fno-debug-types-section -fvar-tracking-assignments -g2 -Wp,-D_FORTIFY_SOURCE=2 -fstack-protector --param=ssp-buffer-size=4 -fPIC -march=x86-64 -gdwarf-4 -fno-debug-types-section -fvar-tracking-assignments -g2   -c /tmp/B.b0831137-5079-4121-aa60-900e29b62b65/BUILD/eaccelerator-0.9.6.1/eaccelerator.c -o eaccelerator.lo 
/bin/sh /tmp/B.b0831137-5079-4121-aa60-900e29b62b65/BUILD/eaccelerator-0.9.6.1/libtool --mode=compile x86_64-pld-linux-gcc  -I. -I/tmp/B.b0831137-5079-4121-aa60-900e29b62b65/BUILD/eaccelerator-0.9.6.1 -DPHP_ATOM_INC -I/tmp/B.b0831137-5079-4121-aa60-900e29b62b65/BUILD/eaccelerator-0.9.6.1/include -I/tmp/B.b0831137-5079-4121-aa60-900e29b62b65/BUILD/eaccelerator-0.9.6.1/main -I/tmp/B.b0831137-5079-4121-aa60-900e29b62b65/BUILD/eaccelerator-0.9.6.1 -I/usr/include/php -I/usr/include/php/main -I/usr/include/php/TSRM -I/usr/include/php/Zend -I/usr/include/php/ext -I/usr/include/php/ext/date/lib  -DHAVE_CONFIG_H  -O2 -fwrapv -pipe -Wformat -Werror=format-security -gdwarf-4 -fno-debug-types-section -fvar-tracking-assignments -g2 -Wp,-D_FORTIFY_SOURCE=2 -fstack-protector --param=ssp-buffer-size=4 -fPIC -march=x86-64 -gdwarf-4 -fno-debug-types-section -fvar-tracking-assignments -g2   -c /tmp/B.b0831137-5079-4121-aa60-900e29b62b65/BUILD/eaccelerator-0.9.6.1/opcodes.c -o opcodes.lo 
/bin/sh /tmp/B.b0831137-5079-4121-aa60-900e29b62b65/BUILD/eaccelerator-0.9.6.1/libtool --mode=compile x86_64-pld-linux-gcc  -I. -I/tmp/B.b0831137-5079-4121-aa60-900e29b62b65/BUILD/eaccelerator-0.9.6.1 -DPHP_ATOM_INC -I/tmp/B.b0831137-5079-4121-aa60-900e29b62b65/BUILD/eaccelerator-0.9.6.1/include -I/tmp/B.b0831137-5079-4121-aa60-900e29b62b65/BUILD/eaccelerator-0.9.6.1/main -I/tmp/B.b0831137-5079-4121-aa60-900e29b62b65/BUILD/eaccelerator-0.9.6.1 -I/usr/include/php -I/usr/include/php/main -I/usr/include/php/TSRM -I/usr/include/php/Zend -I/usr/include/php/ext -I/usr/include/php/ext/date/lib  -DHAVE_CONFIG_H  -O2 -fwrapv -pipe -Wformat -Werror=format-security -gdwarf-4 -fno-debug-types-section -fvar-tracking-assignments -g2 -Wp,-D_FORTIFY_SOURCE=2 -fstack-protector --param=ssp-buffer-size=4 -fPIC -march=x86-64 -gdwarf-4 -fno-debug-types-section -fvar-tracking-assignments -g2   -c /tmp/B.b0831137-5079-4121-aa60-900e29b62b65/BUILD/eaccelerator-0.9.6.1/debug.c -o debug.lo 
/bin/sh /tmp/B.b0831137-5079-4121-aa60-900e29b62b65/BUILD/eaccelerator-0.9.6.1/libtool --mode=compile x86_64-pld-linux-gcc  -I. -I/tmp/B.b0831137-5079-4121-aa60-900e29b62b65/BUILD/eaccelerator-0.9.6.1 -DPHP_ATOM_INC -I/tmp/B.b0831137-5079-4121-aa60-900e29b62b65/BUILD/eaccelerator-0.9.6.1/include -I/tmp/B.b0831137-5079-4121-aa60-900e29b62b65/BUILD/eaccelerator-0.9.6.1/main -I/tmp/B.b0831137-5079-4121-aa60-900e29b62b65/BUILD/eaccelerator-0.9.6.1 -I/usr/include/php -I/usr/include/php/main -I/usr/include/php/TSRM -I/usr/include/php/Zend -I/usr/include/php/ext -I/usr/include/php/ext/date/lib  -DHAVE_CONFIG_H  -O2 -fwrapv -pipe -Wformat -Werror=format-security -gdwarf-4 -fno-debug-types-section -fvar-tracking-assignments -g2 -Wp,-D_FORTIFY_SOURCE=2 -fstack-protector --param=ssp-buffer-size=4 -fPIC -march=x86-64 -gdwarf-4 -fno-debug-types-section -fvar-tracking-assignments -g2   -c /tmp/B.b0831137-5079-4121-aa60-900e29b62b65/BUILD/eaccelerator-0.9.6.1/ea_restore.c -o ea_restore.lo 
/bin/sh /tmp/B.b0831137-5079-4121-aa60-900e29b62b65/BUILD/eaccelerator-0.9.6.1/libtool --mode=compile x86_64-pld-linux-gcc  -I. -I/tmp/B.b0831137-5079-4121-aa60-900e29b62b65/BUILD/eaccelerator-0.9.6.1 -DPHP_ATOM_INC -I/tmp/B.b0831137-5079-4121-aa60-900e29b62b65/BUILD/eaccelerator-0.9.6.1/include -I/tmp/B.b0831137-5079-4121-aa60-900e29b62b65/BUILD/eaccelerator-0.9.6.1/main -I/tmp/B.b0831137-5079-4121-aa60-900e29b62b65/BUILD/eaccelerator-0.9.6.1 -I/usr/include/php -I/usr/include/php/main -I/usr/include/php/TSRM -I/usr/include/php/Zend -I/usr/include/php/ext -I/usr/include/php/ext/date/lib  -DHAVE_CONFIG_H  -O2 -fwrapv -pipe -Wformat -Werror=format-security -gdwarf-4 -fno-debug-types-section -fvar-tracking-assignments -g2 -Wp,-D_FORTIFY_SOURCE=2 -fstack-protector --param=ssp-buffer-size=4 -fPIC -march=x86-64 -gdwarf-4 -fno-debug-types-section -fvar-tracking-assignments -g2   -c /tmp/B.b0831137-5079-4121-aa60-900e29b62b65/BUILD/eaccelerator-0.9.6.1/ea_store.c -o ea_store.lo 
libtool: compile:  x86_64-pld-linux-gcc -I. -I/tmp/B.b0831137-5079-4121-aa60-900e29b62b65/BUILD/eaccelerator-0.9.6.1 -DPHP_ATOM_INC -I/tmp/B.b0831137-5079-4121-aa60-900e29b62b65/BUILD/eaccelerator-0.9.6.1/include -I/tmp/B.b0831137-5079-4121-aa60-900e29b62b65/BUILD/eaccelerator-0.9.6.1/main -I/tmp/B.b0831137-5079-4121-aa60-900e29b62b65/BUILD/eaccelerator-0.9.6.1 -I/usr/include/php -I/usr/include/php/main -I/usr/include/php/TSRM -I/usr/include/php/Zend -I/usr/include/php/ext -I/usr/include/php/ext/date/lib -DHAVE_CONFIG_H -O2 -fwrapv -pipe -Wformat -Werror=format-security -gdwarf-4 -fno-debug-types-section -fvar-tracking-assignments -g2 -Wp,-D_FORTIFY_SOURCE=2 -fstack-protector --param=ssp-buffer-size=4 -fPIC -march=x86-64 -gdwarf-4 -fno-debug-types-section -fvar-tracking-assignments -g2 -c /tmp/B.b0831137-5079-4121-aa60-900e29b62b65/BUILD/eaccelerator-0.9.6.1/eaccelerator.c  -fPIC -DPIC -o .libs/eaccelerator.o
libtool: compile:  x86_64-pld-linux-gcc -I. -I/tmp/B.b0831137-5079-4121-aa60-900e29b62b65/BUILD/eaccelerator-0.9.6.1 -DPHP_ATOM_INC -I/tmp/B.b0831137-5079-4121-aa60-900e29b62b65/BUILD/eaccelerator-0.9.6.1/include -I/tmp/B.b0831137-5079-4121-aa60-900e29b62b65/BUILD/eaccelerator-0.9.6.1/main -I/tmp/B.b0831137-5079-4121-aa60-900e29b62b65/BUILD/eaccelerator-0.9.6.1 -I/usr/include/php -I/usr/include/php/main -I/usr/include/php/TSRM -I/usr/include/php/Zend -I/usr/include/php/ext -I/usr/include/php/ext/date/lib -DHAVE_CONFIG_H -O2 -fwrapv -pipe -Wformat -Werror=format-security -gdwarf-4 -fno-debug-types-section -fvar-tracking-assignments -g2 -Wp,-D_FORTIFY_SOURCE=2 -fstack-protector --param=ssp-buffer-size=4 -fPIC -march=x86-64 -gdwarf-4 -fno-debug-types-section -fvar-tracking-assignments -g2 -c /tmp/B.b0831137-5079-4121-aa60-900e29b62b65/BUILD/eaccelerator-0.9.6.1/ea_store.c  -fPIC -DPIC -o .libs/ea_store.o
libtool: compile:  x86_64-pld-linux-gcc -I. -I/tmp/B.b0831137-5079-4121-aa60-900e29b62b65/BUILD/eaccelerator-0.9.6.1 -DPHP_ATOM_INC -I/tmp/B.b0831137-5079-4121-aa60-900e29b62b65/BUILD/eaccelerator-0.9.6.1/include -I/tmp/B.b0831137-5079-4121-aa60-900e29b62b65/BUILD/eaccelerator-0.9.6.1/main -I/tmp/B.b0831137-5079-4121-aa60-900e29b62b65/BUILD/eaccelerator-0.9.6.1 -I/usr/include/php -I/usr/include/php/main -I/usr/include/php/TSRM -I/usr/include/php/Zend -I/usr/include/php/ext -I/usr/include/php/ext/date/lib -DHAVE_CONFIG_H -O2 -fwrapv -pipe -Wformat -Werror=format-security -gdwarf-4 -fno-debug-types-section -fvar-tracking-assignments -g2 -Wp,-D_FORTIFY_SOURCE=2 -fstack-protector --param=ssp-buffer-size=4 -fPIC -march=x86-64 -gdwarf-4 -fno-debug-types-section -fvar-tracking-assignments -g2 -c /tmp/B.b0831137-5079-4121-aa60-900e29b62b65/BUILD/eaccelerator-0.9.6.1/debug.c  -fPIC -DPIC -o .libs/debug.o
libtool: compile:  x86_64-pld-linux-gcc -I. -I/tmp/B.b0831137-5079-4121-aa60-900e29b62b65/BUILD/eaccelerator-0.9.6.1 -DPHP_ATOM_INC -I/tmp/B.b0831137-5079-4121-aa60-900e29b62b65/BUILD/eaccelerator-0.9.6.1/include -I/tmp/B.b0831137-5079-4121-aa60-900e29b62b65/BUILD/eaccelerator-0.9.6.1/main -I/tmp/B.b0831137-5079-4121-aa60-900e29b62b65/BUILD/eaccelerator-0.9.6.1 -I/usr/include/php -I/usr/include/php/main -I/usr/include/php/TSRM -I/usr/include/php/Zend -I/usr/include/php/ext -I/usr/include/php/ext/date/lib -DHAVE_CONFIG_H -O2 -fwrapv -pipe -Wformat -Werror=format-security -gdwarf-4 -fno-debug-types-section -fvar-tracking-assignments -g2 -Wp,-D_FORTIFY_SOURCE=2 -fstack-protector --param=ssp-buffer-size=4 -fPIC -march=x86-64 -gdwarf-4 -fno-debug-types-section -fvar-tracking-assignments -g2 -c /tmp/B.b0831137-5079-4121-aa60-900e29b62b65/BUILD/eaccelerator-0.9.6.1/ea_restore.c  -fPIC -DPIC -o .libs/ea_restore.o
libtool: compile:  x86_64-pld-linux-gcc -I. -I/tmp/B.b0831137-5079-4121-aa60-900e29b62b65/BUILD/eaccelerator-0.9.6.1 -DPHP_ATOM_INC -I/tmp/B.b0831137-5079-4121-aa60-900e29b62b65/BUILD/eaccelerator-0.9.6.1/include -I/tmp/B.b0831137-5079-4121-aa60-900e29b62b65/BUILD/eaccelerator-0.9.6.1/main -I/tmp/B.b0831137-5079-4121-aa60-900e29b62b65/BUILD/eaccelerator-0.9.6.1 -I/usr/include/php -I/usr/include/php/main -I/usr/include/php/TSRM -I/usr/include/php/Zend -I/usr/include/php/ext -I/usr/include/php/ext/date/lib -DHAVE_CONFIG_H -O2 -fwrapv -pipe -Wformat -Werror=format-security -gdwarf-4 -fno-debug-types-section -fvar-tracking-assignments -g2 -Wp,-D_FORTIFY_SOURCE=2 -fstack-protector --param=ssp-buffer-size=4 -fPIC -march=x86-64 -gdwarf-4 -fno-debug-types-section -fvar-tracking-assignments -g2 -c /tmp/B.b0831137-5079-4121-aa60-900e29b62b65/BUILD/eaccelerator-0.9.6.1/opcodes.c  -fPIC -DPIC -o .libs/opcodes.o
/bin/sh /tmp/B.b0831137-5079-4121-aa60-900e29b62b65/BUILD/eaccelerator-0.9.6.1/libtool --mode=compile x86_64-pld-linux-gcc  -I. -I/tmp/B.b0831137-5079-4121-aa60-900e29b62b65/BUILD/eaccelerator-0.9.6.1 -DPHP_ATOM_INC -I/tmp/B.b0831137-5079-4121-aa60-900e29b62b65/BUILD/eaccelerator-0.9.6.1/include -I/tmp/B.b0831137-5079-4121-aa60-900e29b62b65/BUILD/eaccelerator-0.9.6.1/main -I/tmp/B.b0831137-5079-4121-aa60-900e29b62b65/BUILD/eaccelerator-0.9.6.1 -I/usr/include/php -I/usr/include/php/main -I/usr/include/php/TSRM -I/usr/include/php/Zend -I/usr/include/php/ext -I/usr/include/php/ext/date/lib  -DHAVE_CONFIG_H  -O2 -fwrapv -pipe -Wformat -Werror=format-security -gdwarf-4 -fno-debug-types-section -fvar-tracking-assignments -g2 -Wp,-D_FORTIFY_SOURCE=2 -fstack-protector --param=ssp-buffer-size=4 -fPIC -march=x86-64 -gdwarf-4 -fno-debug-types-section -fvar-tracking-assignments -g2   -c /tmp/B.b0831137-5079-4121-aa60-900e29b62b65/BUILD/eaccelerator-0.9.6.1/ea_info.c -o ea_info.lo 
libtool: compile:  x86_64-pld-linux-gcc -I. -I/tmp/B.b0831137-5079-4121-aa60-900e29b62b65/BUILD/eaccelerator-0.9.6.1 -DPHP_ATOM_INC -I/tmp/B.b0831137-5079-4121-aa60-900e29b62b65/BUILD/eaccelerator-0.9.6.1/include -I/tmp/B.b0831137-5079-4121-aa60-900e29b62b65/BUILD/eaccelerator-0.9.6.1/main -I/tmp/B.b0831137-5079-4121-aa60-900e29b62b65/BUILD/eaccelerator-0.9.6.1 -I/usr/include/php -I/usr/include/php/main -I/usr/include/php/TSRM -I/usr/include/php/Zend -I/usr/include/php/ext -I/usr/include/php/ext/date/lib -DHAVE_CONFIG_H -O2 -fwrapv -pipe -Wformat -Werror=format-security -gdwarf-4 -fno-debug-types-section -fvar-tracking-assignments -g2 -Wp,-D_FORTIFY_SOURCE=2 -fstack-protector --param=ssp-buffer-size=4 -fPIC -march=x86-64 -gdwarf-4 -fno-debug-types-section -fvar-tracking-assignments -g2 -c /tmp/B.b0831137-5079-4121-aa60-900e29b62b65/BUILD/eaccelerator-0.9.6.1/ea_info.c  -fPIC -DPIC -o .libs/ea_info.o
/tmp/B.b0831137-5079-4121-aa60-900e29b62b65/BUILD/eaccelerator-0.9.6.1/eaccelerator.c:66:23: fatal error: php_logos.h: No such file or directory
 #include "php_logos.h"
                       ^
compilation terminated.
Makefile:201: recipe for target 'eaccelerator.lo' failed
make: *** [eaccelerator.lo] Error 1
make: *** Waiting for unfinished jobs....
/tmp/B.b0831137-5079-4121-aa60-900e29b62b65/BUILD/eaccelerator-0.9.6.1/ea_store.c: In function 'calc_op_array':
/tmp/B.b0831137-5079-4121-aa60-900e29b62b65/BUILD/eaccelerator-0.9.6.1/ea_store.c:201:28: error: 'znode_op' has no member named 'op_type'
             if (opline->op1.op_type == IS_CONST) {
                            ^
/tmp/B.b0831137-5079-4121-aa60-900e29b62b65/BUILD/eaccelerator-0.9.6.1/ea_store.c:202:47: error: 'znode_op' has no member named 'u'
                 size += calc_zval(&opline->op1.u.constant TSRMLS_CC);
                                               ^
/tmp/B.b0831137-5079-4121-aa60-900e29b62b65/BUILD/eaccelerator-0.9.6.1/ea_store.c:204:28: error: 'znode_op' has no member named 'op_type'
             if (opline->op2.op_type == IS_CONST) {
                            ^
/tmp/B.b0831137-5079-4121-aa60-900e29b62b65/BUILD/eaccelerator-0.9.6.1/ea_store.c:205:47: error: 'znode_op' has no member named 'u'
                 size += calc_zval(&opline->op2.u.constant TSRMLS_CC);
                                               ^
/tmp/B.b0831137-5079-4121-aa60-900e29b62b65/BUILD/eaccelerator-0.9.6.1/ea_store.c: In function 'calc_class_entry':
/tmp/B.b0831137-5079-4121-aa60-900e29b62b65/BUILD/eaccelerator-0.9.6.1/ea_store.c:254:13: error: 'zend_class_entry' has no member named 'filename'
     if (from->filename != NULL) {
             ^
/tmp/B.b0831137-5079-4121-aa60-900e29b62b65/BUILD/eaccelerator-0.9.6.1/ea_store.c:255:33: error: 'zend_class_entry' has no member named 'filename'
         size += calc_string(from->filename, strlen(from->filename) + 1 TSRMLS_CC);
                                 ^
/tmp/B.b0831137-5079-4121-aa60-900e29b62b65/BUILD/eaccelerator-0.9.6.1/ea_store.c:255:56: error: 'zend_class_entry' has no member named 'filename'
         size += calc_string(from->filename, strlen(from->filename) + 1 TSRMLS_CC);
                                                        ^
/tmp/B.b0831137-5079-4121-aa60-900e29b62b65/BUILD/eaccelerator-0.9.6.1/ea_store.c:264:33: error: 'zend_class_entry' has no member named 'default_properties'
     size += calc_zval_hash(&from->default_properties);
                                 ^
/tmp/B.b0831137-5079-4121-aa60-900e29b62b65/BUILD/eaccelerator-0.9.6.1/ea_store.c:66:17: note: in definition of macro 'calc_hash_ex'
   calc_hash_int(from, start, calc_bucket TSRMLS_CC)
                 ^
/tmp/B.b0831137-5079-4121-aa60-900e29b62b65/BUILD/eaccelerator-0.9.6.1/ea_store.c:72:3: note: in expansion of macro 'calc_hash'
   calc_hash(from, (calc_bucket_t)calc_zval_ptr)
   ^
/tmp/B.b0831137-5079-4121-aa60-900e29b62b65/BUILD/eaccelerator-0.9.6.1/ea_store.c:264:13: note: in expansion of macro 'calc_zval_hash'
     size += calc_zval_hash(&from->default_properties);
             ^
/tmp/B.b0831137-5079-4121-aa60-900e29b62b65/BUILD/eaccelerator-0.9.6.1/ea_store.c:264:33: error: 'zend_class_entry' has no member named 'default_properties'
     size += calc_zval_hash(&from->default_properties);
                                 ^
/tmp/B.b0831137-5079-4121-aa60-900e29b62b65/BUILD/eaccelerator-0.9.6.1/ea_store.c:66:23: note: in definition of macro 'calc_hash_ex'
   calc_hash_int(from, start, calc_bucket TSRMLS_CC)
                       ^
/tmp/B.b0831137-5079-4121-aa60-900e29b62b65/BUILD/eaccelerator-0.9.6.1/ea_store.c:72:3: note: in expansion of macro 'calc_hash'
   calc_hash(from, (calc_bucket_t)calc_zval_ptr)
   ^
/tmp/B.b0831137-5079-4121-aa60-900e29b62b65/BUILD/eaccelerator-0.9.6.1/ea_store.c:264:13: note: in expansion of macro 'calc_zval_hash'
     size += calc_zval_hash(&from->default_properties);
             ^
/tmp/B.b0831137-5079-4121-aa60-900e29b62b65/BUILD/eaccelerator-0.9.6.1/ea_store.c:267:33: error: 'zend_class_entry' has no member named 'default_static_members'
     size += calc_zval_hash(&from->default_static_members);
                                 ^
/tmp/B.b0831137-5079-4121-aa60-900e29b62b65/BUILD/eaccelerator-0.9.6.1/ea_store.c:66:17: note: in definition of macro 'calc_hash_ex'
   calc_hash_int(from, start, calc_bucket TSRMLS_CC)
                 ^
/tmp/B.b0831137-5079-4121-aa60-900e29b62b65/BUILD/eaccelerator-0.9.6.1/ea_store.c:72:3: note: in expansion of macro 'calc_hash'
   calc_hash(from, (calc_bucket_t)calc_zval_ptr)
   ^
/tmp/B.b0831137-5079-4121-aa60-900e29b62b65/BUILD/eaccelerator-0.9.6.1/ea_store.c:267:13: note: in expansion of macro 'calc_zval_hash'
     size += calc_zval_hash(&from->default_static_members);
             ^
/tmp/B.b0831137-5079-4121-aa60-900e29b62b65/BUILD/eaccelerator-0.9.6.1/ea_store.c:267:33: error: 'zend_class_entry' has no member named 'default_static_members'
     size += calc_zval_hash(&from->default_static_members);
                                 ^
/tmp/B.b0831137-5079-4121-aa60-900e29b62b65/BUILD/eaccelerator-0.9.6.1/ea_store.c:66:23: note: in definition of macro 'calc_hash_ex'
   calc_hash_int(from, start, calc_bucket TSRMLS_CC)
                       ^
/tmp/B.b0831137-5079-4121-aa60-900e29b62b65/BUILD/eaccelerator-0.9.6.1/ea_store.c:72:3: note: in expansion of macro 'calc_hash'
   calc_hash(from, (calc_bucket_t)calc_zval_ptr)
   ^
/tmp/B.b0831137-5079-4121-aa60-900e29b62b65/BUILD/eaccelerator-0.9.6.1/ea_store.c:267:13: note: in expansion of macro 'calc_zval_hash'
     size += calc_zval_hash(&from->default_static_members);
             ^
/tmp/B.b0831137-5079-4121-aa60-900e29b62b65/BUILD/eaccelerator-0.9.6.1/ea_store.c:268:14: error: 'zend_class_entry' has no member named 'static_members'
     if ((from->static_members != NULL) && (from->static_members != &from->default_static_members)) {
              ^
/tmp/B.b0831137-5079-4121-aa60-900e29b62b65/BUILD/eaccelerator-0.9.6.1/ea_store.c:268:48: error: 'zend_class_entry' has no member named 'static_members'
     if ((from->static_members != NULL) && (from->static_members != &from->default_static_members)) {
                                                ^
/tmp/B.b0831137-5079-4121-aa60-900e29b62b65/BUILD/eaccelerator-0.9.6.1/ea_store.c:268:73: error: 'zend_class_entry' has no member named 'default_static_members'
     if ((from->static_members != NULL) && (from->static_members != &from->default_static_members)) {
                                                                         ^
/tmp/B.b0831137-5079-4121-aa60-900e29b62b65/BUILD/eaccelerator-0.9.6.1/ea_store.c:270:36: error: 'zend_class_entry' has no member named 'static_members'
         size += calc_zval_hash(from->static_members);
                                    ^
/tmp/B.b0831137-5079-4121-aa60-900e29b62b65/BUILD/eaccelerator-0.9.6.1/ea_store.c:66:17: note: in definition of macro 'calc_hash_ex'
   calc_hash_int(from, start, calc_bucket TSRMLS_CC)
                 ^
/tmp/B.b0831137-5079-4121-aa60-900e29b62b65/BUILD/eaccelerator-0.9.6.1/ea_store.c:72:3: note: in expansion of macro 'calc_hash'
   calc_hash(from, (calc_bucket_t)calc_zval_ptr)
   ^
/tmp/B.b0831137-5079-4121-aa60-900e29b62b65/BUILD/eaccelerator-0.9.6.1/ea_store.c:270:17: note: in expansion of macro 'calc_zval_hash'
         size += calc_zval_hash(from->static_members);
                 ^
/tmp/B.b0831137-5079-4121-aa60-900e29b62b65/BUILD/eaccelerator-0.9.6.1/ea_store.c:270:36: error: 'zend_class_entry' has no member named 'static_members'
         size += calc_zval_hash(from->static_members);
                                    ^
/tmp/B.b0831137-5079-4121-aa60-900e29b62b65/BUILD/eaccelerator-0.9.6.1/ea_store.c:66:23: note: in definition of macro 'calc_hash_ex'
   calc_hash_int(from, start, calc_bucket TSRMLS_CC)
                       ^
/tmp/B.b0831137-5079-4121-aa60-900e29b62b65/BUILD/eaccelerator-0.9.6.1/ea_store.c:72:3: note: in expansion of macro 'calc_hash'
   calc_hash(from, (calc_bucket_t)calc_zval_ptr)
   ^
/tmp/B.b0831137-5079-4121-aa60-900e29b62b65/BUILD/eaccelerator-0.9.6.1/ea_store.c:270:17: note: in expansion of macro 'calc_zval_hash'
         size += calc_zval_hash(from->static_members);
                 ^
/tmp/B.b0831137-5079-4121-aa60-900e29b62b65/BUILD/eaccelerator-0.9.6.1/ea_store.c: In function 'calc_size':
/tmp/B.b0831137-5079-4121-aa60-900e29b62b65/BUILD/eaccelerator-0.9.6.1/ea_store.c:293:11: warning: assignment discards 'const' qualifier from pointer target type [enabled by default]
         x = b->arKey;
           ^
/tmp/B.b0831137-5079-4121-aa60-900e29b62b65/BUILD/eaccelerator-0.9.6.1/ea_store.c:301:11: warning: assignment discards 'const' qualifier from pointer target type [enabled by default]
         x = b->arKey;
           ^
/tmp/B.b0831137-5079-4121-aa60-900e29b62b65/BUILD/eaccelerator-0.9.6.1/ea_store.c: In function 'store_hash_int':
/tmp/B.b0831137-5079-4121-aa60-900e29b62b65/BUILD/eaccelerator-0.9.6.1/ea_store.c:431:13: warning: passing argument 1 of 'memcpy' discards 'const' qualifier from pointer target type [enabled by default]
             memcpy(np->arKey, p->arKey, p->nKeyLength);
             ^
In file included from /usr/include/features.h:378:0,
                 from /usr/include/stdlib.h:24,
                 from /usr/include/php/main/../main/php_config.h:2400,
                 from /usr/include/php/Zend/zend_config.h:1,
                 from /usr/include/php/Zend/zend.h:51,
                 from /usr/include/php/main/php.h:34,
                 from /tmp/B.b0831137-5079-4121-aa60-900e29b62b65/BUILD/eaccelerator-0.9.6.1/eaccelerator.h:31,
                 from /tmp/B.b0831137-5079-4121-aa60-900e29b62b65/BUILD/eaccelerator-0.9.6.1/ea_store.c:28:
/usr/include/bits/string3.h:48:1: note: expected 'void * __restrict__' but argument is of type 'const char *'
 __NTH (memcpy (void *__restrict __dest, const void *__restrict __src,
 ^
/tmp/B.b0831137-5079-4121-aa60-900e29b62b65/BUILD/eaccelerator-0.9.6.1/ea_store.c: In function 'store_op_array':
/tmp/B.b0831137-5079-4121-aa60-900e29b62b65/BUILD/eaccelerator-0.9.6.1/ea_store.c:508:28: error: 'zend_arg_info' has no member named 'array_type_hint'
             to->arg_info[i].array_type_hint = from->arg_info[i].array_type_hint;
                            ^
/tmp/B.b0831137-5079-4121-aa60-900e29b62b65/BUILD/eaccelerator-0.9.6.1/ea_store.c:508:64: error: 'zend_arg_info' has no member named 'array_type_hint'
             to->arg_info[i].array_type_hint = from->arg_info[i].array_type_hint;
                                                                ^
/tmp/B.b0831137-5079-4121-aa60-900e29b62b65/BUILD/eaccelerator-0.9.6.1/ea_store.c:511:28: error: 'zend_arg_info' has no member named 'return_reference'
             to->arg_info[i].return_reference = from->arg_info[i].return_reference;
                            ^
/tmp/B.b0831137-5079-4121-aa60-900e29b62b65/BUILD/eaccelerator-0.9.6.1/ea_store.c:511:65: error: 'zend_arg_info' has no member named 'return_reference'
             to->arg_info[i].return_reference = from->arg_info[i].return_reference;
                                                                 ^
/tmp/B.b0831137-5079-4121-aa60-900e29b62b65/BUILD/eaccelerator-0.9.6.1/ea_store.c:514:38: error: 'zend_op_array' has no member named 'pass_rest_by_reference'
     to->pass_rest_by_reference = from->pass_rest_by_reference;
                                      ^
/tmp/B.b0831137-5079-4121-aa60-900e29b62b65/BUILD/eaccelerator-0.9.6.1/ea_store.c:545:36: error: 'zend_op_array' has no member named 'return_reference'
         to->return_reference = from->return_reference;
                                    ^
/tmp/B.b0831137-5079-4121-aa60-900e29b62b65/BUILD/eaccelerator-0.9.6.1/ea_store.c:570:32: error: 'zend_op_array' has no member named 'return_reference'
     to->return_reference = from->return_reference;
                                ^
/tmp/B.b0831137-5079-4121-aa60-900e29b62b65/BUILD/eaccelerator-0.9.6.1/ea_store.c:571:18: warning: assignment discards 'const' qualifier from pointer target type [enabled by default]
     to->filename = from->filename;
                  ^
/tmp/B.b0831137-5079-4121-aa60-900e29b62b65/BUILD/eaccelerator-0.9.6.1/ea_store.c:580:28: error: 'znode_op' has no member named 'op_type'
             if (opline->op1.op_type == IS_CONST) {
                            ^
/tmp/B.b0831137-5079-4121-aa60-900e29b62b65/BUILD/eaccelerator-0.9.6.1/ea_store.c:581:44: error: 'znode_op' has no member named 'u'
                 store_zval(at, &opline->op1.u.constant TSRMLS_CC);
                                            ^
/tmp/B.b0831137-5079-4121-aa60-900e29b62b65/BUILD/eaccelerator-0.9.6.1/ea_store.c:583:28: error: 'znode_op' has no member named 'op_type'
             if (opline->op2.op_type == IS_CONST) {
                            ^
/tmp/B.b0831137-5079-4121-aa60-900e29b62b65/BUILD/eaccelerator-0.9.6.1/ea_store.c:584:44: error: 'znode_op' has no member named 'u'
                 store_zval(at, &opline->op2.u.constant TSRMLS_CC);
                                            ^
/tmp/B.b0831137-5079-4121-aa60-900e29b62b65/BUILD/eaccelerator-0.9.6.1/ea_store.c:591:28: error: 'znode_op' has no member named 'u'
                 opline->op1.u.jmp_addr = to->opcodes + (opline->op1.u.jmp_addr - from->opcodes);
                            ^
/tmp/B.b0831137-5079-4121-aa60-900e29b62b65/BUILD/eaccelerator-0.9.6.1/ea_store.c:591:68: error: 'znode_op' has no member named 'u'
                 opline->op1.u.jmp_addr = to->opcodes + (opline->op1.u.jmp_addr - from->opcodes);
                                                                    ^
/tmp/B.b0831137-5079-4121-aa60-900e29b62b65/BUILD/eaccelerator-0.9.6.1/ea_store.c:600:28: error: 'znode_op' has no member named 'u'
                 opline->op2.u.jmp_addr = to->opcodes + (opline->op2.u.jmp_addr - from->opcodes);
                            ^
/tmp/B.b0831137-5079-4121-aa60-900e29b62b65/BUILD/eaccelerator-0.9.6.1/ea_store.c:600:68: error: 'znode_op' has no member named 'u'
                 opline->op2.u.jmp_addr = to->opcodes + (opline->op2.u.jmp_addr - from->opcodes);
                                                                    ^
/tmp/B.b0831137-5079-4121-aa60-900e29b62b65/BUILD/eaccelerator-0.9.6.1/ea_restore.c: In function 'get_zend_destroy_property_info':
/tmp/B.b0831137-5079-4121-aa60-900e29b62b65/BUILD/eaccelerator-0.9.6.1/ea_restore.c:67:41: error: 'zend_class_entry' has no member named 'default_properties'
     zend_hash_destroy(&dummy_class_entry.default_properties);
                                         ^
/tmp/B.b0831137-5079-4121-aa60-900e29b62b65/BUILD/eaccelerator-0.9.6.1/ea_restore.c:71:41: error: 'zend_class_entry' has no member named 'default_static_members'
     zend_hash_destroy(&dummy_class_entry.default_static_members);
                                         ^
/tmp/B.b0831137-5079-4121-aa60-900e29b62b65/BUILD/eaccelerator-0.9.6.1/ea_restore.c: In function 'fixup_op_array':
/tmp/B.b0831137-5079-4121-aa60-900e29b62b65/BUILD/eaccelerator-0.9.6.1/ea_restore.c:175:28: error: 'znode_op' has no member named 'op_type'
             if (opline->op1.op_type == IS_CONST)
                            ^
/tmp/B.b0831137-5079-4121-aa60-900e29b62b65/BUILD/eaccelerator-0.9.6.1/ea_restore.c:176:46: error: 'znode_op' has no member named 'u'
                 fixup_zval(base, &opline->op1.u.constant TSRMLS_CC);
                                              ^
/tmp/B.b0831137-5079-4121-aa60-900e29b62b65/BUILD/eaccelerator-0.9.6.1/ea_restore.c:177:28: error: 'znode_op' has no member named 'op_type'
             if (opline->op2.op_type == IS_CONST)
                            ^
/tmp/B.b0831137-5079-4121-aa60-900e29b62b65/BUILD/eaccelerator-0.9.6.1/ea_restore.c:178:46: error: 'znode_op' has no member named 'u'
                 fixup_zval(base, &opline->op2.u.constant TSRMLS_CC);
                                              ^
In file included from /tmp/B.b0831137-5079-4121-aa60-900e29b62b65/BUILD/eaccelerator-0.9.6.1/ea_restore.c:33:0:
/tmp/B.b0831137-5079-4121-aa60-900e29b62b65/BUILD/eaccelerator-0.9.6.1/ea_restore.c:184:40: error: 'znode_op' has no member named 'u'
                 FIXUP(base, opline->op1.u.jmp_addr);
                                        ^
/tmp/B.b0831137-5079-4121-aa60-900e29b62b65/BUILD/eaccelerator-0.9.6.1/ea_restore.h:31:25: note: in definition of macro 'FIXUP'
 #define FIXUP(b, x) if((x)!=NULL) {(x) = (void*)(((char*)(x)) + ((long)(b)));}
                         ^
/tmp/B.b0831137-5079-4121-aa60-900e29b62b65/BUILD/eaccelerator-0.9.6.1/ea_restore.c:184:40: error: 'znode_op' has no member named 'u'
                 FIXUP(base, opline->op1.u.jmp_addr);
                                        ^
/tmp/B.b0831137-5079-4121-aa60-900e29b62b65/BUILD/eaccelerator-0.9.6.1/ea_restore.h:31:37: note: in definition of macro 'FIXUP'
 #define FIXUP(b, x) if((x)!=NULL) {(x) = (void*)(((char*)(x)) + ((long)(b)));}
                                     ^
/tmp/B.b0831137-5079-4121-aa60-900e29b62b65/BUILD/eaccelerator-0.9.6.1/ea_restore.c:184:40: error: 'znode_op' has no member named 'u'
                 FIXUP(base, opline->op1.u.jmp_addr);
                                        ^
/tmp/B.b0831137-5079-4121-aa60-900e29b62b65/BUILD/eaccelerator-0.9.6.1/ea_restore.h:31:59: note: in definition of macro 'FIXUP'
 #define FIXUP(b, x) if((x)!=NULL) {(x) = (void*)(((char*)(x)) + ((long)(b)));}
                                                           ^
/tmp/B.b0831137-5079-4121-aa60-900e29b62b65/BUILD/eaccelerator-0.9.6.1/ea_restore.c:193:40: error: 'znode_op' has no member named 'u'
                 FIXUP(base, opline->op2.u.jmp_addr);
                                        ^
/tmp/B.b0831137-5079-4121-aa60-900e29b62b65/BUILD/eaccelerator-0.9.6.1/ea_restore.h:31:25: note: in definition of macro 'FIXUP'
 #define FIXUP(b, x) if((x)!=NULL) {(x) = (void*)(((char*)(x)) + ((long)(b)));}
                         ^
/tmp/B.b0831137-5079-4121-aa60-900e29b62b65/BUILD/eaccelerator-0.9.6.1/ea_restore.c:193:40: error: 'znode_op' has no member named 'u'
                 FIXUP(base, opline->op2.u.jmp_addr);
                                        ^
/tmp/B.b0831137-5079-4121-aa60-900e29b62b65/BUILD/eaccelerator-0.9.6.1/ea_restore.h:31:37: note: in definition of macro 'FIXUP'
 #define FIXUP(b, x) if((x)!=NULL) {(x) = (void*)(((char*)(x)) + ((long)(b)));}
                                     ^
/tmp/B.b0831137-5079-4121-aa60-900e29b62b65/BUILD/eaccelerator-0.9.6.1/ea_restore.c:193:40: error: 'znode_op' has no member named 'u'
                 FIXUP(base, opline->op2.u.jmp_addr);
                                        ^
/tmp/B.b0831137-5079-4121-aa60-900e29b62b65/BUILD/eaccelerator-0.9.6.1/ea_restore.h:31:59: note: in definition of macro 'FIXUP'
 #define FIXUP(b, x) if((x)!=NULL) {(x) = (void*)(((char*)(x)) + ((long)(b)));}
                                                           ^
/tmp/B.b0831137-5079-4121-aa60-900e29b62b65/BUILD/eaccelerator-0.9.6.1/ea_restore.c: In function 'restore_hash':
/tmp/B.b0831137-5079-4121-aa60-900e29b62b65/BUILD/eaccelerator-0.9.6.1/ea_restore.c:338:9: warning: passing argument 1 of 'memcpy' discards 'const' qualifier from pointer target type [enabled by default]
         memcpy(np->arKey, p->arKey, p->nKeyLength);
         ^
In file included from /usr/include/features.h:378:0,
                 from /usr/include/stdlib.h:24,
                 from /usr/include/php/main/../main/php_config.h:2400,
                 from /usr/include/php/Zend/zend_config.h:1,
                 from /usr/include/php/Zend/zend.h:51,
                 from /usr/include/php/main/php.h:34,
                 from /tmp/B.b0831137-5079-4121-aa60-900e29b62b65/BUILD/eaccelerator-0.9.6.1/eaccelerator.h:31,
                 from /tmp/B.b0831137-5079-4121-aa60-900e29b62b65/BUILD/eaccelerator-0.9.6.1/ea_restore.c:28:
/usr/include/bits/string3.h:48:1: note: expected 'void * __restrict__' but argument is of type 'const char *'
 __NTH (memcpy (void *__restrict __dest, const void *__restrict __src,
 ^
/tmp/B.b0831137-5079-4121-aa60-900e29b62b65/BUILD/eaccelerator-0.9.6.1/ea_restore.c: In function 'restore_op_array':
/tmp/B.b0831137-5079-4121-aa60-900e29b62b65/BUILD/eaccelerator-0.9.6.1/ea_restore.c:420:7: error: 'zend_op_array' has no member named 'pass_rest_by_reference'
     to->pass_rest_by_reference = from->pass_rest_by_reference;
       ^
/tmp/B.b0831137-5079-4121-aa60-900e29b62b65/BUILD/eaccelerator-0.9.6.1/ea_restore.c:521:11: error: 'zend_op_array' has no member named 'return_reference'
         to->return_reference = from->return_reference;
           ^
/tmp/B.b0831137-5079-4121-aa60-900e29b62b65/BUILD/eaccelerator-0.9.6.1/ea_restore.c:531:18: error: 'zend_op_array' has no member named 'size'
     to->last = to->size = from->last;
                  ^
/tmp/B.b0831137-5079-4121-aa60-900e29b62b65/BUILD/eaccelerator-0.9.6.1/ea_restore.c:536:7: error: 'zend_op_array' has no member named 'current_brk_cont'
     to->current_brk_cont = -1;
       ^
/tmp/B.b0831137-5079-4121-aa60-900e29b62b65/BUILD/eaccelerator-0.9.6.1/ea_restore.c:538:7: error: 'zend_op_array' has no member named 'backpatch_count'
     to->backpatch_count  = 0;
       ^
/tmp/B.b0831137-5079-4121-aa60-900e29b62b65/BUILD/eaccelerator-0.9.6.1/ea_restore.c:540:7: error: 'zend_op_array' has no member named 'return_reference'
     to->return_reference = from->return_reference;
       ^
/tmp/B.b0831137-5079-4121-aa60-900e29b62b65/BUILD/eaccelerator-0.9.6.1/ea_restore.c:541:7: error: 'zend_op_array' has no member named 'done_pass_two'
     to->done_pass_two = 1;
       ^
/tmp/B.b0831137-5079-4121-aa60-900e29b62b65/BUILD/eaccelerator-0.9.6.1/ea_restore.c:569:7: error: 'zend_op_array' has no member named 'size_var'
     to->size_var         = 0;
       ^
/tmp/B.b0831137-5079-4121-aa60-900e29b62b65/BUILD/eaccelerator-0.9.6.1/ea_restore.c: In function 'restore_property_info':
/tmp/B.b0831137-5079-4121-aa60-900e29b62b65/BUILD/eaccelerator-0.9.6.1/ea_restore.c:589:5: warning: passing argument 1 of 'memcpy' discards 'const' qualifier from pointer target type [enabled by default]
     memcpy(to->name, from->name, from->name_length + 1);
     ^
In file included from /usr/include/features.h:378:0,
                 from /usr/include/stdlib.h:24,
                 from /usr/include/php/main/../main/php_config.h:2400,
                 from /usr/include/php/Zend/zend_config.h:1,
                 from /usr/include/php/Zend/zend.h:51,
                 from /usr/include/php/main/php.h:34,
                 from /tmp/B.b0831137-5079-4121-aa60-900e29b62b65/BUILD/eaccelerator-0.9.6.1/eaccelerator.h:31,
                 from /tmp/B.b0831137-5079-4121-aa60-900e29b62b65/BUILD/eaccelerator-0.9.6.1/ea_restore.c:28:
/usr/include/bits/string3.h:48:1: note: expected 'void * __restrict__' but argument is of type 'const char *'
 __NTH (memcpy (void *__restrict __dest, const void *__restrict __src,
 ^
/tmp/B.b0831137-5079-4121-aa60-900e29b62b65/BUILD/eaccelerator-0.9.6.1/ea_restore.c: In function 'restore_class_entry':
/tmp/B.b0831137-5079-4121-aa60-900e29b62b65/BUILD/eaccelerator-0.9.6.1/ea_restore.c:704:9: warning: passing argument 1 of 'memcpy' discards 'const' qualifier from pointer target type [enabled by default]
         memcpy(to->name, from->name, from->name_length + 1);
         ^
In file included from /usr/include/features.h:378:0,
                 from /usr/include/stdlib.h:24,
                 from /usr/include/php/main/../main/php_config.h:2400,
                 from /usr/include/php/Zend/zend_config.h:1,
                 from /usr/include/php/Zend/zend.h:51,
                 from /usr/include/php/main/php.h:34,
                 from /tmp/B.b0831137-5079-4121-aa60-900e29b62b65/BUILD/eaccelerator-0.9.6.1/eaccelerator.h:31,
                 from /tmp/B.b0831137-5079-4121-aa60-900e29b62b65/BUILD/eaccelerator-0.9.6.1/ea_restore.c:28:
/usr/include/bits/string3.h:48:1: note: expected 'void * __restrict__' but argument is of type 'const char *'
 __NTH (memcpy (void *__restrict __dest, const void *__restrict __src,
 ^
/tmp/B.b0831137-5079-4121-aa60-900e29b62b65/BUILD/eaccelerator-0.9.6.1/ea_restore.c:714:7: error: 'zend_class_entry' has no member named 'line_start'
     to->line_start = from->line_start;
       ^
/tmp/B.b0831137-5079-4121-aa60-900e29b62b65/BUILD/eaccelerator-0.9.6.1/ea_restore.c:715:7: error: 'zend_class_entry' has no member named 'line_end'
     to->line_end = from->line_end;
       ^
/tmp/B.b0831137-5079-4121-aa60-900e29b62b65/BUILD/eaccelerator-0.9.6.1/ea_restore.c:729:7: error: 'zend_class_entry' has no member named 'doc_comment_len'
     to->doc_comment_len = 0;
       ^
/tmp/B.b0831137-5079-4121-aa60-900e29b62b65/BUILD/eaccelerator-0.9.6.1/ea_restore.c:730:7: error: 'zend_class_entry' has no member named 'doc_comment'
     to->doc_comment = NULL;
       ^
/tmp/B.b0831137-5079-4121-aa60-900e29b62b65/BUILD/eaccelerator-0.9.6.1/ea_restore.c:733:7: error: 'zend_class_entry' has no member named 'filename'
     to->filename = from->filename;
       ^
/tmp/B.b0831137-5079-4121-aa60-900e29b62b65/BUILD/eaccelerator-0.9.6.1/ea_restore.c:744:26: error: 'zend_class_entry' has no member named 'default_properties'
     restore_zval_hash(&to->default_properties, &from->default_properties);
                          ^
/tmp/B.b0831137-5079-4121-aa60-900e29b62b65/BUILD/eaccelerator-0.9.6.1/ea_restore.c:271:18: note: in definition of macro 'restore_zval_hash'
     restore_hash(target, source, (restore_bucket_t)restore_zval_ptr TSRMLS_CC)
                  ^
/tmp/B.b0831137-5079-4121-aa60-900e29b62b65/BUILD/eaccelerator-0.9.6.1/ea_restore.c:745:7: error: 'zend_class_entry' has no member named 'default_properties'
     to->default_properties.pDestructor = ZVAL_PTR_DTOR;
       ^
/tmp/B.b0831137-5079-4121-aa60-900e29b62b65/BUILD/eaccelerator-0.9.6.1/ea_restore.c:748:26: error: 'zend_class_entry' has no member named 'default_static_members'
     restore_zval_hash(&to->default_static_members, &from->default_static_members);
                          ^
/tmp/B.b0831137-5079-4121-aa60-900e29b62b65/BUILD/eaccelerator-0.9.6.1/ea_restore.c:271:18: note: in definition of macro 'restore_zval_hash'
     restore_hash(target, source, (restore_bucket_t)restore_zval_ptr TSRMLS_CC)
                  ^
/tmp/B.b0831137-5079-4121-aa60-900e29b62b65/BUILD/eaccelerator-0.9.6.1/ea_restore.c:749:7: error: 'zend_class_entry' has no member named 'default_static_members'
     to->default_static_members.pDestructor = ZVAL_PTR_DTOR;
       ^
In file included from /usr/include/php/Zend/zend.h:252:0,
                 from /usr/include/php/main/php.h:34,
                 from /tmp/B.b0831137-5079-4121-aa60-900e29b62b65/BUILD/eaccelerator-0.9.6.1/eaccelerator.h:31,
                 from /tmp/B.b0831137-5079-4121-aa60-900e29b62b65/BUILD/eaccelerator-0.9.6.1/ea_restore.c:28:
/tmp/B.b0831137-5079-4121-aa60-900e29b62b65/BUILD/eaccelerator-0.9.6.1/ea_restore.c:752:27: error: 'zend_class_entry' has no member named 'static_members'
         ALLOC_HASHTABLE(to->static_members);
                           ^
/usr/include/php/Zend/zend_alloc.h:179:3: note: in definition of macro 'ALLOC_HASHTABLE'
  (ht) = (HashTable *) emalloc(sizeof(HashTable))
   ^
/tmp/B.b0831137-5079-4121-aa60-900e29b62b65/BUILD/eaccelerator-0.9.6.1/ea_restore.c:753:29: error: 'zend_class_entry' has no member named 'static_members'
         restore_zval_hash(to->static_members, from->static_members);
                             ^
/tmp/B.b0831137-5079-4121-aa60-900e29b62b65/BUILD/eaccelerator-0.9.6.1/ea_restore.c:271:18: note: in definition of macro 'restore_zval_hash'
     restore_hash(target, source, (restore_bucket_t)restore_zval_ptr TSRMLS_CC)
                  ^
/tmp/B.b0831137-5079-4121-aa60-900e29b62b65/BUILD/eaccelerator-0.9.6.1/ea_restore.c:754:11: error: 'zend_class_entry' has no member named 'static_members'
         to->static_members->pDestructor = ZVAL_PTR_DTOR;
           ^
/tmp/B.b0831137-5079-4121-aa60-900e29b62b65/BUILD/eaccelerator-0.9.6.1/ea_restore.c:756:11: error: 'zend_class_entry' has no member named 'static_members'
         to->static_members = &(to->default_static_members);
           ^
/tmp/B.b0831137-5079-4121-aa60-900e29b62b65/BUILD/eaccelerator-0.9.6.1/ea_restore.c:756:34: error: 'zend_class_entry' has no member named 'default_static_members'
         to->static_members = &(to->default_static_members);
                                  ^
/tmp/B.b0831137-5079-4121-aa60-900e29b62b65/BUILD/eaccelerator-0.9.6.1/ea_restore.c: In function 'restore_class':
/tmp/B.b0831137-5079-4121-aa60-900e29b62b65/BUILD/eaccelerator-0.9.6.1/ea_restore.c:817:33: error: 'zend_class_entry' has no member named 'line_start'
             CG(zend_lineno) = ce->line_start;
                                 ^
/tmp/B.b0831137-5079-4121-aa60-900e29b62b65/BUILD/eaccelerator-0.9.6.1/ea_store.c: In function 'store_static_member_access_check':
/tmp/B.b0831137-5079-4121-aa60-900e29b62b65/BUILD/eaccelerator-0.9.6.1/ea_store.c:717:9: warning: passing argument 3 of 'zend_unmangle_property_name_ex' from incompatible pointer type [enabled by default]
         zend_unmangle_property_name(p->arKey, p->nKeyLength, &cname, &mname);
         ^
In file included from /usr/include/php/Zend/zend_modules.h:26:0,
                 from /usr/include/php/Zend/zend_API.h:26,
                 from /usr/include/php/main/php.h:38,
                 from /tmp/B.b0831137-5079-4121-aa60-900e29b62b65/BUILD/eaccelerator-0.9.6.1/eaccelerator.h:31,
                 from /tmp/B.b0831137-5079-4121-aa60-900e29b62b65/BUILD/eaccelerator-0.9.6.1/ea_store.c:28:
/usr/include/php/Zend/zend_compile.h:678:14: note: expected 'const char **' but argument is of type 'char **'
 ZEND_API int zend_unmangle_property_name_ex(const char *mangled_property, int mangled_property_len, const char **class_name, const char **prop_name, int *prop_len);
              ^
/tmp/B.b0831137-5079-4121-aa60-900e29b62b65/BUILD/eaccelerator-0.9.6.1/ea_store.c:717:9: warning: passing argument 4 of 'zend_unmangle_property_name_ex' from incompatible pointer type [enabled by default]
         zend_unmangle_property_name(p->arKey, p->nKeyLength, &cname, &mname);
         ^
In file included from /usr/include/php/Zend/zend_modules.h:26:0,
                 from /usr/include/php/Zend/zend_API.h:26,
                 from /usr/include/php/main/php.h:38,
                 from /tmp/B.b0831137-5079-4121-aa60-900e29b62b65/BUILD/eaccelerator-0.9.6.1/eaccelerator.h:31,
                 from /tmp/B.b0831137-5079-4121-aa60-900e29b62b65/BUILD/eaccelerator-0.9.6.1/ea_store.c:28:
/usr/include/php/Zend/zend_compile.h:678:14: note: expected 'const char **' but argument is of type 'char **'
 ZEND_API int zend_unmangle_property_name_ex(const char *mangled_property, int mangled_property_len, const char **class_name, const char **prop_name, int *prop_len);
              ^
/tmp/B.b0831137-5079-4121-aa60-900e29b62b65/BUILD/eaccelerator-0.9.6.1/ea_store.c:726:44: error: 'zend_class_entry' has no member named 'default_static_members'
             if(zend_hash_quick_find(&parent->default_static_members, p->arKey, p->nKeyLength, p->h, &pprop.ptr) == SUCCESS) {
                                            ^
/tmp/B.b0831137-5079-4121-aa60-900e29b62b65/BUILD/eaccelerator-0.9.6.1/ea_store.c: In function 'store_class_entry':
/tmp/B.b0831137-5079-4121-aa60-900e29b62b65/BUILD/eaccelerator-0.9.6.1/ea_store.c:801:26: error: 'zend_class_entry' has no member named 'line_start'
     to->line_start = from->line_start;
                          ^
/tmp/B.b0831137-5079-4121-aa60-900e29b62b65/BUILD/eaccelerator-0.9.6.1/ea_store.c:802:24: error: 'zend_class_entry' has no member named 'line_end'
     to->line_end = from->line_end;
                        ^
/tmp/B.b0831137-5079-4121-aa60-900e29b62b65/BUILD/eaccelerator-0.9.6.1/ea_store.c:807:13: error: 'zend_class_entry' has no member named 'filename'
     if (from->filename != NULL)
             ^
/tmp/B.b0831137-5079-4121-aa60-900e29b62b65/BUILD/eaccelerator-0.9.6.1/ea_store.c:808:45: error: 'zend_class_entry' has no member named 'filename'
         to->filename = store_string(at, from->filename, strlen(from->filename) + 1 TSRMLS_CC);
                                             ^
/tmp/B.b0831137-5079-4121-aa60-900e29b62b65/BUILD/eaccelerator-0.9.6.1/ea_store.c:808:68: error: 'zend_class_entry' has no member named 'filename'
         to->filename = store_string(at, from->filename, strlen(from->filename) + 1 TSRMLS_CC);
                                                                    ^
/tmp/B.b0831137-5079-4121-aa60-900e29b62b65/BUILD/eaccelerator-0.9.6.1/ea_store.c:815:55: error: 'zend_class_entry' has no member named 'default_properties'
     store_zval_hash(at, &to->default_properties, &from->default_properties);
                                                       ^
/tmp/B.b0831137-5079-4121-aa60-900e29b62b65/BUILD/eaccelerator-0.9.6.1/ea_store.c:349:25: note: in definition of macro 'store_hash_ex'
   store_hash_int(p, to, from, start, store_bucket, check_bucket, from_ce)
                         ^
/tmp/B.b0831137-5079-4121-aa60-900e29b62b65/BUILD/eaccelerator-0.9.6.1/ea_store.c:355:3: note: in expansion of macro 'store_hash'
   store_hash(p, to, from, (store_bucket_t)store_zval_ptr, NULL, NULL)
   ^
/tmp/B.b0831137-5079-4121-aa60-900e29b62b65/BUILD/eaccelerator-0.9.6.1/ea_store.c:815:5: note: in expansion of macro 'store_zval_hash'
     store_zval_hash(at, &to->default_properties, &from->default_properties);
     ^
/tmp/B.b0831137-5079-4121-aa60-900e29b62b65/BUILD/eaccelerator-0.9.6.1/ea_store.c:815:55: error: 'zend_class_entry' has no member named 'default_properties'
     store_zval_hash(at, &to->default_properties, &from->default_properties);
                                                       ^
/tmp/B.b0831137-5079-4121-aa60-900e29b62b65/BUILD/eaccelerator-0.9.6.1/ea_store.c:349:31: note: in definition of macro 'store_hash_ex'
   store_hash_int(p, to, from, start, store_bucket, check_bucket, from_ce)
                               ^
/tmp/B.b0831137-5079-4121-aa60-900e29b62b65/BUILD/eaccelerator-0.9.6.1/ea_store.c:355:3: note: in expansion of macro 'store_hash'
   store_hash(p, to, from, (store_bucket_t)store_zval_ptr, NULL, NULL)
   ^
/tmp/B.b0831137-5079-4121-aa60-900e29b62b65/BUILD/eaccelerator-0.9.6.1/ea_store.c:815:5: note: in expansion of macro 'store_zval_hash'
     store_zval_hash(at, &to->default_properties, &from->default_properties);
     ^
/tmp/B.b0831137-5079-4121-aa60-900e29b62b65/BUILD/eaccelerator-0.9.6.1/ea_store.c:818:14: error: 'zend_class_entry' has no member named 'static_members'
     if ((from->static_members != NULL) && (from->static_members != &from->default_static_members)) {
              ^
/tmp/B.b0831137-5079-4121-aa60-900e29b62b65/BUILD/eaccelerator-0.9.6.1/ea_store.c:818:48: error: 'zend_class_entry' has no member named 'static_members'
     if ((from->static_members != NULL) && (from->static_members != &from->default_static_members)) {
                                                ^
/tmp/B.b0831137-5079-4121-aa60-900e29b62b65/BUILD/eaccelerator-0.9.6.1/ea_store.c:818:73: error: 'zend_class_entry' has no member named 'default_static_members'
     if ((from->static_members != NULL) && (from->static_members != &from->default_static_members)) {
                                                                         ^
/tmp/B.b0831137-5079-4121-aa60-900e29b62b65/BUILD/eaccelerator-0.9.6.1/debug.c: In function 'ea_debug_log_hashkeys':
/tmp/B.b0831137-5079-4121-aa60-900e29b62b65/BUILD/eaccelerator-0.9.6.1/debug.c:191:13: warning: passing argument 2 of 'ea_debug_binary_print' discards 'const' qualifier from pointer target type [enabled by default]
             ea_debug_binary_print (EA_LOG_HASHKEYS, b->arKey, b->nKeyLength);
             ^
/tmp/B.b0831137-5079-4121-aa60-900e29b62b65/BUILD/eaccelerator-0.9.6.1/debug.c:156:6: note: expected 'char *' but argument is of type 'const char *'
 void ea_debug_binary_print (long debug_level, char *p, int len)
      ^
/tmp/B.b0831137-5079-4121-aa60-900e29b62b65/BUILD/eaccelerator-0.9.6.1/debug.c: In function 'ea_debug_dump_zend_class_entry':
/tmp/B.b0831137-5079-4121-aa60-900e29b62b65/BUILD/eaccelerator-0.9.6.1/debug.c:296:59: error: 'zend_class_entry' has no member named 'default_properties'
     fprintf(F_fp, "\tdefault_properties: %u entries\n", ce->default_properties.nNumOfElements);
                                                           ^
/tmp/B.b0831137-5079-4121-aa60-900e29b62b65/BUILD/eaccelerator-0.9.6.1/debug.c:298:63: error: 'zend_class_entry' has no member named 'default_static_members'
     fprintf(F_fp, "\tdefault_static_members: %u entries\n", ce->default_static_members.nNumOfElements);
                                                               ^
/tmp/B.b0831137-5079-4121-aa60-900e29b62b65/BUILD/eaccelerator-0.9.6.1/debug.c:299:55: error: 'zend_class_entry' has no member named 'static_members'
     fprintf(F_fp, "\tstatic_members: %u entries\n", ce->static_members->nNumOfElements);
                                                       ^
/tmp/B.b0831137-5079-4121-aa60-900e29b62b65/BUILD/eaccelerator-0.9.6.1/debug.c:303:41: error: 'zend_class_entry' has no member named 'filename'
     fprintf(F_fp, "\tfilename: %s\n", ce->filename);
                                         ^
/tmp/B.b0831137-5079-4121-aa60-900e29b62b65/BUILD/eaccelerator-0.9.6.1/debug.c:304:43: error: 'zend_class_entry' has no member named 'line_start'
     fprintf(F_fp, "\tline_start: %u\n", ce->line_start);
                                           ^
/tmp/B.b0831137-5079-4121-aa60-900e29b62b65/BUILD/eaccelerator-0.9.6.1/debug.c:305:41: error: 'zend_class_entry' has no member named 'line_end'
     fprintf(F_fp, "\tline_end: %u\n", ce->line_end);
                                         ^
/tmp/B.b0831137-5079-4121-aa60-900e29b62b65/BUILD/eaccelerator-0.9.6.1/ea_store.c:819:63: error: 'zend_class_entry' has no member named 'default_static_members'
         store_zval_hash(at, &to->default_static_members, &from->default_static_members);
                                                               ^
/tmp/B.b0831137-5079-4121-aa60-900e29b62b65/BUILD/eaccelerator-0.9.6.1/ea_store.c:349:25: note: in definition of macro 'store_hash_ex'
   store_hash_int(p, to, from, start, store_bucket, check_bucket, from_ce)
                         ^
/tmp/B.b0831137-5079-4121-aa60-900e29b62b65/BUILD/eaccelerator-0.9.6.1/ea_store.c:355:3: note: in expansion of macro 'store_hash'
   store_hash(p, to, from, (store_bucket_t)store_zval_ptr, NULL, NULL)
   ^
/tmp/B.b0831137-5079-4121-aa60-900e29b62b65/BUILD/eaccelerator-0.9.6.1/ea_store.c:819:9: note: in expansion of macro 'store_zval_hash'
         store_zval_hash(at, &to->default_static_members, &from->default_static_members);
         ^
/tmp/B.b0831137-5079-4121-aa60-900e29b62b65/BUILD/eaccelerator-0.9.6.1/ea_store.c:819:63: error: 'zend_class_entry' has no member named 'default_static_members'
         store_zval_hash(at, &to->default_static_members, &from->default_static_members);
                                                               ^
/tmp/B.b0831137-5079-4121-aa60-900e29b62b65/BUILD/eaccelerator-0.9.6.1/ea_store.c:349:31: note: in definition of macro 'store_hash_ex'
   store_hash_int(p, to, from, start, store_bucket, check_bucket, from_ce)
                               ^
/tmp/B.b0831137-5079-4121-aa60-900e29b62b65/BUILD/eaccelerator-0.9.6.1/ea_store.c:355:3: note: in expansion of macro 'store_hash'
   store_hash(p, to, from, (store_bucket_t)store_zval_ptr, NULL, NULL)
   ^
/tmp/B.b0831137-5079-4121-aa60-900e29b62b65/BUILD/eaccelerator-0.9.6.1/ea_store.c:819:9: note: in expansion of macro 'store_zval_hash'
         store_zval_hash(at, &to->default_static_members, &from->default_static_members);
         ^
/tmp/B.b0831137-5079-4121-aa60-900e29b62b65/BUILD/eaccelerator-0.9.6.1/ea_store.c:823:48: error: 'zend_class_entry' has no member named 'static_members'
         store_hash(at, to->static_members, from->static_members, (store_bucket_t) store_zval_ptr, (check_bucket_t) store_static_member_access_check, from);
                                                ^
/tmp/B.b0831137-5079-4121-aa60-900e29b62b65/BUILD/eaccelerator-0.9.6.1/ea_store.c:349:25: note: in definition of macro 'store_hash_ex'
   store_hash_int(p, to, from, start, store_bucket, check_bucket, from_ce)
                         ^
/tmp/B.b0831137-5079-4121-aa60-900e29b62b65/BUILD/eaccelerator-0.9.6.1/ea_store.c:823:9: note: in expansion of macro 'store_hash'
         store_hash(at, to->static_members, from->static_members, (store_bucket_t) store_zval_ptr, (check_bucket_t) store_static_member_access_check, from);
         ^
/tmp/B.b0831137-5079-4121-aa60-900e29b62b65/BUILD/eaccelerator-0.9.6.1/ea_store.c:823:48: error: 'zend_class_entry' has no member named 'static_members'
         store_hash(at, to->static_members, from->static_members, (store_bucket_t) store_zval_ptr, (check_bucket_t) store_static_member_access_check, from);
                                                ^
/tmp/B.b0831137-5079-4121-aa60-900e29b62b65/BUILD/eaccelerator-0.9.6.1/ea_store.c:349:31: note: in definition of macro 'store_hash_ex'
   store_hash_int(p, to, from, start, store_bucket, check_bucket, from_ce)
                               ^
/tmp/B.b0831137-5079-4121-aa60-900e29b62b65/BUILD/eaccelerator-0.9.6.1/ea_store.c:823:9: note: in expansion of macro 'store_hash'
         store_hash(at, to->static_members, from->static_members, (store_bucket_t) store_zval_ptr, (check_bucket_t) store_static_member_access_check, from);
         ^
/tmp/B.b0831137-5079-4121-aa60-900e29b62b65/BUILD/eaccelerator-0.9.6.1/ea_store.c:825:58: error: 'zend_class_entry' has no member named 'default_static_members'
         store_hash(at, &to->default_static_members, &from->default_static_members, (store_bucket_t) store_zval_ptr, (check_bucket_t) store_static_member_access_check, from);
                                                          ^
/tmp/B.b0831137-5079-4121-aa60-900e29b62b65/BUILD/eaccelerator-0.9.6.1/ea_store.c:349:25: note: in definition of macro 'store_hash_ex'
   store_hash_int(p, to, from, start, store_bucket, check_bucket, from_ce)
                         ^
/tmp/B.b0831137-5079-4121-aa60-900e29b62b65/BUILD/eaccelerator-0.9.6.1/ea_store.c:825:9: note: in expansion of macro 'store_hash'
         store_hash(at, &to->default_static_members, &from->default_static_members, (store_bucket_t) store_zval_ptr, (check_bucket_t) store_static_member_access_check, from);
         ^
/tmp/B.b0831137-5079-4121-aa60-900e29b62b65/BUILD/eaccelerator-0.9.6.1/ea_store.c:825:58: error: 'zend_class_entry' has no member named 'default_static_members'
         store_hash(at, &to->default_static_members, &from->default_static_members, (store_bucket_t) store_zval_ptr, (check_bucket_t) store_static_member_access_check, from);
                                                          ^
/tmp/B.b0831137-5079-4121-aa60-900e29b62b65/BUILD/eaccelerator-0.9.6.1/ea_store.c:349:31: note: in definition of macro 'store_hash_ex'
   store_hash_int(p, to, from, start, store_bucket, check_bucket, from_ce)
                               ^
/tmp/B.b0831137-5079-4121-aa60-900e29b62b65/BUILD/eaccelerator-0.9.6.1/ea_store.c:825:9: note: in expansion of macro 'store_hash'
         store_hash(at, &to->default_static_members, &from->default_static_members, (store_bucket_t) store_zval_ptr, (check_bucket_t) store_static_member_access_check, from);
         ^
Makefile:207: recipe for target 'ea_restore.lo' failed
make: *** [ea_restore.lo] Error 1
Makefile:205: recipe for target 'debug.lo' failed
make: *** [debug.lo] Error 1
Makefile:209: recipe for target 'ea_store.lo' failed
make: *** [ea_store.lo] Error 1
error: Bad exit status from /tmp/B.b0831137-5079-4121-aa60-900e29b62b65/BUILD/tmp/rpm-tmp.83047 (%build)


RPM build errors:
    Bad exit status from /tmp/B.b0831137-5079-4121-aa60-900e29b62b65/BUILD/tmp/rpm-tmp.83047 (%build)
ended at: Mon Apr 28 13:49:50 2014, done in 0:00:09.365781
error: No files produced.
mesg: ttyname failed: Inappropriate ioctl for device
+ chmod -R u+rwX /tmp/B.b0831137-5079-4121-aa60-900e29b62b65/BUILD
+ rm -rf /tmp/B.b0831137-5079-4121-aa60-900e29b62b65/tmp /tmp/B.b0831137-5079-4121-aa60-900e29b62b65/BUILD
mesg: ttyname failed: Inappropriate ioctl for device
+ rm -rf /tmp/B.b0831137-5079-4121-aa60-900e29b62b65
Begin-PLD-Builder-Info
Build-Time: user:4.33s sys:0.83s real:12.22s (faults io:1 non-io:1073257)

End-PLD-Builder-Info
[Back to list of logs] [View rpm -qa of builder]