FailedOk

th/SRPMS[OK]
th/x32[OK]
th/i686[OK]
th/x86_64[OK]

ac/SRPMS[OK]
ac/i386[OK]
ac/i586[OK]
ac/i686[OK]
ac/alpha[OK]
ac/amd64[OK]
ac/athlon[OK]
ac/ppc[OK]
ac/sparc[OK]
ac/sparc64[OK]

Advanced Search
main()
Powered by PLD Linux
(c) 2002-2021 PLD Team
$Revision: 1.37 $
Powered by Parallel thinking.
Your IP: 54.227.97.219

php-pecl-funcall a370d466-09aa-42f8-9483-2b4804246e9b

Status:Failed
Source URL:https://buildlogs.pld-linux.org/pld/th/x86_64/FAIL/php-pecl-funcall,a370d466-09aa-42f8-9483-2b4804246e9b.bz2
text/plain URL:View!
full text:View!
rpm -qa of builder:View!
Date:2014/04/28 14:12:07
Runtime:0:00:05.921034

Toc:

  • error 1
  • /tmp/B.2b555951-3c05-4347-8e2e-f87fed732a1b/BUILD/php-pecl-funcall-0.3.0/php_funcall.h:101:30: error: 'union <anonymous>' has no member named 'var'
  • error 2
  • /tmp/B.2b555951-3c05-4347-8e2e-f87fed732a1b/BUILD/php-pecl-funcall-0.3.0/php_funcall.h:104:26: error: 'union <anonymous>' has no member named 'var'
  • error 3
  • /tmp/B.2b555951-3c05-4347-8e2e-f87fed732a1b/BUILD/php-pecl-funcall-0.3.0/php_funcall.h:105:33: error: 'union <anonymous>' has no member named 'var'
  • error 4
  • /tmp/B.2b555951-3c05-4347-8e2e-f87fed732a1b/BUILD/php-pecl-funcall-0.3.0/php_funcall.h:107:46: error: 'union <anonymous>' has no member named 'var'
  • error 5
  • /tmp/B.2b555951-3c05-4347-8e2e-f87fed732a1b/BUILD/php-pecl-funcall-0.3.0/funcall.c:103:30: error: 'union <anonymous>' has no member named 'var'
  • error 6
  • /tmp/B.2b555951-3c05-4347-8e2e-f87fed732a1b/BUILD/php-pecl-funcall-0.3.0/funcall.c:108:28: error: 'union <anonymous>' has no member named 'var'
  • error 7
  • /tmp/B.2b555951-3c05-4347-8e2e-f87fed732a1b/BUILD/php-pecl-funcall-0.3.0/funcall.c:109:35: error: 'union <anonymous>' has no member named 'var'
  • error 8
  • /tmp/B.2b555951-3c05-4347-8e2e-f87fed732a1b/BUILD/php-pecl-funcall-0.3.0/funcall.c:143:27: error: 'znode_op' has no member named 'u'
  • error 9
  • /tmp/B.2b555951-3c05-4347-8e2e-f87fed732a1b/BUILD/php-pecl-funcall-0.3.0/funcall.c:149:76: error: 'zend_execute_data' has no member named 'Ts'
  • error 10
  • /tmp/B.2b555951-3c05-4347-8e2e-f87fed732a1b/BUILD/php-pecl-funcall-0.3.0/funcall.c:186:17: error: lvalue required as left operand of assignment
  • error 11
  • /tmp/B.2b555951-3c05-4347-8e2e-f87fed732a1b/BUILD/php-pecl-funcall-0.3.0/funcall.c:455:70: error: 'znode_op' has no member named 'op_type'
  • error 12
  • /tmp/B.2b555951-3c05-4347-8e2e-f87fed732a1b/BUILD/php-pecl-funcall-0.3.0/funcall.c:456:43: error: 'znode_op' has no member named 'u'
  • error 13
  • /tmp/B.2b555951-3c05-4347-8e2e-f87fed732a1b/BUILD/php-pecl-funcall-0.3.0/funcall.c:476:24: error: 'union <anonymous>' has no member named 'var'
  • error 14
  • /tmp/B.2b555951-3c05-4347-8e2e-f87fed732a1b/BUILD/php-pecl-funcall-0.3.0/funcall.c:481:44: error: 'struct _zend_execute_data' has no member named 'CVs'
  • error 15
  • /tmp/B.2b555951-3c05-4347-8e2e-f87fed732a1b/BUILD/php-pecl-funcall-0.3.0/funcall.c:481:57: error: 'union <anonymous>' has no member named 'var'
  • error 16
  • /tmp/B.2b555951-3c05-4347-8e2e-f87fed732a1b/BUILD/php-pecl-funcall-0.3.0/funcall.c:484:73: error: 'union <anonymous>' has no member named 'var'
  • error 17
  • /tmp/B.2b555951-3c05-4347-8e2e-f87fed732a1b/BUILD/php-pecl-funcall-0.3.0/funcall.c:496:34: error: 'const union <anonymous>' has no member named 'var'
  • error 18
  • /tmp/B.2b555951-3c05-4347-8e2e-f87fed732a1b/BUILD/php-pecl-funcall-0.3.0/funcall.c:502:18: error: 'struct <anonymous>' has no member named 'ptr'
  • error 19
  • /tmp/B.2b555951-3c05-4347-8e2e-f87fed732a1b/BUILD/php-pecl-funcall-0.3.0/funcall.c:544:25: error: 'union <anonymous>' has no member named 'var'
  • error 20
  • /tmp/B.2b555951-3c05-4347-8e2e-f87fed732a1b/BUILD/php-pecl-funcall-0.3.0/funcall.c:606:28: error: 'znode_op' has no member named 'op_type'
  • error 21
  • /tmp/B.2b555951-3c05-4347-8e2e-f87fed732a1b/BUILD/php-pecl-funcall-0.3.0/funcall.c:608:44: error: 'znode_op' has no member named 'u'
  • error 22
  • /tmp/B.2b555951-3c05-4347-8e2e-f87fed732a1b/BUILD/php-pecl-funcall-0.3.0/funcall.c:613:78: error: 'zend_execute_data' has no member named 'Ts'
  • error 23
  • /tmp/B.2b555951-3c05-4347-8e2e-f87fed732a1b/BUILD/php-pecl-funcall-0.3.0/funcall.c:626:78: error: 'zend_execute_data' has no member named 'Ts'
  • error 24
  • /tmp/B.2b555951-3c05-4347-8e2e-f87fed732a1b/BUILD/php-pecl-funcall-0.3.0/php_funcall.h:83:16: error: expected ';' before '(' token
  • error 25
  • /tmp/B.2b555951-3c05-4347-8e2e-f87fed732a1b/BUILD/php-pecl-funcall-0.3.0/php_funcall.h:83:16: error: expected ';' before '(' token
  • error 26
  • /tmp/B.2b555951-3c05-4347-8e2e-f87fed732a1b/BUILD/php-pecl-funcall-0.3.0/funcall.c:747:29: error: expected ';' before 'new_gfl'
  • error 27
  • /tmp/B.2b555951-3c05-4347-8e2e-f87fed732a1b/BUILD/php-pecl-funcall-0.3.0/funcall.c:757:21: error: expected ';' before 'cl'
  • error 28
  • /tmp/B.2b555951-3c05-4347-8e2e-f87fed732a1b/BUILD/php-pecl-funcall-0.3.0/funcall.c:765:29: error: expected ';' before 'new_cl'
  • error 29
  • /tmp/B.2b555951-3c05-4347-8e2e-f87fed732a1b/BUILD/php-pecl-funcall-0.3.0/funcall.c:926:4: error: too few arguments to function 'execute_internal'
  • error 30
  • /tmp/B.2b555951-3c05-4347-8e2e-f87fed732a1b/BUILD/php-pecl-funcall-0.3.0/funcall.c:936:4: error: too few arguments to function 'execute_internal'
  • error 31
  • /tmp/B.2b555951-3c05-4347-8e2e-f87fed732a1b/BUILD/php-pecl-funcall-0.3.0/funcall.c:953:4: error: too few arguments to function 'execute_internal'
  • error 32
  • /tmp/B.2b555951-3c05-4347-8e2e-f87fed732a1b/BUILD/php-pecl-funcall-0.3.0/funcall.c:963:61: error: 'zend_execute_data' has no member named 'Ts'
  • error 33
  • /tmp/B.2b555951-3c05-4347-8e2e-f87fed732a1b/BUILD/php-pecl-funcall-0.3.0/funcall.c:963:87: error: 'znode_op' has no member named 'u'
  • error 34
  • Makefile:201: recipe for target 'funcall.lo' failed
  • error 35
  • error: Bad exit status from /tmp/B.2b555951-3c05-4347-8e2e-f87fed732a1b/BUILD/tmp/rpm-tmp.37671 (%build)
  • error 36
  • RPM build errors:
  • error 37
  • error: No files produced.

Content:

checking for grep that handles long lines and -e... /bin/grep
checking for egrep... /bin/grep -E
checking for a sed that does not truncate output... /bin/sed
checking for x86_64-pld-linux-cc... x86_64-pld-linux-gcc
checking whether the C compiler works... yes
checking for C compiler default output file name... a.out
checking for suffix of executables... 
checking whether we are cross compiling... no
checking for suffix of object files... o
checking whether we are using the GNU C compiler... yes
checking whether x86_64-pld-linux-gcc accepts -g... yes
checking for x86_64-pld-linux-gcc option to accept ISO C89... none needed
checking how to run the C preprocessor... x86_64-pld-linux-gcc -E
checking for icc... no
checking for suncc... no
checking whether x86_64-pld-linux-gcc and cc understand -c and -o together... yes
checking for system library directory... lib
checking if compiler supports -R... no
checking if compiler supports -Wl,-rpath,... yes
checking build system type... x86_64-pld-linux-gnu
checking host system type... x86_64-pld-linux-gnu
checking target system type... x86_64-pld-linux-gnu
checking for PHP prefix... /usr
checking for PHP includes... -I/usr/include/php -I/usr/include/php/main -I/usr/include/php/TSRM -I/usr/include/php/Zend -I/usr/include/php/ext -I/usr/include/php/ext/date/lib
checking for PHP extension directory... /usr/lib64/php
checking for PHP installed headers prefix... /usr/include/php
checking if debug is enabled... no
checking if zts is enabled... no
checking for re2c... re2c
checking for re2c version... 0.13.5 (ok)
checking for gawk... gawk
checking whether to enable funcall support... yes, shared
checking how to print strings... print -r
checking for a sed that does not truncate output... (cached) /bin/sed
checking for fgrep... /bin/grep -F
checking for ld used by x86_64-pld-linux-gcc... /usr/bin/ld
checking if the linker (/usr/bin/ld) is GNU ld... yes
checking for BSD- or MS-compatible name lister (nm)... /usr/bin/nm -B
checking the name lister (/usr/bin/nm -B) interface... BSD nm
checking whether ln -s works... yes
checking the maximum length of command line arguments... 1572864
checking whether the shell understands some XSI constructs... yes
checking whether the shell understands "+="... yes
checking how to convert x86_64-pld-linux-gnu file names to x86_64-pld-linux-gnu format... func_convert_file_noop
checking how to convert x86_64-pld-linux-gnu file names to toolchain format... func_convert_file_noop
checking for /usr/bin/ld option to reload object files... -r
checking for x86_64-pld-linux-objdump... no
checking for objdump... objdump
checking how to recognize dependent libraries... pass_all
checking for x86_64-pld-linux-dlltool... no
checking for dlltool... no
checking how to associate runtime and link libraries... print -r --
checking for x86_64-pld-linux-ar... no
checking for ar... ar
checking for archiver @FILE support... @
checking for x86_64-pld-linux-strip... no
checking for strip... strip
checking for x86_64-pld-linux-ranlib... no
checking for ranlib... ranlib
checking for mawk... (cached) gawk
checking command to parse /usr/bin/nm -B output from x86_64-pld-linux-gcc object... ok
checking for sysroot... no
checking for x86_64-pld-linux-mt... no
checking for mt... no
checking if : is a manifest tool... no
checking for ANSI C header files... yes
checking for sys/types.h... yes
checking for sys/stat.h... yes
checking for stdlib.h... yes
checking for string.h... yes
checking for memory.h... yes
checking for strings.h... yes
checking for inttypes.h... yes
checking for stdint.h... yes
checking for unistd.h... yes
checking for dlfcn.h... yes
checking for objdir... .libs
checking if x86_64-pld-linux-gcc supports -fno-rtti -fno-exceptions... no
checking for x86_64-pld-linux-gcc option to produce PIC... -fPIC -DPIC
checking if x86_64-pld-linux-gcc PIC flag -fPIC -DPIC works... yes
checking if x86_64-pld-linux-gcc static flag -static works... yes
checking if x86_64-pld-linux-gcc supports -c -o file.o... yes
checking if x86_64-pld-linux-gcc supports -c -o file.o... (cached) yes
checking whether the x86_64-pld-linux-gcc linker (/usr/bin/ld -m elf_x86_64) supports shared libraries... yes
checking whether -lc should be explicitly linked in... no
checking dynamic linker characteristics... GNU/Linux ld.so
checking how to hardcode library paths into programs... immediate
checking whether stripping libraries is possible... yes
checking if libtool supports shared libraries... yes
checking whether to build shared libraries... yes
checking whether to build static libraries... no
configure: creating ./config.status
config.status: creating config.h
config.status: executing libtool commands
+ /usr/bin/make -j5
/bin/sh /tmp/B.2b555951-3c05-4347-8e2e-f87fed732a1b/BUILD/php-pecl-funcall-0.3.0/libtool --mode=compile x86_64-pld-linux-gcc  -I. -I/tmp/B.2b555951-3c05-4347-8e2e-f87fed732a1b/BUILD/php-pecl-funcall-0.3.0 -DPHP_ATOM_INC -I/tmp/B.2b555951-3c05-4347-8e2e-f87fed732a1b/BUILD/php-pecl-funcall-0.3.0/include -I/tmp/B.2b555951-3c05-4347-8e2e-f87fed732a1b/BUILD/php-pecl-funcall-0.3.0/main -I/tmp/B.2b555951-3c05-4347-8e2e-f87fed732a1b/BUILD/php-pecl-funcall-0.3.0 -I/usr/include/php -I/usr/include/php/main -I/usr/include/php/TSRM -I/usr/include/php/Zend -I/usr/include/php/ext -I/usr/include/php/ext/date/lib  -DHAVE_CONFIG_H  -O2 -fwrapv -pipe -Wformat -Werror=format-security -gdwarf-4 -fno-debug-types-section -fvar-tracking-assignments -g2 -Wp,-D_FORTIFY_SOURCE=2 -fstack-protector --param=ssp-buffer-size=4 -fPIC -march=x86-64 -gdwarf-4 -fno-debug-types-section -fvar-tracking-assignments -g2   -c /tmp/B.2b555951-3c05-4347-8e2e-f87fed732a1b/BUILD/php-pecl-funcall-0.3.0/funcall.c -o funcall.lo 
libtool: compile:  x86_64-pld-linux-gcc -I. -I/tmp/B.2b555951-3c05-4347-8e2e-f87fed732a1b/BUILD/php-pecl-funcall-0.3.0 -DPHP_ATOM_INC -I/tmp/B.2b555951-3c05-4347-8e2e-f87fed732a1b/BUILD/php-pecl-funcall-0.3.0/include -I/tmp/B.2b555951-3c05-4347-8e2e-f87fed732a1b/BUILD/php-pecl-funcall-0.3.0/main -I/tmp/B.2b555951-3c05-4347-8e2e-f87fed732a1b/BUILD/php-pecl-funcall-0.3.0 -I/usr/include/php -I/usr/include/php/main -I/usr/include/php/TSRM -I/usr/include/php/Zend -I/usr/include/php/ext -I/usr/include/php/ext/date/lib -DHAVE_CONFIG_H -O2 -fwrapv -pipe -Wformat -Werror=format-security -gdwarf-4 -fno-debug-types-section -fvar-tracking-assignments -g2 -Wp,-D_FORTIFY_SOURCE=2 -fstack-protector --param=ssp-buffer-size=4 -fPIC -march=x86-64 -gdwarf-4 -fno-debug-types-section -fvar-tracking-assignments -g2 -c /tmp/B.2b555951-3c05-4347-8e2e-f87fed732a1b/BUILD/php-pecl-funcall-0.3.0/funcall.c  -fPIC -DPIC -o .libs/funcall.o
In file included from /tmp/B.2b555951-3c05-4347-8e2e-f87fed732a1b/BUILD/php-pecl-funcall-0.3.0/funcall.c:25:0:
/tmp/B.2b555951-3c05-4347-8e2e-f87fed732a1b/BUILD/php-pecl-funcall-0.3.0/php_funcall.h: In function 'fg_zval_ptr':
/tmp/B.2b555951-3c05-4347-8e2e-f87fed732a1b/BUILD/php-pecl-funcall-0.3.0/php_funcall.h:101:30: error: 'union <anonymous>' has no member named 'var'
             return &T(node->u.var).tmp_var;
                              ^
/tmp/B.2b555951-3c05-4347-8e2e-f87fed732a1b/BUILD/php-pecl-funcall-0.3.0/php_funcall.h:93:53: note: in definition of macro 'T'
 #define T(offset) (*(temp_variable *)((char *) Ts + offset))
                                                     ^
/tmp/B.2b555951-3c05-4347-8e2e-f87fed732a1b/BUILD/php-pecl-funcall-0.3.0/php_funcall.h:104:26: error: 'union <anonymous>' has no member named 'var'
             if (T(node->u.var).var.ptr) {
                          ^
/tmp/B.2b555951-3c05-4347-8e2e-f87fed732a1b/BUILD/php-pecl-funcall-0.3.0/php_funcall.h:93:53: note: in definition of macro 'T'
 #define T(offset) (*(temp_variable *)((char *) Ts + offset))
                                                     ^
/tmp/B.2b555951-3c05-4347-8e2e-f87fed732a1b/BUILD/php-pecl-funcall-0.3.0/php_funcall.h:105:33: error: 'union <anonymous>' has no member named 'var'
                 return T(node->u.var).var.ptr;
                                 ^
/tmp/B.2b555951-3c05-4347-8e2e-f87fed732a1b/BUILD/php-pecl-funcall-0.3.0/php_funcall.h:93:53: note: in definition of macro 'T'
 #define T(offset) (*(temp_variable *)((char *) Ts + offset))
                                                     ^
/tmp/B.2b555951-3c05-4347-8e2e-f87fed732a1b/BUILD/php-pecl-funcall-0.3.0/php_funcall.h:107:46: error: 'union <anonymous>' has no member named 'var'
                 temp_variable *T = &T(node->u.var);
                                              ^
/tmp/B.2b555951-3c05-4347-8e2e-f87fed732a1b/BUILD/php-pecl-funcall-0.3.0/php_funcall.h:93:53: note: in definition of macro 'T'
 #define T(offset) (*(temp_variable *)((char *) Ts + offset))
                                                     ^
/tmp/B.2b555951-3c05-4347-8e2e-f87fed732a1b/BUILD/php-pecl-funcall-0.3.0/funcall.c: In function 'fc_get_zval':
/tmp/B.2b555951-3c05-4347-8e2e-f87fed732a1b/BUILD/php-pecl-funcall-0.3.0/funcall.c:103:30: error: 'union <anonymous>' has no member named 'var'
             return &T(node->u.var).tmp_var;
                              ^
/tmp/B.2b555951-3c05-4347-8e2e-f87fed732a1b/BUILD/php-pecl-funcall-0.3.0/php_funcall.h:93:53: note: in definition of macro 'T'
 #define T(offset) (*(temp_variable *)((char *) Ts + offset))
                                                     ^
/tmp/B.2b555951-3c05-4347-8e2e-f87fed732a1b/BUILD/php-pecl-funcall-0.3.0/funcall.c:108:28: error: 'union <anonymous>' has no member named 'var'
             if (FCT(node->u.var).var.ptr) {
                            ^
/tmp/B.2b555951-3c05-4347-8e2e-f87fed732a1b/BUILD/php-pecl-funcall-0.3.0/funcall.c:29:55: note: in definition of macro 'FCT'
 #define FCT(offset) (*(temp_variable *)((char *) Ts + offset))
                                                       ^
/tmp/B.2b555951-3c05-4347-8e2e-f87fed732a1b/BUILD/php-pecl-funcall-0.3.0/funcall.c:109:35: error: 'union <anonymous>' has no member named 'var'
                 return FCT(node->u.var).var.ptr;
                                   ^
/tmp/B.2b555951-3c05-4347-8e2e-f87fed732a1b/BUILD/php-pecl-funcall-0.3.0/funcall.c:29:55: note: in definition of macro 'FCT'
 #define FCT(offset) (*(temp_variable *)((char *) Ts + offset))
                                                       ^
/tmp/B.2b555951-3c05-4347-8e2e-f87fed732a1b/BUILD/php-pecl-funcall-0.3.0/funcall.c: In function 'fc_include_or_eval_handler':
/tmp/B.2b555951-3c05-4347-8e2e-f87fed732a1b/BUILD/php-pecl-funcall-0.3.0/funcall.c:140:2: warning: passing argument 1 of 'printf' from incompatible pointer type [enabled by default]
  printf(stderr, "fuccccccccccccccc\n");
  ^
In file included from /usr/include/stdio.h:937:0,
                 from /usr/include/php/Zend/zend.h:68,
                 from /usr/include/php/main/php.h:34,
                 from /tmp/B.2b555951-3c05-4347-8e2e-f87fed732a1b/BUILD/php-pecl-funcall-0.3.0/funcall.c:22:
/usr/include/bits/stdio2.h:102:1: note: expected 'const char * __restrict__' but argument is of type 'struct _IO_FILE *'
 printf (const char *__restrict __fmt, ...)
 ^
In file included from /usr/include/php/Zend/zend.h:843:0,
                 from /usr/include/php/main/php.h:34,
                 from /tmp/B.2b555951-3c05-4347-8e2e-f87fed732a1b/BUILD/php-pecl-funcall-0.3.0/funcall.c:22:
/tmp/B.2b555951-3c05-4347-8e2e-f87fed732a1b/BUILD/php-pecl-funcall-0.3.0/funcall.c:143:27: error: 'znode_op' has no member named 'u'
     if (Z_LVAL(opline->op2.u.constant) == ZEND_EVAL) {
                           ^
/usr/include/php/Zend/zend_operators.h:440:25: note: in definition of macro 'Z_LVAL'
 #define Z_LVAL(zval)   (zval).value.lval
                         ^
/tmp/B.2b555951-3c05-4347-8e2e-f87fed732a1b/BUILD/php-pecl-funcall-0.3.0/funcall.c:149:76: error: 'zend_execute_data' has no member named 'Ts'
         inc_filename = fc_get_zval(execute_data, &opline->op1, execute_data->Ts, &is_var);
                                                                            ^
/tmp/B.2b555951-3c05-4347-8e2e-f87fed732a1b/BUILD/php-pecl-funcall-0.3.0/funcall.c:149:9: warning: passing argument 2 of 'fc_get_zval' from incompatible pointer type [enabled by default]
         inc_filename = fc_get_zval(execute_data, &opline->op1, execute_data->Ts, &is_var);
         ^
/tmp/B.2b555951-3c05-4347-8e2e-f87fed732a1b/BUILD/php-pecl-funcall-0.3.0/funcall.c:94:7: note: expected 'struct znode *' but argument is of type 'union znode_op *'
 zval *fc_get_zval(zend_execute_data *zdata, znode *node, temp_variable *Ts, int *is_var)
       ^
/tmp/B.2b555951-3c05-4347-8e2e-f87fed732a1b/BUILD/php-pecl-funcall-0.3.0/funcall.c:167:34: warning: assignment makes pointer from integer without a cast [enabled by default]
         FCG(last_eval_statement) = php_addcslashes(Z_STRVAL_P(inc_filename), Z_STRLEN_P(inc_filename), &tmp_len, 0, "'\\\0..\37", 6 TSRMLS_CC);
                                  ^
/tmp/B.2b555951-3c05-4347-8e2e-f87fed732a1b/BUILD/php-pecl-funcall-0.3.0/funcall.c:168:3: warning: passing argument 1 of 'printf' from incompatible pointer type [enabled by default]
   printf(stderr, "\nlast_eval_statement:%s\n",FCG(last_eval_statement));
   ^
In file included from /usr/include/stdio.h:937:0,
                 from /usr/include/php/Zend/zend.h:68,
                 from /usr/include/php/main/php.h:34,
                 from /tmp/B.2b555951-3c05-4347-8e2e-f87fed732a1b/BUILD/php-pecl-funcall-0.3.0/funcall.c:22:
/usr/include/bits/stdio2.h:102:1: note: expected 'const char * __restrict__' but argument is of type 'struct _IO_FILE *'
 printf (const char *__restrict __fmt, ...)
 ^
/tmp/B.2b555951-3c05-4347-8e2e-f87fed732a1b/BUILD/php-pecl-funcall-0.3.0/funcall.c: In function 'zm_startup_funcall':
/tmp/B.2b555951-3c05-4347-8e2e-f87fed732a1b/BUILD/php-pecl-funcall-0.3.0/funcall.c:186:17: error: lvalue required as left operand of assignment
     zend_execute=fc_execute;
                 ^
/tmp/B.2b555951-3c05-4347-8e2e-f87fed732a1b/BUILD/php-pecl-funcall-0.3.0/funcall.c:188:29: warning: assignment from incompatible pointer type [enabled by default]
     fc_zend_execute_internal=zend_execute_internal;
                             ^
/tmp/B.2b555951-3c05-4347-8e2e-f87fed732a1b/BUILD/php-pecl-funcall-0.3.0/funcall.c:189:26: warning: assignment from incompatible pointer type [enabled by default]
     zend_execute_internal=fc_execute_internal;
                          ^
/tmp/B.2b555951-3c05-4347-8e2e-f87fed732a1b/BUILD/php-pecl-funcall-0.3.0/funcall.c: In function 'get_current_function_name':
/tmp/B.2b555951-3c05-4347-8e2e-f87fed732a1b/BUILD/php-pecl-funcall-0.3.0/funcall.c:430:5: warning: passing argument 1 of 'get_active_class_name' from incompatible pointer type [enabled by default]
     class_name=get_active_class_name(&space TSRMLS_CC); 
     ^
In file included from /usr/include/php/Zend/zend_API.h:30:0,
                 from /usr/include/php/main/php.h:38,
                 from /tmp/B.2b555951-3c05-4347-8e2e-f87fed732a1b/BUILD/php-pecl-funcall-0.3.0/funcall.c:22:
/usr/include/php/Zend/zend_execute.h:342:22: note: expected 'const char **' but argument is of type 'char **'
 ZEND_API const char *get_active_class_name(const char **space TSRMLS_DC);
                      ^
/tmp/B.2b555951-3c05-4347-8e2e-f87fed732a1b/BUILD/php-pecl-funcall-0.3.0/funcall.c:430:15: warning: assignment discards 'const' qualifier from pointer target type [enabled by default]
     class_name=get_active_class_name(&space TSRMLS_CC); 
               ^
/tmp/B.2b555951-3c05-4347-8e2e-f87fed732a1b/BUILD/php-pecl-funcall-0.3.0/funcall.c:433:23: warning: initialization discards 'const' qualifier from pointer target type [enabled by default]
         char *fname = get_active_function_name(TSRMLS_C);
                       ^
/tmp/B.2b555951-3c05-4347-8e2e-f87fed732a1b/BUILD/php-pecl-funcall-0.3.0/funcall.c:440:26: warning: assignment discards 'const' qualifier from pointer target type [enabled by default]
         current_function = get_active_function_name(TSRMLS_C);
                          ^
/tmp/B.2b555951-3c05-4347-8e2e-f87fed732a1b/BUILD/php-pecl-funcall-0.3.0/funcall.c:455:70: error: 'znode_op' has no member named 'op_type'
         if (exec_data && exec_data->opline  && exec_data->opline->op2.op_type==IS_UNUSED) {
                                                                      ^
/tmp/B.2b555951-3c05-4347-8e2e-f87fed732a1b/BUILD/php-pecl-funcall-0.3.0/funcall.c:456:43: error: 'znode_op' has no member named 'u'
             switch (exec_data->opline->op2.u.constant.value.lval) {
                                           ^
/tmp/B.2b555951-3c05-4347-8e2e-f87fed732a1b/BUILD/php-pecl-funcall-0.3.0/funcall.c: In function 'fc_get_zval_ptr_tmp':
/tmp/B.2b555951-3c05-4347-8e2e-f87fed732a1b/BUILD/php-pecl-funcall-0.3.0/funcall.c:476:24: error: 'union <anonymous>' has no member named 'var'
     return &FCT(node->u.var).tmp_var;
                        ^
/tmp/B.2b555951-3c05-4347-8e2e-f87fed732a1b/BUILD/php-pecl-funcall-0.3.0/funcall.c:29:55: note: in definition of macro 'FCT'
 #define FCT(offset) (*(temp_variable *)((char *) Ts + offset))
                                                       ^
/tmp/B.2b555951-3c05-4347-8e2e-f87fed732a1b/BUILD/php-pecl-funcall-0.3.0/funcall.c: In function 'fc_get_zval_ptr_cv':
/tmp/B.2b555951-3c05-4347-8e2e-f87fed732a1b/BUILD/php-pecl-funcall-0.3.0/funcall.c:481:44: error: 'struct _zend_execute_data' has no member named 'CVs'
     zval ***ptr = &EG(current_execute_data)->CVs[node->u.var];
                                            ^
/tmp/B.2b555951-3c05-4347-8e2e-f87fed732a1b/BUILD/php-pecl-funcall-0.3.0/funcall.c:481:57: error: 'union <anonymous>' has no member named 'var'
     zval ***ptr = &EG(current_execute_data)->CVs[node->u.var];
                                                         ^
/tmp/B.2b555951-3c05-4347-8e2e-f87fed732a1b/BUILD/php-pecl-funcall-0.3.0/funcall.c:484:73: error: 'union <anonymous>' has no member named 'var'
         zend_compiled_variable *cv = &(EG(active_op_array)->vars[node->u.var]);
                                                                         ^
In file included from /tmp/B.2b555951-3c05-4347-8e2e-f87fed732a1b/BUILD/php-pecl-funcall-0.3.0/funcall.c:25:0:
/tmp/B.2b555951-3c05-4347-8e2e-f87fed732a1b/BUILD/php-pecl-funcall-0.3.0/funcall.c: In function '_get_zval_ptr_var_string_offset':
/tmp/B.2b555951-3c05-4347-8e2e-f87fed732a1b/BUILD/php-pecl-funcall-0.3.0/funcall.c:496:34: error: 'const union <anonymous>' has no member named 'var'
     temp_variable *T = &T(node->u.var);
                                  ^
/tmp/B.2b555951-3c05-4347-8e2e-f87fed732a1b/BUILD/php-pecl-funcall-0.3.0/php_funcall.h:93:53: note: in definition of macro 'T'
 #define T(offset) (*(temp_variable *)((char *) Ts + offset))
                                                     ^
/tmp/B.2b555951-3c05-4347-8e2e-f87fed732a1b/BUILD/php-pecl-funcall-0.3.0/funcall.c:502:18: error: 'struct <anonymous>' has no member named 'ptr'
     T->str_offset.ptr = ptr;
                  ^
/tmp/B.2b555951-3c05-4347-8e2e-f87fed732a1b/BUILD/php-pecl-funcall-0.3.0/funcall.c: In function 'fc_get_zval_ptr_var':
/tmp/B.2b555951-3c05-4347-8e2e-f87fed732a1b/BUILD/php-pecl-funcall-0.3.0/funcall.c:544:25: error: 'union <anonymous>' has no member named 'var'
  zval *ptr = FCT(node->u.var).var.ptr;
                         ^
/tmp/B.2b555951-3c05-4347-8e2e-f87fed732a1b/BUILD/php-pecl-funcall-0.3.0/funcall.c:29:55: note: in definition of macro 'FCT'
 #define FCT(offset) (*(temp_variable *)((char *) Ts + offset))
                                                       ^
/tmp/B.2b555951-3c05-4347-8e2e-f87fed732a1b/BUILD/php-pecl-funcall-0.3.0/funcall.c: In function 'get_inc_filename':
/tmp/B.2b555951-3c05-4347-8e2e-f87fed732a1b/BUILD/php-pecl-funcall-0.3.0/funcall.c:606:28: error: 'znode_op' has no member named 'op_type'
         switch (opline->op1.op_type) {
                            ^
/tmp/B.2b555951-3c05-4347-8e2e-f87fed732a1b/BUILD/php-pecl-funcall-0.3.0/funcall.c:608:44: error: 'znode_op' has no member named 'u'
                 tmp_filename = &opline->op1.u.constant;
                                            ^
/tmp/B.2b555951-3c05-4347-8e2e-f87fed732a1b/BUILD/php-pecl-funcall-0.3.0/funcall.c:613:78: error: 'zend_execute_data' has no member named 'Ts'
                 tmp_filename = fc_get_zval_ptr_tmp(&opline->op1, execute_data->Ts TSRMLS_CC);
                                                                              ^
/tmp/B.2b555951-3c05-4347-8e2e-f87fed732a1b/BUILD/php-pecl-funcall-0.3.0/funcall.c:613:17: warning: passing argument 1 of 'fc_get_zval_ptr_tmp' from incompatible pointer type [enabled by default]
                 tmp_filename = fc_get_zval_ptr_tmp(&opline->op1, execute_data->Ts TSRMLS_CC);
                 ^
/tmp/B.2b555951-3c05-4347-8e2e-f87fed732a1b/BUILD/php-pecl-funcall-0.3.0/funcall.c:475:14: note: expected 'struct znode *' but argument is of type 'union znode_op *'
 static zval *fc_get_zval_ptr_tmp(znode *node, temp_variable *Ts TSRMLS_DC){
              ^
/tmp/B.2b555951-3c05-4347-8e2e-f87fed732a1b/BUILD/php-pecl-funcall-0.3.0/funcall.c:619:17: warning: passing argument 1 of 'fc_get_zval_ptr_cv' from incompatible pointer type [enabled by default]
                 tmp_filename = fc_get_zval_ptr_cv(&opline->op1 TSRMLS_CC);
                 ^
/tmp/B.2b555951-3c05-4347-8e2e-f87fed732a1b/BUILD/php-pecl-funcall-0.3.0/funcall.c:479:14: note: expected 'struct znode *' but argument is of type 'union znode_op *'
 static zval *fc_get_zval_ptr_cv(znode *node TSRMLS_DC)
              ^
/tmp/B.2b555951-3c05-4347-8e2e-f87fed732a1b/BUILD/php-pecl-funcall-0.3.0/funcall.c:626:78: error: 'zend_execute_data' has no member named 'Ts'
                 tmp_filename = fc_get_zval_ptr_var(&opline->op1, execute_data->Ts TSRMLS_CC);
                                                                              ^
/tmp/B.2b555951-3c05-4347-8e2e-f87fed732a1b/BUILD/php-pecl-funcall-0.3.0/funcall.c:626:17: warning: passing argument 1 of 'fc_get_zval_ptr_var' from incompatible pointer type [enabled by default]
                 tmp_filename = fc_get_zval_ptr_var(&opline->op1, execute_data->Ts TSRMLS_CC);
                 ^
/tmp/B.2b555951-3c05-4347-8e2e-f87fed732a1b/BUILD/php-pecl-funcall-0.3.0/funcall.c:536:14: note: expected 'struct znode *' but argument is of type 'union znode_op *'
 static zval *fc_get_zval_ptr_var(znode *node, temp_variable *Ts TSRMLS_DC)
              ^
/tmp/B.2b555951-3c05-4347-8e2e-f87fed732a1b/BUILD/php-pecl-funcall-0.3.0/funcall.c: In function 'fc_add_callback':
/tmp/B.2b555951-3c05-4347-8e2e-f87fed732a1b/BUILD/php-pecl-funcall-0.3.0/php_funcall.h:83:16: error: expected ';' before '(' token
 #define FCG(v) (funcall_globals.v)
                ^
/tmp/B.2b555951-3c05-4347-8e2e-f87fed732a1b/BUILD/php-pecl-funcall-0.3.0/funcall.c:50:5: note: in definition of macro 'NEW_FN_LIST'
     li->next=NULL
     ^
/tmp/B.2b555951-3c05-4347-8e2e-f87fed732a1b/BUILD/php-pecl-funcall-0.3.0/funcall.c:728:25: note: in expansion of macro 'FCG'
             NEW_FN_LIST(FCG(fc_pre_list),function_name,function_len);
                         ^
/tmp/B.2b555951-3c05-4347-8e2e-f87fed732a1b/BUILD/php-pecl-funcall-0.3.0/php_funcall.h:83:16: error: expected ';' before '(' token
 #define FCG(v) (funcall_globals.v)
                ^
/tmp/B.2b555951-3c05-4347-8e2e-f87fed732a1b/BUILD/php-pecl-funcall-0.3.0/funcall.c:50:5: note: in definition of macro 'NEW_FN_LIST'
     li->next=NULL
     ^
/tmp/B.2b555951-3c05-4347-8e2e-f87fed732a1b/BUILD/php-pecl-funcall-0.3.0/funcall.c:731:25: note: in expansion of macro 'FCG'
             NEW_FN_LIST(FCG(fc_post_list),function_name,function_len);
                         ^
/tmp/B.2b555951-3c05-4347-8e2e-f87fed732a1b/BUILD/php-pecl-funcall-0.3.0/funcall.c:747:29: error: expected ';' before 'new_gfl'
                 NEW_FN_LIST(new_gfl,function_name,function_len);
                             ^
/tmp/B.2b555951-3c05-4347-8e2e-f87fed732a1b/BUILD/php-pecl-funcall-0.3.0/funcall.c:50:5: note: in definition of macro 'NEW_FN_LIST'
     li->next=NULL
     ^
/tmp/B.2b555951-3c05-4347-8e2e-f87fed732a1b/BUILD/php-pecl-funcall-0.3.0/funcall.c:757:21: error: expected ';' before 'cl'
         NEW_CB_LIST(cl,callback_name,callback_len);
                     ^
/tmp/B.2b555951-3c05-4347-8e2e-f87fed732a1b/BUILD/php-pecl-funcall-0.3.0/funcall.c:57:5: note: in definition of macro 'NEW_CB_LIST'
     li->next=NULL
     ^
/tmp/B.2b555951-3c05-4347-8e2e-f87fed732a1b/BUILD/php-pecl-funcall-0.3.0/funcall.c:765:29: error: expected ';' before 'new_cl'
                 NEW_CB_LIST(new_cl,callback_name,callback_len);
                             ^
/tmp/B.2b555951-3c05-4347-8e2e-f87fed732a1b/BUILD/php-pecl-funcall-0.3.0/funcall.c:57:5: note: in definition of macro 'NEW_CB_LIST'
     li->next=NULL
     ^
/tmp/B.2b555951-3c05-4347-8e2e-f87fed732a1b/BUILD/php-pecl-funcall-0.3.0/funcall.c: In function 'fc_execute_internal':
/tmp/B.2b555951-3c05-4347-8e2e-f87fed732a1b/BUILD/php-pecl-funcall-0.3.0/funcall.c:926:4: warning: passing argument 2 of 'execute_internal' makes pointer from integer without a cast [enabled by default]
    execute_internal(execute_data_ptr, return_value_used TSRMLS_CC);
    ^
In file included from /usr/include/php/Zend/zend_API.h:30:0,
                 from /usr/include/php/main/php.h:38,
                 from /tmp/B.2b555951-3c05-4347-8e2e-f87fed732a1b/BUILD/php-pecl-funcall-0.3.0/funcall.c:22:
/usr/include/php/Zend/zend_execute.h:62:15: note: expected 'struct _zend_fcall_info *' but argument is of type 'int'
 ZEND_API void execute_internal(zend_execute_data *execute_data_ptr, struct _zend_fcall_info *fci, int return_value_used TSRMLS_DC);
               ^
/tmp/B.2b555951-3c05-4347-8e2e-f87fed732a1b/BUILD/php-pecl-funcall-0.3.0/funcall.c:926:4: error: too few arguments to function 'execute_internal'
    execute_internal(execute_data_ptr, return_value_used TSRMLS_CC);
    ^
In file included from /usr/include/php/Zend/zend_API.h:30:0,
                 from /usr/include/php/main/php.h:38,
                 from /tmp/B.2b555951-3c05-4347-8e2e-f87fed732a1b/BUILD/php-pecl-funcall-0.3.0/funcall.c:22:
/usr/include/php/Zend/zend_execute.h:62:15: note: declared here
 ZEND_API void execute_internal(zend_execute_data *execute_data_ptr, struct _zend_fcall_info *fci, int return_value_used TSRMLS_DC);
               ^
/tmp/B.2b555951-3c05-4347-8e2e-f87fed732a1b/BUILD/php-pecl-funcall-0.3.0/funcall.c:936:4: warning: passing argument 2 of 'execute_internal' makes pointer from integer without a cast [enabled by default]
    execute_internal(execute_data_ptr, return_value_used TSRMLS_CC);
    ^
In file included from /usr/include/php/Zend/zend_API.h:30:0,
                 from /usr/include/php/main/php.h:38,
                 from /tmp/B.2b555951-3c05-4347-8e2e-f87fed732a1b/BUILD/php-pecl-funcall-0.3.0/funcall.c:22:
/usr/include/php/Zend/zend_execute.h:62:15: note: expected 'struct _zend_fcall_info *' but argument is of type 'int'
 ZEND_API void execute_internal(zend_execute_data *execute_data_ptr, struct _zend_fcall_info *fci, int return_value_used TSRMLS_DC);
               ^
/tmp/B.2b555951-3c05-4347-8e2e-f87fed732a1b/BUILD/php-pecl-funcall-0.3.0/funcall.c:936:4: error: too few arguments to function 'execute_internal'
    execute_internal(execute_data_ptr, return_value_used TSRMLS_CC);
    ^
In file included from /usr/include/php/Zend/zend_API.h:30:0,
                 from /usr/include/php/main/php.h:38,
                 from /tmp/B.2b555951-3c05-4347-8e2e-f87fed732a1b/BUILD/php-pecl-funcall-0.3.0/funcall.c:22:
/usr/include/php/Zend/zend_execute.h:62:15: note: declared here
 ZEND_API void execute_internal(zend_execute_data *execute_data_ptr, struct _zend_fcall_info *fci, int return_value_used TSRMLS_DC);
               ^
/tmp/B.2b555951-3c05-4347-8e2e-f87fed732a1b/BUILD/php-pecl-funcall-0.3.0/funcall.c:953:4: warning: passing argument 2 of 'execute_internal' makes pointer from integer without a cast [enabled by default]
    execute_internal(execute_data_ptr, return_value_used TSRMLS_CC);
    ^
In file included from /usr/include/php/Zend/zend_API.h:30:0,
                 from /usr/include/php/main/php.h:38,
                 from /tmp/B.2b555951-3c05-4347-8e2e-f87fed732a1b/BUILD/php-pecl-funcall-0.3.0/funcall.c:22:
/usr/include/php/Zend/zend_execute.h:62:15: note: expected 'struct _zend_fcall_info *' but argument is of type 'int'
 ZEND_API void execute_internal(zend_execute_data *execute_data_ptr, struct _zend_fcall_info *fci, int return_value_used TSRMLS_DC);
               ^
/tmp/B.2b555951-3c05-4347-8e2e-f87fed732a1b/BUILD/php-pecl-funcall-0.3.0/funcall.c:953:4: error: too few arguments to function 'execute_internal'
    execute_internal(execute_data_ptr, return_value_used TSRMLS_CC);
    ^
In file included from /usr/include/php/Zend/zend_API.h:30:0,
                 from /usr/include/php/main/php.h:38,
                 from /tmp/B.2b555951-3c05-4347-8e2e-f87fed732a1b/BUILD/php-pecl-funcall-0.3.0/funcall.c:22:
/usr/include/php/Zend/zend_execute.h:62:15: note: declared here
 ZEND_API void execute_internal(zend_execute_data *execute_data_ptr, struct _zend_fcall_info *fci, int return_value_used TSRMLS_DC);
               ^
/tmp/B.2b555951-3c05-4347-8e2e-f87fed732a1b/BUILD/php-pecl-funcall-0.3.0/funcall.c:963:61: error: 'zend_execute_data' has no member named 'Ts'
         return_value_ptr = &(*(temp_variable *)((char *) ptr->Ts + ptr->opline->result.u.var)).var.ptr;
                                                             ^
/tmp/B.2b555951-3c05-4347-8e2e-f87fed732a1b/BUILD/php-pecl-funcall-0.3.0/funcall.c:963:87: error: 'znode_op' has no member named 'u'
         return_value_ptr = &(*(temp_variable *)((char *) ptr->Ts + ptr->opline->result.u.var)).var.ptr;
                                                                                       ^
Makefile:201: recipe for target 'funcall.lo' failed
make: *** [funcall.lo] Error 1
error: Bad exit status from /tmp/B.2b555951-3c05-4347-8e2e-f87fed732a1b/BUILD/tmp/rpm-tmp.37671 (%build)


RPM build errors:
    Bad exit status from /tmp/B.2b555951-3c05-4347-8e2e-f87fed732a1b/BUILD/tmp/rpm-tmp.37671 (%build)
ended at: Mon Apr 28 14:12:07 2014, done in 0:00:05.921034
error: No files produced.
mesg: ttyname failed: Inappropriate ioctl for device
+ chmod -R u+rwX /tmp/B.2b555951-3c05-4347-8e2e-f87fed732a1b/BUILD
+ rm -rf /tmp/B.2b555951-3c05-4347-8e2e-f87fed732a1b/tmp /tmp/B.2b555951-3c05-4347-8e2e-f87fed732a1b/BUILD
mesg: ttyname failed: Inappropriate ioctl for device
+ rm -rf /tmp/B.2b555951-3c05-4347-8e2e-f87fed732a1b
Begin-PLD-Builder-Info
Build-Time: user:2.95s sys:0.50s real:9.00s (faults io:0 non-io:831826)

End-PLD-Builder-Info
[Back to list of logs] [View rpm -qa of builder]